{"text_format":"1","workbook":"xlsx","n_sheets":8,"sheets":["検索","更新履歴","詳細版","簡易版","DB","仕様の整理","条件","同意書"],"not_rendered":{"charts":0,"images":11,"macros":1,"external_links":0,"defined_names":12,"comments":0,"pivot_tables":0},"unopened":[],"bounds":{"document_bytes":16777216,"sheet_cells":100000,"rows_first":2000,"rows_last":500,"rows_between":2000,"halvings":0,"cell_chars":16384,"cell_head_chars":4096},"cells_cut":0,"cells_raw":0,"read":"whole","date_system":"1900"}

{"sheet":"検索","index":0,"n_rows":32,"n_cols":641,"rows_kept":32,"cut":false,"hidden":false,"merged":[[34,1,34,3],[34,6,34,12],[3,13,3,14]]}
[null,null,null,null,null,null,null,null,null,null,null,null,"Ver.",2.85,null,"借用同意書：",null,"問い合わせ先："," kouhouhikakuhyou-db@kyugikyo.or.jp",null,"条件検索"]
[null,null,null,null,null,null,null,null,null,null,null,1,"令和7年8月","○",null,"ご利用期間：","2026-02-10","～",{"$f":"IF(Q2=\"\",\"\",EOMONTH(Q2, 0))","v":"2026-02-28"},null,null,null,null,null,null,null,null,null,null,null,null,null,null,null,null,null,null,null,null,null,null,null,null,null,null,null,null,null,null,null,null,null,null,null,null,null,null,null,null,null,null,null,null,null,null,null,null,null,null,null,null,3,"令和7年8月","○",null,null,null,null,null,null,null,null,null,null,null,null,null,null,null,null,null,null,null,null,null,null,null,null,null,null,"印刷",4,"令和7年8月","○",null,null,null,null,null,null,null,null,null,null,null,null,null,null,null,null,null,null,null,null,null,null,null,null,null,null,null,5,"令和7年8月","○",null,null,null,null,null,null,null,null,null,null,null,null,null,null,null,null,null,null,null,null,null,null,null,null,null,null,null,6,"令和7年8月","○",null,null,null,null,null,null,null,null,null,null,null,null,null,null,null,null,null,null,null,null,null,null,null,null,null,null,"印刷",7,"令和7年8月","○",null,null,null,null,null,null,null,null,null,null,null,null,null,null,null,null,null,null,null,null,null,null,null,null,null,null,null,8,"令和7年8月","○",null,null,null,null,null,null,null,null,null,null,null,null,null,null,null,null,null,null,null,null,null,null,null,null,null,null,null,9,"令和7年8月","○",null,null,null,null,null,null,null,null,null,null,null,null,null,null,null,null,null,null,null,null,null,null,null,null,null,null,"印刷",10,"令和7年8月","○",null,null,null,null,null,null,null,null,null,null,null,null,null,null,null,null,null,null,null,null,null,null,null,null,null,null,null,11,"令和7年8月","○",null,null,null,null,null,null,null,null,null,null,null,null,null,null,null,null,null,null,null,null,null,null,null,null,null,null,null,12,"令和7年8月","○",null,null,null,null,null,null,null,null,null,null,null,null,null,null,null,null,null,null,null,null,null,null,null,null,null,null,"印刷",13,"令和7年8月","○",null,null,null,null,null,null,null,null,null,null,null,null,null,null,null,null,null,null,null,null,null,null,null,null,null,null,null,14,"令和7年8月","○",null,null,null,null,null,null,null,null,null,null,null,null,null,null,null,null,null,null,null,null,null,null,null,null,null,null,null,15,"令和7年8月","○",null,null,null,null,null,null,null,null,null,null,null,null,null,null,null,null,null,null,null,null,null,null,null,null,null,null,"印刷",16,"令和7年8月","○",null,null,null,null,null,null,null,null,null,null,null,null,null,null,null,null,null,null,null,null,null,null,null,null,null,null,null,17,"令和7年8月","○",null,null,null,null,null,null,null,null,null,null,null,null,null,null,null,null,null,null,null,null,null,null,null,null,null,null,null,18,"令和7年8月","○",null,null,null,null,null,null,null,null,null,null,null,null,null,null,null,null,null,null,null,null,null,null,null,null,null,null,"印刷",19,"令和6年9月","○",null,null,null,null,null,null,null,null,null,null,null,null,null,null,null,null,null,null,null,null,null,null,null,null,null,null,null,20,"令和6年9月","○",null,null,null,null,null,null,null,null,null,null,null,null,null,null,null,null,null,null,null,null,null,null,null,null,null,null,null,null,null,null,null,null,null,null,null,null,null,null,null,null,null,null,null,null,null,null,null,null,null,null,null,null,null,null,null,null,"印刷"]
[null,null,null,null,null,null,null,null,null,null,null,null,null,null,null,{"$f":"仕様の整理!F1","v":"9技術20仕様"},{"$f":"仕様の整理!H1","v":"1技術1仕様"},{"$f":"\"検索結果：全\"&$P$3&\"の内、\"&$Q$3&\"が検索されました。\"","v":"検索結果：全9技術20仕様の内、1技術1仕様が検索されました。"},{"$f":"_xlfn.TEXTJOIN(\"／\",,T5,T6,T7,T8,T20)","v":"改良深度：10m／土質：粘性土／九州のフィールドへの適応性：特に指定しない／現場条件："}]
["本システムは、毎月NETIS情報を確認し、追加があれば更新していきますので、最新版を入手してお使いください。",null,null,null,null,null,null,null,null,null,null,null,null,"令和8年1月現在",null,null,null,null,{"$f":"\"工法比較表検索結果[\"&$P$3&\"の内、\"&$Q$3&\"]\"","v":"工法比較表検索結果[9技術20仕様の内、1技術1仕様]"}]
[null,null,null,null,null,null,null,null,null,null,null,null,null,null,null,null,"改良深度：",1,{"$f":"IF(R5=1,10,IF(R5=2,20))","v":10},{"$f":"Q5&S5&\"m\"","v":"改良深度：10m"}]
[null,null,null,null,null,null,null,null,null,null,null,null,null,null,null,null,"土質：",1,{"$f":"IF(R6=1,\"粘性土\",IF(R6=2,\"砂質土\",\"\"))","v":"粘性土"},{"$f":"Q6&S6","v":"土質：粘性土"}]
[null,null,null,null,null,null,null,null,null,null,null,null,null,null,null,null,"九州のフィールドへの適応性：",1,{"$f":"IF(R7=1,\"特に指定しない\",IF(R7=2,\"有\",IF(R7=3,\"無\",\"\")))","v":"特に指定しない"},{"$f":"Q7&S7","v":"九州のフィールドへの適応性：特に指定しない"}]
[null,null,null,null,null,null,null,null,null,null,null,null,null,null,null,null,"現場条件：",null,null,{"$f":"Q8&_xlfn.TEXTJOIN(\",\",,T9,T10,T11,T12,T13,T14)","v":"現場条件："}]
[null,null,null,null,null,null,null,null,null,null,null,null,null,null,null,null,"改良深度が25ｍ以上",false,{"$f":"IF(R9=TRUE,\"○\",\"\")","v":""},{"$f":"IF(R9=TRUE,Q9,\"\")","v":""}]
[null,null,null,null,null,null,null,null,null,null,null,null,null,null,null,null,"重要構造物の近接施工",false,{"$f":"IF(R10=TRUE,\"○\",\"\")","v":""},{"$f":"IF(R10=TRUE,Q10,\"\")","v":""}]
[null,null,null,null,null,null,null,null,null,null,null,null,null,null,null,null,"高い遮水性が要求される場合",false,"",""]
[null,null,null,null,null,null,null,null,null,null,null,null,null,null,null,null,"大規模開削の底盤改良",false,"",""]
[null,null,null,null,null,null,null,null,null,null,null,null,null,null,null,null,"特に高い耐久性を要求する場合",false,"",""]
[null,null,null,null,null,null,null,null,null,null,null,null,null,null,null,null,"構造物直下の地盤改良（曲がり削孔工法）",false,"",""]
[]
[]
[]
[]
[]
[null,null,null,null,null,null,null,null,null,null,null,null,null,null,null,null,"発注者ニーズへの適応性：",1,{"$f":"IF(R20=1,\"優れている\",IF(R20=2,\"同等以上\",\"\"))","v":"優れている"},{"$f":"IF(COUNTIF(S21:S25,\"✓\")>0, Q20&S20&\"（\"&_xlfn.TEXTJOIN(\"、\",,T21,T22,T23,T24,T25)&\"）\", \"\")","v":""}]
[null,null,null,null,null,null,null,null,null,null,null,null,null,null,null,null,"周辺地盤への変位抑制",false,{"$f":"IF(R21=TRUE,\"✓\",\"\")","v":""},{"$f":"IF(R21=TRUE,Q21,\"\")","v":""}]
[null,null,null,null,null,null,null,null,null,null,null,null,null,null,null,null,"騒音・振動の低減",false,{"$f":"IF(R22=TRUE,\"✓\",\"\")","v":""},{"$f":"IF(R22=TRUE,Q22,\"\")","v":""}]
[null,null,null,null,null,null,null,null,null,null,null,null,null,null,null,null,"狭隘な現場での施工性",false,{"$f":"IF(R23=TRUE,\"✓\",\"\")","v":""},""]
[null,null,null,null,null,null,null,null,null,null,null,null,null,null,null,null,"軟弱地盤上での施工性（トラフィカビリティ）",false,{"$f":"IF(R24=TRUE,\"✓\",\"\")","v":""},""]
[null,null,null,null,null,null,null,null,null,null,null,null,null,null,null,null,"省人化・省力化",false,{"$f":"IF(R25=TRUE,\"✓\",\"\")","v":""},""]
[null,null,null,null,null,null,null,null,null,null,null,null,null,null,null,null,null,null,""]
[]
[]
[]
[]
[]
["新技術の検索"]

{"sheet":"更新履歴","index":1,"n_rows":291,"n_cols":3,"rows_kept":291,"cut":false,"hidden":false,"merged":[]}
[null,"■更新履歴"]
[null,"2018/03/15\n＜Ver1.00＞"]
[null,"・Ver1.00アップロード"]
[]
[null,"2018/04/27\n＜Ver1.04＞"]
[null,"・検索画面を修正"]
[]
[null,1,"令和7年8月"]
[null,2,"令和7年8月"]
[null,3,"令和7年8月"]
[null,4,"令和7年8月"]
[null,5,"令和7年8月"]
[null,6,"令和7年8月"]
[null,7,"令和7年8月"]
[null,8,"令和7年8月"]
[null,9,"令和7年8月"]
[null,10,"令和7年8月"]
[null,11,"令和7年8月"]
[null,12,"令和7年8月"]
[null,13,"令和7年8月"]
[null,14,"令和7年8月"]
[null,15,"令和7年8月"]
[null,16,"令和7年8月"]
[null,17,"令和7年8月"]
[null,18,"令和7年8月"]
[null,19,"令和6年9月"]
[null,20,"令和6年9月"]
[]
[null,"2018/11/30\n＜Ver1.11＞"]
[null,"・新規登録は無し。"]
[]
[null,"2018/12/25\n＜Ver1.12＞"]
[null,"・新規登録は無し。"]
[]
[null,"2019/1/31\n＜Ver1.13＞"]
[null,"・NETIS登録状況を確認し1技術を新規登録しました（NETIS申請情報のみ）。"]
[null,"・NETIS掲載期間終了技術（有用な新技術、活用の多い技術以外）を1技術削除しました。"]
[]
[null,"2019/2/28\n＜Ver1.14＞"]
[null,"・新規登録は無し。"]
[]
[null,"2019/3/29\n＜Ver1.15＞"]
[null,"・新規登録は無し。"]
[]
[null,"2019/04/26\n＜Ver1.15からVer2.04への変更点について＞"]
[null,"・新規登録は無し。"]
[]
[null,"2019/05/31\n＜Ver2.05＞"]
[null,"・新規登録は無し。"]
[]
[null,"2019/06/28\n＜Ver2.06＞"]
[null,"・NETIS登録状況を確認し2技術を新規登録しました（NETIS申請情報のみ）。"]
[]
[null,"2019/07/31\n＜Ver2.07＞"]
[null,"・新規登録は無し。"]
[]
[null,"2019/08/30\n＜Ver2.08＞"]
[null,"・新規登録は無し。"]
[]
[null,"2019/09/30\n＜Ver2.09＞"]
[null,"・新規登録は無し。"]
[]
[null,"2019/10/31\n＜Ver2.10＞"]
[null,"・新規登録は無し。"]
[]
[null,"2019/11/29\n＜Ver2.11＞"]
[null,"・新規登録は無し。"]
[]
[null,"2019/12/31\n＜Ver2.12＞"]
[null,"・新規登録は無し。"]
[]
[null,"2020/01/31\n＜Ver2.13＞"]
[null,"・新規登録は無し。"]
[]
[null,"2020/02/28\n＜Ver2.14＞"]
[null,"・新規登録は無し。"]
[]
[null,"2020/03/31\n＜Ver2.15＞"]
[null,"・新規登録は無し。"]
[]
[null,"2020/04/30\n＜Ver2.16＞"]
[null,"・新規登録は無し。"]
[]
[null,"2020/05/29\n＜Ver2.17＞"]
[null,"・新規登録は無し。"]
[]
[null,"2020/06/30\n＜Ver2.18＞"]
[null,"・新規登録は無し。"]
[]
[null,"2020/07/31\n＜Ver2.19＞"]
[null,"・新規登録は無し。"]
[]
[null,"2020/08/31\n＜Ver2.20＞"]
[null,"・新規登録は無し。"]
[]
[null,"2020/09/30\n＜Ver2.21＞"]
[null,"・NETIS登録状況を確認し1技術を新規登録しました（NETIS申請情報のみ）。"]
[]
[null,"2020/10/31\n＜Ver2.22＞"]
[null,"・新規登録は無し。"]
[]
[null,"2020/11/30\n＜Ver2.23＞"]
[null,"・新規登録は無し。"]
[]
[null,"2020/12/31\n＜Ver2.24＞"]
[null,"・新規登録は無し。"]
[]
[null,"2021/1/31\n＜Ver2.25＞"]
[null,"・新規登録は無し。"]
[]
[null,"2021/2/26\n＜Ver2.26＞"]
[null,"・新規登録は無し。"]
[]
[null,"2021/3/31\n＜Ver2.27＞"]
[null,"・新規登録は無し。"]
[]
[null,"2021/4/30\n＜Ver2.28＞"]
[null,"・新規登録は無し。"]
[]
[null,"2021/5/31\n＜Ver2.29＞"]
[null,"・新規登録は無し。"]
[]
[null,"2021/6/30\n＜Ver2.30＞"]
[null,"・新規登録は無し。"]
[]
[null,"2021/7/31\n＜Ver2.31＞"]
[null,"・新規登録は無し。"]
[]
[null,"2021/8/31\n＜Ver2.32＞"]
[null,"・新規登録は無し。"]
[]
[null,"2021/9/30\n＜Ver2.33＞"]
[null,"・新規登録は無し。"]
[]
[null,"2021/10/31\n＜Ver2.34＞"]
[null,"・新規登録は無し。"]
[]
[null,"2021/11/30\n＜Ver2.35＞"]
[null,"・新規登録は無し。"]
[]
[null,"2021/12/31\n＜Ver2.36＞"]
[null,"・新規登録は無し。"]
[]
[null,"2022/1/31\n＜Ver2.37＞"]
[null,"・新規登録は無し。"]
[]
[null,"2022/2/28\n＜Ver2.38＞"]
[null,"・新規登録は無し。"]
[]
[null,"2022/3/31\n＜Ver2.39＞"]
[null,"・新規登録は無し。"]
[]
[null,"2022/4/30\n＜Ver2.40＞"]
[null,"・新規登録は無し。"]
[]
[null,"2022/5/31\n＜Ver2.41＞"]
[null,"・NETIS登録状況を確認し1技術を新規登録しました（NETIS申請情報のみ）。"]
[]
[null,"2022/6/30\n＜Ver2.42＞"]
[null,"・新規登録は無し。"]
[]
[null,"2022/7/31\n＜Ver2.43＞"]
[null,"・新規登録は無し。"]
[]
[null,"2022/8/31\n＜Ver2.44＞"]
[null,"・新規登録は無し。"]
[]
[null,"2022/9/30\n＜Ver2.45＞"]
[null,"・新規登録は無し。"]
[]
[null,"2022/10/31\n＜Ver2.46＞"]
[null,"・新規登録は無し。"]
[]
[null,"2022/11/30\n＜Ver2.47＞"]
[null,"・新規登録は無し。"]
[]
[null,"2022/12/31\n＜Ver2.48＞"]
[null,"・新規登録は無し。"]
[]
[null,"2023/1/31\n＜Ver2.49＞"]
[null,"・新規登録は無し。"]
[]
[null,"2023/2/28\n＜Ver2.50＞"]
[null,"・NETIS登録状況を確認し1技術を新規登録しました（NETIS申請情報のみ）。"]
[]
[null,"2023/3/31\n＜Ver2.51＞"]
[null,"・新規登録は無し。"]
[]
[null,"2023/4/30\n＜Ver2.52＞"]
[null,"・新規登録は無し。"]
[]
[null,"2023/5/31\n＜Ver2.53＞"]
[null,"・新規登録は無し。"]
[]
[null,"2023/6/30\n＜Ver2.54＞"]
[null,"・新規登録は無し。"]
[]
[null,"2023/7/31\n＜Ver2.55＞"]
[null,"・新規登録は無し。"]
[]
[null,"2023/8/31\n＜Ver2.56＞"]
[null,"・新規登録は無し。"]
[]
[null,"2023/9/30\n＜Ver2.57＞"]
[null,"・新規登録は無し。"]
[]
[null,"2023/10/31\n＜Ver2.58＞"]
[null,"・新規登録は無し。"]
[]
[null,"2023/11/30\n＜Ver2.59＞"]
[null,"・新規登録は無し。"]
[]
[null,"2023/12/31\n＜Ver2.60＞"]
[null,"・新規登録は無し。"]
[]
[null,"2024/1/31\n＜Ver2.61＞"]
[null,"・新規登録は無し。"]
[]
[null,"2024/2/29\n＜Ver2.62＞"]
[null,"・新規登録は無し。"]
[]
[null,"2024/3/31\n＜Ver2.63＞"]
[null,"・新規登録は無し。"]
[]
[null,"2024/4/30\n＜Ver2.64＞"]
[null,"・新規登録は無し。"]
[]
[null,"2024/5/31\n＜Ver2.65＞"]
[null,"・新規登録は無し。"]
[]
[null,"2024/6/30\n＜Ver2.66＞"]
[null,"・新規登録は無し。"]
[]
[null,"2024/7/31\n＜Ver2.67＞"]
[null,"・新規登録は無し。"]
[]
[null,"2024/8/31\n＜Ver2.68＞"]
[null,"・新規登録は無し。"]
[]
[null,"2024/9/30\n＜Ver2.69＞"]
[null,"・NETIS登録状況を確認し1技術を新規登録しました（NETIS申請情報のみ）。"]
[]
[null,"2024/10/31\n＜Ver2.70＞"]
[null,"・新規登録は無し。"]
[null,"・施工費用および施工日数等を令和6年度の情報に更新"]
[]
[null,"2024/11/30\n＜Ver2.71＞"]
[null,"・新規登録は無し。"]
[]
[null,"2024/12/31\n＜Ver2.72＞"]
[null,"・新規登録は無し。"]
[]
[null,"2025/1/31\n＜Ver2.73＞"]
[null,"・新規登録は無し。"]
[]
[null,"2025/2/28\n＜Ver2.74＞"]
[null,"・新規登録は無し。"]
[]
[null,"2025/3/31\n＜Ver2.75＞"]
[null,"・新規登録は無し。"]
[]
[null,"2025/4/30\n＜Ver2.76＞"]
[null,"・新規登録は無し。"]
[]
[null,"2025/5/31\n＜Ver2.77＞"]
[null,"・新規登録は無し。"]
[]
[null,"2025/6/30\n＜Ver2.78＞"]
[null,"・新規登録は無し。"]
[]
[null,"2025/7/31\n＜Ver2.79＞"]
[null,"・新規登録は無し。"]
[]
[null,"2025/8/31\n＜Ver2.80＞"]
[null,"・新規登録は無し。"]
[null,"・施工費用および施工日数等を令和7年度の情報に更新"]
[]
[null,"2025/9/30\n＜Ver2.81＞"]
[null,"・新規登録は無し。"]
[]
[null,"2025/10/31\n＜Ver2.82＞"]
[null,"・新規登録は無し。"]
[]
[null,"2025/11/30\n＜Ver2.83＞"]
[null,"・新規登録は無し。"]
[]
[null,"2025/12/31\n＜Ver2.84＞"]
[null,"・新規登録は無し。"]
[]
[null,"2026/1/31\n＜Ver2.85＞"]
[null,"・新規登録は無し。"]

{"sheet":"詳細版","index":2,"n_rows":68,"n_cols":5,"rows_kept":68,"cut":false,"hidden":false,"merged":[[2,41,2,42],[2,43,2,44],[3,0,3,4],[66,43,66,44],[66,45,66,46],[66,47,66,48],[66,49,66,50],[66,51,66,52],[66,53,66,54],[2,5,2,6],[2,7,2,8],[2,9,2,10],[2,11,2,12],[2,13,2,14],[2,15,2,16],[2,17,2,18],[2,19,2,20],[2,21,2,22],[2,23,2,24],[2,25,2,26],[2,27,2,28],[2,29,2,30],[2,31,2,32],[2,33,2,34],[2,35,2,36],[2,37,2,38],[2,39,2,40],[65,43,65,44],[65,45,65,46],[65,47,65,48],[65,49,65,50],[66,7,66,8],[66,9,66,10],[66,11,66,12],[66,13,66,14],[66,15,66,16],[66,17,66,18],[66,19,66,20],[66,21,66,22],[66,23,66,24],[66,25,66,26],[66,27,66,28],[66,29,66,30],[66,31,66,32],[66,33,66,34],[66,35,66,36],[66,37,66,38],[66,39,66,40],[66,41,66,42],[64,51,64,52],[64,53,64,54],[65,7,65,8],[65,9,65,10],[65,11,65,12],[65,13,65,14],[65,15,65,16],[65,17,65,18],[65,19,65,20],[65,21,65,22],[65,23,65,24],[65,25,65,26],[65,27,65,28],[65,29,65,30],[65,31,65,32],[65,33,65,34],[65,35,65,36],[65,37,65,38],[65,39,65,40],[65,41,65,42],[65,53,65,54],[65,51,65,52],[64,7,64,8],[64,9,64,10],[64,11,64,12],[64,13,64,14],[64,15,64,16],[64,17,64,18],[64,19,64,20],[64,21,64,22],[64,23,64,24],[64,25,64,26],[64,27,64,28],[64,29,64,30],[64,31,64,32],[64,33,64,34],[64,35,64,36],[64,37,64,38],[64,39,64,40],[62,41,62,42],[62,43,62,44],[62,45,62,46],[62,47,62,48],[62,49,62,50],[62,19,62,20],[62,21,62,22],[62,23,62,24],[62,25,62,26],[62,27,62,28],[62,29,62,30],[62,31,62,32],[62,33,62,34],[62,35,62,36],[62,37,62,38],[62,39,62,40],[64,41,64,42],[64,43,64,44],[64,45,64,46],[64,47,64,48],[64,49,64,50],[62,51,62,52],[62,53,62,54],[63,7,63,8],[63,9,63,10],[63,11,63,12],[63,13,63,14],[63,15,63,16],[63,17,63,18],[63,19,63,20],[63,21,63,22],[63,23,63,24],[63,25,63,26],[63,27,63,28],[63,29,63,30],[63,31,63,32],[63,33,63,34],[63,35,63,36],[63,37,63,38],[63,39,63,40],[63,41,63,42],[63,43,63,44],[63,45,63,46],[63,47,63,48],[63,49,63,50],[63,51,63,52],[63,53,63,54],[62,7,62,8],[62,9,62,10],[62,11,62,12],[62,13,62,14],[62,15,62,16],[62,17,62,18],[60,41,60,42],[60,43,60,44],[60,45,60,46],[60,47,60,48],[60,49,60,50],[60,51,60,52],[60,53,60,54],[61,7,61,8],[61,9,61,10],[61,11,61,12],[61,13,61,14],[61,15,61,16],[61,17,61,18],[61,19,61,20],[61,21,61,22],[61,23,61,24],[61,25,61,26],[61,27,61,28],[61,29,61,30],[61,31,61,32],[61,33,61,34],[61,35,61,36],[61,37,61,38],[61,39,61,40],[61,41,61,42],[61,43,61,44],[61,45,61,46],[61,47,61,48],[61,49,61,50],[61,51,61,52],[61,53,61,54],[60,7,60,8],[60,9,60,10],[60,11,60,12],[60,13,60,14],[60,15,60,16],[60,17,60,18],[60,19,60,20],[60,21,60,22],[60,23,60,24],[60,25,60,26],[60,27,60,28],[60,29,60,30],[60,31,60,32],[60,33,60,34],[60,35,60,36],[60,37,60,38],[60,39,60,40],[58,41,58,42],[58,11,58,12],[58,13,58,14],[58,15,58,16],[58,17,58,18],[58,19,58,20],[58,21,58,22],[58,23,58,24],[58,25,58,26],[58,27,58,28],[58,29,58,30],[58,31,58,32],[58,33,58,34],[58,35,58,36],[58,37,58,38],[58,39,58,40],[58,43,58,44],[58,45,58,46],[58,47,58,48],[58,49,58,50],[58,51,58,52],[58,53,58,54],[59,7,59,8],[59,9,59,10],[59,11,59,12],[59,13,59,14],[59,15,59,16],[59,17,59,18],[59,19,59,20],[59,21,59,22],[59,23,59,24],[59,25,59,26],[59,27,59,28],[59,29,59,30],[59,31,59,32],[59,33,59,34],[59,35,59,36],[59,37,59,38],[59,39,59,40],[59,41,59,42],[59,43,59,44],[59,45,59,46],[59,47,59,48],[59,49,59,50],[59,51,59,52],[59,53,59,54],[58,7,58,8],[58,9,58,10],[56,41,56,42],[56,43,56,44],[56,45,56,46],[56,47,56,48],[56,49,56,50],[56,51,56,52],[56,53,56,54],[57,7,57,8],[57,9,57,10],[57,11,57,12],[57,13,57,14],[57,15,57,16],[57,17,57,18],[57,19,57,20],[57,21,57,22],[57,23,57,24],[57,25,57,26],[57,27,57,28],[57,29,57,30],[57,31,57,32],[57,33,57,34],[57,35,57,36],[57,37,57,38],[57,39,57,40],[57,41,57,42],[57,43,57,44],[57,45,57,46],[57,47,57,48],[57,49,57,50],[57,51,57,52],[57,53,57,54],[56,7,56,8],[56,9,56,10],[56,11,56,12],[56,13,56,14],[56,15,56,16],[56,17,56,18],[56,19,56,20],[56,21,56,22],[56,23,56,24],[56,25,56,26],[56,27,56,28],[56,29,56,30],[56,31,56,32],[56,33,56,34],[56,35,56,36],[56,37,56,38],[56,39,56,40],[54,41,54,42],[54,11,54,12],[54,13,54,14],[54,15,54,16],[54,17,54,18],[54,19,54,20],[54,21,54,22],[54,23,54,24],[54,25,54,26],[54,27,54,28],[54,29,54,30],[54,31,54,32],[54,33,54,34],[54,35,54,36],[54,37,54,38],[54,39,54,40],[54,43,54,44],[54,45,54,46],[54,47,54,48],[54,49,54,50],[54,51,54,52],[54,53,54,54],[55,7,55,8],[55,9,55,10],[55,11,55,12],[55,13,55,14],[55,15,55,16],[55,17,55,18],[55,19,55,20],[55,21,55,22],[55,23,55,24],[55,25,55,26],[55,27,55,28],[55,29,55,30],[55,31,55,32],[55,33,55,34],[55,35,55,36],[55,37,55,38],[55,39,55,40],[55,41,55,42],[55,43,55,44],[55,45,55,46],[55,47,55,48],[55,49,55,50],[55,51,55,52],[55,53,55,54],[54,7,54,8],[54,9,54,10],[52,41,52,42],[52,43,52,44],[52,45,52,46],[52,47,52,48],[52,49,52,50],[52,51,52,52],[52,53,52,54],[53,7,53,8],[53,9,53,10],[53,11,53,12],[53,13,53,14],[53,15,53,16],[53,17,53,18],[53,19,53,20],[53,21,53,22],[53,23,53,24],[53,25,53,26],[53,27,53,28],[53,29,53,30],[53,31,53,32],[53,33,53,34],[53,35,53,36],[53,37,53,38],[53,39,53,40],[53,41,53,42],[53,43,53,44],[53,45,53,46],[53,47,53,48],[53,49,53,50],[53,51,53,52],[53,53,53,54],[52,7,52,8],[52,9,52,10],[52,11,52,12],[52,13,52,14],[52,15,52,16],[52,17,52,18],[52,19,52,20],[52,21,52,22],[52,23,52,24],[52,25,52,26],[52,27,52,28],[52,29,52,30],[52,31,52,32],[52,33,52,34],[52,35,52,36],[52,37,52,38],[52,39,52,40],[50,41,50,42],[50,11,50,12],[50,13,50,14],[50,15,50,16],[50,17,50,18],[50,19,50,20],[50,21,50,22],[50,23,50,24],[50,25,50,26],[50,27,50,28],[50,29,50,30],[50,31,50,32],[50,33,50,34],[50,35,50,36],[50,37,50,38],[50,39,50,40],[50,43,50,44],[50,45,50,46],[50,47,50,48],[50,49,50,50],[50,51,50,52],[50,53,50,54],[51,7,51,8],[51,9,51,10],[51,11,51,12],[51,13,51,14],[51,15,51,16],[51,17,51,18],[51,19,51,20],[51,21,51,22],[51,23,51,24],[51,25,51,26],[51,27,51,28],[51,29,51,30],[51,31,51,32],[51,33,51,34],[51,35,51,36],[51,37,51,38],[51,39,51,40],[51,41,51,42],[51,43,51,44],[51,45,51,46],[51,47,51,48],[51,49,51,50],[51,51,51,52],[51,53,51,54],[50,7,50,8],[50,9,50,10],[48,41,48,42],[48,43,48,44],[48,45,48,46],[48,47,48,48],[48,49,48,50],[48,51,48,52],[48,53,48,54],[49,7,49,8],[49,9,49,10],[49,11,49,12],[49,13,49,14],[49,15,49,16],[49,17,49,18],[49,19,49,20],[49,21,49,22],[49,23,49,24],[49,25,49,26],[49,27,49,28],[49,29,49,30],[49,31,49,32],[49,33,49,34],[49,35,49,36],[49,37,49,38],[49,39,49,40],[49,41,49,42],[49,43,49,44],[49,45,49,46],[49,47,49,48],[49,49,49,50],[49,51,49,52],[49,53,49,54],[48,7,48,8],[48,9,48,10],[48,11,48,12],[48,13,48,14],[48,15,48,16],[48,17,48,18],[48,19,48,20],[48,21,48,22],[48,23,48,24],[48,25,48,26],[48,27,48,28],[48,29,48,30],[48,31,48,32],[48,33,48,34],[48,35,48,36],[48,37,48,38],[48,39,48,40],[46,41,46,42],[46,11,46,12],[46,13,46,14],[46,15,46,16],[46,17,46,18],[46,19,46,20],[46,21,46,22],[46,23,46,24],[46,25,46,26],[46,27,46,28],[46,29,46,30],[46,31,46,32],[46,33,46,34],[46,35,46,36],[46,37,46,38],[46,39,46,40],[46,43,46,44],[46,45,46,46],[46,47,46,48],[46,49,46,50],[46,51,46,52],[46,53,46,54],[47,7,47,8],[47,9,47,10],[47,11,47,12],[47,13,47,14],[47,15,47,16],[47,17,47,18],[47,19,47,20],[47,21,47,22],[47,23,47,24],[47,25,47,26],[47,27,47,28],[47,29,47,30],[47,31,47,32],[47,33,47,34],[47,35,47,36],[47,37,47,38],[47,39,47,40],[47,41,47,42],[47,43,47,44],[47,45,47,46],[47,47,47,48],[47,49,47,50],[47,51,47,52],[47,53,47,54],[46,7,46,8],[46,9,46,10],[44,41,44,42],[44,43,44,44],[44,45,44,46],[44,47,44,48],[44,49,44,50],[44,51,44,52],[44,53,44,54],[45,7,45,8],[45,9,45,10],[45,11,45,12],[45,13,45,14],[45,15,45,16],[45,17,45,18],[45,19,45,20],[45,21,45,22],[45,23,45,24],[45,25,45,26],[45,27,45,28],[45,29,45,30],[45,31,45,32],[45,33,45,34],[45,35,45,36],[45,37,45,38],[45,39,45,40],[45,41,45,42],[45,43,45,44],[45,45,45,46],[45,47,45,48],[45,49,45,50],[45,51,45,52],[45,53,45,54],[44,7,44,8],[44,9,44,10],[44,11,44,12],[44,13,44,14],[44,15,44,16],[44,17,44,18],[44,19,44,20],[44,21,44,22],[44,23,44,24],[44,25,44,26],[44,27,44,28],[44,29,44,30],[44,31,44,32],[44,33,44,34],[44,35,44,36],[44,37,44,38],[44,39,44,40],[31,41,31,42],[31,11,31,12],[31,13,31,14],[31,15,31,16],[31,17,31,18],[31,19,31,20],[31,21,31,22],[31,23,31,24],[31,25,31,26],[31,27,31,28],[31,29,31,30],[31,31,31,32],[31,33,31,34],[31,35,31,36],[31,37,31,38],[31,39,31,40],[31,43,31,44],[31,45,31,46],[31,47,31,48],[31,49,31,50],[31,51,31,52],[31,53,31,54],[43,7,43,8],[43,9,43,10],[43,11,43,12],[43,13,43,14],[43,15,43,16],[43,17,43,18],[43,19,43,20],[43,21,43,22],[43,23,43,24],[43,25,43,26],[43,27,43,28],[43,29,43,30],[43,31,43,32],[43,33,43,34],[43,35,43,36],[43,37,43,38],[43,39,43,40],[43,41,43,42],[43,43,43,44],[43,45,43,46],[43,47,43,48],[43,49,43,50],[43,51,43,52],[43,53,43,54],[31,7,31,8],[31,9,31,10],[29,41,29,42],[29,43,29,44],[29,45,29,46],[29,47,29,48],[29,49,29,50],[29,51,29,52],[29,53,29,54],[30,7,30,8],[30,9,30,10],[30,11,30,12],[30,13,30,14],[30,15,30,16],[30,17,30,18],[30,19,30,20],[30,21,30,22],[30,23,30,24],[30,25,30,26],[30,27,30,28],[30,29,30,30],[30,31,30,32],[30,33,30,34],[30,35,30,36],[30,37,30,38],[30,39,30,40],[30,41,30,42],[30,43,30,44],[30,45,30,46],[30,47,30,48],[30,49,30,50],[30,51,30,52],[30,53,30,54],[29,7,29,8],[29,9,29,10],[29,11,29,12],[29,13,29,14],[29,15,29,16],[29,17,29,18],[29,19,29,20],[29,21,29,22],[29,23,29,24],[29,25,29,26],[29,27,29,28],[29,29,29,30],[29,31,29,32],[29,33,29,34],[29,35,29,36],[29,37,29,38],[29,39,29,40],[27,41,27,42],[27,11,27,12],[27,13,27,14],[27,15,27,16],[27,17,27,18],[27,19,27,20],[27,21,27,22],[27,23,27,24],[27,25,27,26],[27,27,27,28],[27,29,27,30],[27,31,27,32],[27,33,27,34],[27,35,27,36],[27,37,27,38],[27,39,27,40],[27,43,27,44],[27,45,27,46],[27,47,27,48],[27,49,27,50],[27,51,27,52],[27,53,27,54],[28,7,28,8],[28,9,28,10],[28,11,28,12],[28,13,28,14],[28,15,28,16],[28,17,28,18],[28,19,28,20],[28,21,28,22],[28,23,28,24],[28,25,28,26],[28,27,28,28],[28,29,28,30],[28,31,28,32],[28,33,28,34],[28,35,28,36],[28,37,28,38],[28,39,28,40],[28,41,28,42],[28,43,28,44],[28,45,28,46],[28,47,28,48],[28,49,28,50],[28,51,28,52],[28,53,28,54],[27,7,27,8],[27,9,27,10],[25,41,25,42],[25,43,25,44],[25,45,25,46],[25,47,25,48],[25,49,25,50],[25,51,25,52],[25,53,25,54],[26,7,26,8],[26,9,26,10],[26,11,26,12],[26,13,26,14],[26,15,26,16],[26,17,26,18],[26,19,26,20],[26,21,26,22],[26,23,26,24],[26,25,26,26],[26,27,26,28],[26,29,26,30],[26,31,26,32],[26,33,26,34],[26,35,26,36],[26,37,26,38],[26,39,26,40],[26,41,26,42],[26,43,26,44],[26,45,26,46],[26,47,26,48],[26,49,26,50],[26,51,26,52],[26,53,26,54],[25,7,25,8],[25,9,25,10],[25,11,25,12],[25,13,25,14],[25,15,25,16],[25,17,25,18],[25,19,25,20],[25,21,25,22],[25,23,25,24],[25,25,25,26],[25,27,25,28],[25,29,25,30],[25,31,25,32],[25,33,25,34],[25,35,25,36],[25,37,25,38],[25,39,25,40],[23,41,23,42],[23,11,23,12],[23,13,23,14],[23,15,23,16],[23,17,23,18],[23,19,23,20],[23,21,23,22],[23,23,23,24],[23,25,23,26],[23,27,23,28],[23,29,23,30],[23,31,23,32],[23,33,23,34],[23,35,23,36],[23,37,23,38],[23,39,23,40],[23,43,23,44],[23,45,23,46],[23,47,23,48],[23,49,23,50],[23,51,23,52],[23,53,23,54],[24,7,24,8],[24,9,24,10],[24,11,24,12],[24,13,24,14],[24,15,24,16],[24,17,24,18],[24,19,24,20],[24,21,24,22],[24,23,24,24],[24,25,24,26],[24,27,24,28],[24,29,24,30],[24,31,24,32],[24,33,24,34],[24,35,24,36],[24,37,24,38],[24,39,24,40],[24,41,24,42],[24,43,24,44],[24,45,24,46],[24,47,24,48],[24,49,24,50],[24,51,24,52],[24,53,24,54],[23,7,23,8],[23,9,23,10],[21,41,21,42],[21,43,21,44],[21,45,21,46],[21,47,21,48],[21,49,21,50],[21,51,21,52],[21,53,21,54],[22,7,22,8],[22,9,22,10],[22,11,22,12],[22,13,22,14],[22,15,22,16],[22,17,22,18],[22,19,22,20],[22,21,22,22],[22,23,22,24],[22,25,22,26],[22,27,22,28],[22,29,22,30],[22,31,22,32],[22,33,22,34],[22,35,22,36],[22,37,22,38],[22,39,22,40],[22,41,22,42],[22,43,22,44],[22,45,22,46],[22,47,22,48],[22,49,22,50],[22,51,22,52],[22,53,22,54],[21,7,21,8],[21,9,21,10],[21,11,21,12],[21,13,21,14],[21,15,21,16],[21,17,21,18],[21,19,21,20],[21,21,21,22],[21,23,21,24],[21,25,21,26],[21,27,21,28],[21,29,21,30],[21,31,21,32],[21,33,21,34],[21,35,21,36],[21,37,21,38],[21,39,21,40],[19,41,19,42],[19,11,19,12],[19,13,19,14],[19,15,19,16],[19,17,19,18],[19,19,19,20],[19,21,19,22],[19,23,19,24],[19,25,19,26],[19,27,19,28],[19,29,19,30],[19,31,19,32],[19,33,19,34],[19,35,19,36],[19,37,19,38],[19,39,19,40],[19,43,19,44],[19,45,19,46],[19,47,19,48],[19,49,19,50],[19,51,19,52],[19,53,19,54],[20,7,20,8],[20,9,20,10],[20,11,20,12],[20,13,20,14],[20,15,20,16],[20,17,20,18],[20,19,20,20],[20,21,20,22],[20,23,20,24],[20,25,20,26],[20,27,20,28],[20,29,20,30],[20,31,20,32],[20,33,20,34],[20,35,20,36],[20,37,20,38],[20,39,20,40],[20,41,20,42],[20,43,20,44],[20,45,20,46],[20,47,20,48],[20,49,20,50],[20,51,20,52],[20,53,20,54],[19,7,19,8],[19,9,19,10],[17,41,17,42],[17,43,17,44],[17,45,17,46],[17,47,17,48],[17,49,17,50],[17,51,17,52],[17,53,17,54],[18,7,18,8],[18,9,18,10],[18,11,18,12],[18,13,18,14],[18,15,18,16],[18,17,18,18],[18,19,18,20],[18,21,18,22],[18,23,18,24],[18,25,18,26],[18,27,18,28],[18,29,18,30],[18,31,18,32],[18,33,18,34],[18,35,18,36],[18,37,18,38],[18,39,18,40],[18,41,18,42],[18,43,18,44],[18,45,18,46],[18,47,18,48],[18,49,18,50],[18,51,18,52],[18,53,18,54],[17,7,17,8],[17,9,17,10],[17,11,17,12],[17,13,17,14],[17,15,17,16],[17,17,17,18],[17,19,17,20],[17,21,17,22],[17,23,17,24],[17,25,17,26],[17,27,17,28],[17,29,17,30],[17,31,17,32],[17,33,17,34],[17,35,17,36],[17,37,17,38],[17,39,17,40],[15,41,15,42],[15,11,15,12],[15,13,15,14],[15,15,15,16],[15,17,15,18],[15,19,15,20],[15,21,15,22],[15,23,15,24],[15,25,15,26],[15,27,15,28],[15,29,15,30],[15,31,15,32],[15,33,15,34],[15,35,15,36],[15,37,15,38],[15,39,15,40],[15,43,15,44],[15,45,15,46],[15,47,15,48],[15,49,15,50],[15,51,15,52],[15,53,15,54],[16,7,16,8],[16,9,16,10],[16,11,16,12],[16,13,16,14],[16,15,16,16],[16,17,16,18],[16,19,16,20],[16,21,16,22],[16,23,16,24],[16,25,16,26],[16,27,16,28],[16,29,16,30],[16,31,16,32],[16,33,16,34],[16,35,16,36],[16,37,16,38],[16,39,16,40],[16,41,16,42],[16,43,16,44],[16,45,16,46],[16,47,16,48]],"merged_total":1398,"flags":["merged_cut"]}
[]
["薬液注入工"]
[{"$f":"検索!S4","v":"工法比較表検索結果[9技術20仕様の内、1技術1仕様]"}]
[""]
["ＮＥＴＩＳ情報","技術名"]
[null,"①","ＮＥＴＩＳ登録番号"]
[null,"②","技術の位置付け（有用な新技術）"]
[null,"③","開発者（本社が存在する都道府県）"]
[null,"④","開発者における九州地方との関連性（九州登録九州本社：◎、\n九州外登録九州本社：○、九州に共同開発者有り：△、その他：－）"]
[null,"⑤","九州地方への機能性（九州地方に支店等を有する場合：○、その他：－）"]
[null,"⑥","技術概要"]
[null,"⑦","概要図"]
[null,"⑧","施工条件・適用条件等","施工方法"]
[null,null,null,"薬液の種類"]
[null,null,null,"改良深度"]
[null,null,null,"土質条件"]
[null,null,null,"適用不可範囲"]
[null,null,null,"改良強度"]
[null,null,null,"作業空間"]
[null,null,null,"施工管理"]
[null,null,null,"周辺地盤等への影響"]
[null,"⑨","比較する従来技術"]
["評価情報","⑩","評価基準","項目"]
[null,null,"・A：従来技術より極めて優れる\n・B：従来技術より優れる\n・C：従来技術と同等\n・D：従来技術より劣る","経済性"]
[null,null,null,"工程"]
[null,null,null,"品質・出来形"]
[null,null,null,"安全性"]
[null,null,null,"施工性"]
[null,null,null,"環境"]
[null,null,null,"総合評価"]
["統一した従来技術"]
["補完資料等からの情報","⑪","工法の特徴"]
[]
[null,"⑫","改良強度"]
[null,"⑬","共通仮設費用（据付・解体費用）"]
[null,"⑭","概算施工費用\n注1）","施工費用"]
[null,null,null,"一次注入材料費"]
[null,null,null,"二次注入材料費"]
[null,null,null,"合計"]
[null,null,null,"標準施工規模"]
[null,"⑮","概算施工日数"]
[null,"⑯","統一した従来技術との比較","経済性"]
[null,null,null,"工程"]
[null,null,"判定の凡例\n○：従来技術より優れる\n△：従来技術と同程度\n－：上記以外","品質・出来形"]
[null,null,null,"安全性"]
[null,null,null,"施工性"]
[null,null,null,"環境"]
[null,"⑰","九州のフィールドへの適応性","施工実績\n（過去３年）","国土交通省：活用効果調査表数"]
[null,null,null,null,"地方自治体：開発者ヒアリング"]
[null,null,null,null,"その他：開発者ヒアリング"]
[null,null,null,"九州管内での活用市町村（直轄工事活用分）"]
[null,null,null,"本工法比較表の仕様における九州地方整備局管内での施工実績の有無"]
[null,null,null,"九州の特殊土壌の施工実績例","シラス"]
[null,null,null,null,"有明粘土"]
[null,null,null,null,"黒ボク・赤ボク等"]
[null,null,null,null,"そうら層（泥炭）"]
[null,null,null,null,"その他（島原焼土等）"]
[null,"⑱","特許等","特許"]
[null,null,null,"建設技術審査証明"]
[null,"⑲","生産供給体制（機械保有台数等）"]
[null,"⑳","備考"]
["発注者ニーズへの適応性","㉑","周辺地盤への変位抑制"]
[null,"㉒","統一した従来技術との比較\n\n判定の凡例\n○：従来技術より優れる\n△：従来技術と同程度\n―：上記以外","騒音・振動の低減"]
[null,null,null,"狭隘な現場での施工性"]
[null,null,null,"軟弱地盤上での施工性（トラフィカビリティ）"]
[null,null,null,"省人化・省力化"]
["㉓",null,"総括"]
["注1）施工費用：2025年4月福岡県久留米市　注2）／：補完調査未実施"]

{"sheet":"簡易版","index":3,"n_rows":6,"n_cols":20,"rows_kept":6,"cut":false,"hidden":false,"merged":[[4,3,5,3],[4,14,4,18],[4,19,5,19],[4,4,5,4],[4,5,5,5],[4,6,5,6],[4,7,5,7],[4,8,4,13],[5,10,5,11],[5,12,5,13]]}
[null,null,null,"薬液注入工"]
[null,null,null,{"$f":"検索!S4","v":"工法比較表検索結果[9技術20仕様の内、1技術1仕様]"}]
[]
[]
[null,null,null,"番号","技術名","NETIS番号","開発者","仕様","統一した従来技術との比較",null,null,null,null,null,"発注者ニーズへの適応性",null,null,null,null,"概要"]
[null,null,null,null,null,null,null,null,"従来技術\n（新技術の仕様に合わせて、土木工事標準積算基準書より算出）","共通仮設費用\n（組立輸送解体費用）","対象改良長当り\n概算施工費用",null,"対象本数当り\n概算施工日数",null,"周辺地盤への変位抑制","騒音・振動の低減","狭隘な現場での施工性","軟弱地盤上での施工性\n（トラフィカビリティ）","省人化・省力化"]

{"sheet":"DB","index":4,"n_rows":78,"n_cols":45,"rows_kept":78,"cut":false,"hidden":false,"merged":[[77,21,77,22],[77,23,77,24],[77,25,77,26],[77,27,77,28],[77,29,77,30],[77,31,77,32],[77,33,77,34],[77,35,77,36],[77,37,77,38],[77,39,77,40],[77,41,77,42],[77,43,77,44],[76,7,76,8],[76,9,76,10],[76,11,76,12],[76,13,76,14],[76,15,76,16],[76,17,76,18],[76,19,76,20],[76,21,76,22],[76,23,76,24],[76,25,76,26],[76,27,76,28],[76,35,76,36],[76,37,76,38],[76,39,76,40],[76,41,76,42],[76,43,76,44],[74,41,74,42],[74,43,74,44],[75,7,75,8],[75,9,75,10],[75,11,75,12],[75,13,75,14],[75,15,75,16],[75,17,75,18],[75,19,75,20],[75,21,75,22],[75,23,75,24],[75,25,75,26],[75,27,75,28],[75,29,75,30],[75,31,75,32],[75,33,75,34],[75,35,75,36],[75,37,75,38],[75,39,75,40],[75,41,75,42],[75,43,75,44],[74,7,74,8],[74,9,74,10],[74,11,74,12],[74,13,74,14],[74,15,74,16],[70,17,70,18],[70,19,70,20],[70,21,70,22],[70,23,70,24],[70,25,70,26],[70,27,70,28],[72,41,72,42],[72,43,72,44],[73,7,73,8],[73,9,73,10],[73,11,73,12],[73,13,73,14],[73,15,73,16],[73,17,73,18],[73,19,73,20],[73,21,73,22],[73,23,73,24],[73,25,73,26],[73,27,73,28],[73,29,73,30],[73,31,73,32],[73,33,73,34],[73,35,73,36],[73,37,73,38],[73,39,73,40],[73,41,73,42],[73,43,73,44],[72,7,72,8],[72,9,72,10],[72,11,72,12],[72,13,72,14],[72,15,72,16],[68,17,68,18],[68,19,68,20],[68,21,68,22],[68,23,68,24],[68,25,68,26],[68,27,68,28],[70,41,70,42],[70,43,70,44],[71,7,71,8],[71,9,71,10],[71,11,71,12],[71,13,71,14],[71,15,71,16],[71,17,71,18],[71,19,71,20],[71,21,71,22],[71,23,71,24],[71,25,71,26],[71,27,71,28],[71,29,71,30],[71,31,71,32],[71,33,71,34],[71,35,71,36],[71,37,71,38],[71,39,71,40],[71,41,71,42],[71,43,71,44],[70,7,70,8],[70,9,70,10],[70,11,70,12],[70,13,70,14],[70,15,70,16],[72,29,72,30],[72,31,72,32],[72,33,72,34],[72,35,72,36],[72,37,72,38],[72,39,72,40],[68,41,68,42],[68,43,68,44],[69,7,69,8],[69,9,69,10],[69,11,69,12],[69,13,69,14],[69,15,69,16],[69,17,69,18],[69,19,69,20],[69,21,69,22],[69,23,69,24],[69,25,69,26],[69,27,69,28],[69,29,69,30],[69,31,69,32],[69,33,69,34],[69,35,69,36],[69,37,69,38],[69,39,69,40],[69,41,69,42],[69,43,69,44],[68,7,68,8],[68,9,68,10],[68,11,68,12],[68,13,68,14],[68,15,68,16],[75,2,75,4],[76,2,77,2],[76,3,76,4],[77,3,77,4],[68,5,68,6],[77,5,77,6],[76,5,76,6],[75,5,75,6],[74,5,74,6],[73,5,73,6],[72,5,72,6],[71,5,71,6],[70,5,70,6],[69,5,69,6],[68,29,68,30],[68,31,68,32],[68,33,68,34],[73,3,73,4],[74,3,74,4],[70,29,70,30],[70,31,70,32],[70,33,70,34],[76,29,76,30],[76,31,76,32],[76,33,76,34],[77,7,77,8],[77,9,77,10],[77,11,77,12],[77,13,77,14],[77,15,77,16],[77,17,77,18],[77,19,77,20],[3,0,3,4],[50,3,50,4],[59,2,59,4],[60,2,60,4],[31,0,60,0],[46,3,46,4],[41,2,42,2],[34,2,34,4],[35,2,39,2],[41,1,46,1],[32,2,32,4],[35,3,35,4],[36,3,36,4],[31,2,31,4],[27,5,27,6],[33,2,33,4],[31,5,31,6],[43,2,46,2],[30,0,30,4],[45,5,45,6],[46,5,46,6],[35,1,39,1],[37,3,37,4],[45,3,45,4],[38,3,38,4],[39,3,39,4],[51,5,51,6],[52,5,52,6],[50,5,50,6],[16,5,16,6],[43,5,43,6],[44,5,44,6],[68,35,68,36],[68,37,68,38],[68,39,68,40],[68,2,68,4],[69,2,69,4],[70,2,74,2],[70,3,70,4],[71,3,71,4],[72,3,72,4],[53,5,53,6],[54,5,54,6],[70,35,70,36],[70,37,70,38],[70,39,70,40],[74,17,74,18],[74,19,74,20],[74,21,74,22],[74,23,74,24],[74,25,74,26],[74,27,74,28],[72,17,72,18],[72,19,72,20],[72,21,72,22],[72,23,72,24],[72,25,72,26],[72,27,72,28],[74,29,74,30],[74,31,74,32],[74,33,74,34],[74,35,74,36],[74,37,74,38],[74,39,74,40],[66,0,66,1],[57,3,57,4],[58,3,58,4],[65,5,65,6],[66,5,66,6],[63,3,63,4],[64,3,64,4],[63,5,63,6],[64,5,64,6],[66,2,66,4],[55,5,55,6],[56,5,56,6],[57,5,57,6],[58,5,58,6],[59,5,59,6],[60,5,60,6],[61,5,61,6],[62,5,62,6],[52,3,56,3],[57,2,58,2],[57,1,58,1],[61,0,65,0],[65,3,65,4],[61,2,61,4],[62,2,62,4],[63,2,65,2],[47,2,56,2],[47,1,49,1],[50,1,51,1],[52,1,56,1],[47,3,49,3],[51,3,51,4],[30,5,30,6],[49,5,49,6],[28,5,28,6],[29,5,29,6],[23,5,23,6],[26,5,26,6],[47,5,47,6],[48,5,48,6],[40,2,40,4],[42,3,42,4],[41,3,41,4],[43,3,43,4],[44,3,44,4],[28,3,28,4],[29,3,29,4],[24,3,24,4],[25,3,25,4],[26,3,26,4],[13,3,13,4],[14,3,14,4],[15,3,15,4],[16,3,16,4],[17,5,17,6],[18,5,18,6],[19,5,19,6],[20,5,20,6],[27,3,27,4],[22,5,22,6],[4,0,21,0],[12,1,20,1],[17,3,17,4],[18,3,18,4],[19,3,19,4],[20,3,20,4],[21,2,21,4],[23,3,23,4],[22,3,22,4],[22,0,29,0],[22,1,29,1],[23,2,29,2],[4,1,4,4],[5,2,5,4],[6,2,6,4],[7,2,7,4],[8,2,8,4],[9,2,9,4],[10,2,10,4],[11,2,11,4],[12,2,20,2],[12,3,12,4],[2,7,2,8],[3,7,3,8],[4,7,4,8],[5,7,5,8],[6,7,6,8],[7,7,7,8],[8,7,8,8],[9,7,9,8],[10,7,10,8],[29,7,29,8],[30,7,30,8],[31,7,31,8],[3,5,3,6],[2,5,2,6],[43,7,43,8],[44,7,44,8],[45,7,45,8],[21,5,21,6],[24,5,24,6],[25,5,25,6],[4,5,4,6],[5,5,5,6],[6,5,6,6],[7,5,7,6],[8,5,8,6],[9,5,9,6],[10,5,10,6],[11,5,11,6],[12,5,12,6],[13,5,13,6],[14,5,14,6],[15,5,15,6],[46,7,46,8],[47,7,47,8],[11,7,11,8],[12,7,12,8],[13,7,13,8],[14,7,14,8],[15,7,15,8],[16,7,16,8],[17,7,17,8],[18,7,18,8],[19,7,19,8],[48,7,48,8],[20,7,20,8],[21,7,21,8],[22,7,22,8],[23,7,23,8],[24,7,24,8],[25,7,25,8],[26,7,26,8],[27,7,27,8],[28,7,28,8],[58,7,58,8],[59,7,59,8],[60,7,60,8],[61,7,61,8],[62,7,62,8],[63,7,63,8],[64,7,64,8],[65,7,65,8],[66,7,66,8],[49,7,49,8],[50,7,50,8],[51,7,51,8],[52,7,52,8],[53,7,53,8],[54,7,54,8],[55,7,55,8],[56,7,56,8],[57,7,57,8],[24,9,24,10],[25,9,25,10],[26,9,26,10],[27,9,27,10],[28,9,28,10],[11,9,11,10],[12,9,12,10],[13,9,13,10],[14,9,14,10],[15,9,15,10],[16,9,16,10],[17,9,17,10],[18,9,18,10],[19,9,19,10],[65,9,65,10],[66,9,66,10],[46,9,46,10],[47,9,47,10],[48,9,48,10],[20,9,20,10],[21,9,21,10],[60,9,60,10],[61,9,61,10],[62,9,62,10],[63,9,63,10],[64,9,64,10],[49,9,49,10],[50,9,50,10],[51,9,51,10],[52,9,52,10],[53,9,53,10],[54,9,54,10],[55,9,55,10],[56,9,56,10],[57,9,57,10],[29,9,29,10],[30,9,30,10],[31,9,31,10],[43,9,43,10],[44,9,44,10],[45,9,45,10],[2,13,2,14],[2,15,2,16],[2,17,2,18],[2,19,2,20],[2,21,2,22],[2,9,2,10],[3,9,3,10],[4,9,4,10],[5,9,5,10],[6,9,6,10],[7,9,7,10],[8,9,8,10],[9,9,9,10],[10,9,10,10],[19,15,19,16],[20,11,20,12],[20,13,20,14],[20,15,20,16],[20,17,20,18],[20,19,20,20],[20,21,20,22],[21,17,21,18],[21,19,21,20],[2,27,2,28],[58,9,58,10],[59,9,59,10],[5,11,5,12],[5,13,5,14],[5,15,5,16],[5,17,5,18],[5,19,5,20],[5,21,5,22],[5,23,5,24],[5,25,5,26],[2,23,2,24],[2,25,2,26],[5,27,5,28],[7,11,7,12],[7,13,7,14],[7,15,7,16],[7,17,7,18],[14,11,14,12],[14,13,14,14],[14,15,14,16],[14,17,14,18],[14,19,14,20],[14,21,14,22],[14,23,14,24],[14,25,14,26],[14,27,14,28],[15,23,15,24],[15,25,15,26],[15,27,15,28],[19,11,19,12],[19,13,19,14],[5,35,5,36],[5,37,5,38],[5,39,5,40],[5,41,5,42],[5,43,5,44],[22,9,22,10],[23,9,23,10],[2,29,2,30],[2,31,2,32],[2,33,2,34],[2,35,2,36],[2,37,2,38],[2,39,2,40],[2,41,2,42],[2,43,2,44],[3,11,3,12],[3,13,3,14],[3,15,3,16],[3,17,3,18],[3,19,3,20],[3,21,3,22],[3,23,3,24],[3,25,3,26],[3,27,3,28],[3,29,3,30],[3,31,3,32],[3,33,3,34],[3,35,3,36],[3,37,3,38],[3,39,3,40],[3,41,3,42],[2,11,2,12],[3,43,3,44],[4,11,4,12],[4,13,4,14],[4,15,4,16],[4,17,4,18],[4,19,4,20],[4,21,4,22],[4,23,4,24],[4,25,4,26],[4,27,4,28],[4,29,4,30],[4,31,4,32],[4,33,4,34],[4,35,4,36],[4,37,4,38],[4,39,4,40],[4,41,4,42],[4,43,4,44],[5,29,5,30],[5,31,5,32],[5,33,5,34],[8,39,8,40],[8,41,8,42],[8,43,8,44],[6,11,6,12],[6,13,6,14],[6,15,6,16],[6,17,6,18],[6,19,6,20],[6,21,6,22],[6,23,6,24],[6,25,6,26],[6,27,6,28],[6,29,6,30],[6,31,6,32],[6,33,6,34],[6,35,6,36],[6,37,6,38],[6,39,6,40],[6,41,6,42],[8,11,8,12],[8,13,8,14],[8,15,8,16],[8,17,8,18],[8,19,8,20],[8,21,8,22],[8,23,8,24],[8,25,8,26],[8,27,8,28],[6,43,6,44],[9,43,9,44],[10,11,10,12],[10,13,10,14],[10,15,10,16],[7,19,7,20],[7,21,7,22],[7,23,7,24],[7,25,7,26],[7,27,7,28],[7,29,7,30],[7,31,7,32],[7,33,7,34],[7,35,7,36],[7,37,7,38],[7,39,7,40],[7,41,7,42],[7,43,7,44],[8,29,8,30],[8,31,8,32],[8,33,8,34],[8,35,8,36],[8,37,8,38],[9,11,9,12],[9,13,9,14],[9,15,9,16],[9,17,9,18],[9,19,9,20],[9,21,9,22],[9,23,9,24],[9,25,9,26],[9,27,9,28],[9,29,9,30],[9,31,9,32],[9,33,9,34],[9,35,9,36],[9,37,9,38],[9,39,9,40],[9,41,9,42],[11,11,11,12],[11,13,11,14],[11,15,11,16],[11,17,11,18],[11,19,11,20],[11,21,11,22],[11,23,11,24],[11,25,11,26],[11,27,11,28],[12,43,12,44],[13,11,13,12],[13,13,13,14],[13,15,13,16],[10,17,10,18],[10,19,10,20],[10,21,10,22],[10,23,10,24],[10,25,10,26],[10,27,10,28],[10,29,10,30],[10,31,10,32],[10,33,10,34],[10,35,10,36],[10,37,10,38],[10,39,10,40],[10,41,10,42],[10,43,10,44],[11,29,11,30],[11,31,11,32],[11,33,11,34],[11,35,11,36],[11,37,11,38],[11,39,11,40],[11,41,11,42],[11,43,11,44],[12,11,12,12],[12,13,12,14],[12,15,12,16],[12,17,12,18],[12,19,12,20],[12,21,12,22],[12,23,12,24],[12,25,12,26],[12,27,12,28],[12,29,12,30],[12,31,12,32],[12,33,12,34],[12,35,12,36],[12,37,12,38],[12,39,12,40],[12,41,12,42],[15,43,15,44],[16,11,16,12],[16,13,16,14],[16,15,16,16],[13,17,13,18],[13,19,13,20],[13,21,13,22],[13,23,13,24],[13,25,13,26],[13,27,13,28],[13,29,13,30],[13,31,13,32],[13,33,13,34],[13,35,13,36],[13,37,13,38],[13,39,13,40],[13,41,13,42],[13,43,13,44],[14,29,14,30],[14,31,14,32],[14,33,14,34],[14,35,14,36],[14,37,14,38],[14,39,14,40],[14,41,14,42],[14,43,14,44],[15,11,15,12],[15,13,15,14],[15,15,15,16],[15,17,15,18],[15,19,15,20],[15,21,15,22],[15,29,15,30],[15,31,15,32],[15,33,15,34],[15,35,15,36],[15,37,15,38],[15,39,15,40],[15,41,15,42],[17,11,17,12],[17,13,17,14],[17,15,17,16],[17,17,17,18],[17,19,17,20],[17,21,17,22],[17,23,17,24],[17,25,17,26],[17,27,17,28],[18,43,18,44],[16,17,16,18],[16,19,16,20],[16,21,16,22],[16,23,16,24],[16,25,16,26],[16,27,16,28],[16,29,16,30],[16,31,16,32],[16,33,16,34],[16,35,16,36],[16,37,16,38],[16,39,16,40],[16,41,16,42],[16,43,16,44],[17,29,17,30],[17,31,17,32],[17,33,17,34],[17,35,17,36],[17,37,17,38],[17,39,17,40],[17,41,17,42],[17,43,17,44],[18,11,18,12],[18,13,18,14],[18,15,18,16],[18,17,18,18],[18,19,18,20],[18,21,18,22],[18,23,18,24],[18,25,18,26],[18,27,18,28],[18,29,18,30],[18,31,18,32],[18,33,18,34],[18,35,18,36],[18,37,18,38],[18,39,18,40],[18,41,18,42],[20,23,20,24],[20,25,20,26],[20,27,20,28],[21,43,21,44],[22,11,22,12],[22,13,22,14],[22,15,22,16],[19,17,19,18],[19,19,19,20],[19,21,19,22],[19,23,19,24],[19,25,19,26],[19,27,19,28],[19,29,19,30],[19,31,19,32],[19,33,19,34],[19,35,19,36],[19,37,19,38],[19,39,19,40],[19,41,19,42],[19,43,19,44],[20,29,20,30],[20,31,20,32],[20,33,20,34],[20,35,20,36],[20,37,20,38],[20,39,20,40],[20,41,20,42],[20,43,20,44],[21,11,21,12],[21,13,21,14],[21,15,21,16],[21,21,21,22],[21,23,21,24],[21,25,21,26],[21,27,21,28],[21,29,21,30],[21,31,21,32],[21,33,21,34],[21,35,21,36],[21,37,21,38],[21,39,21,40],[21,41,21,42],[23,11,23,12],[23,13,23,14],[23,15,23,16],[23,17,23,18],[23,19,23,20],[23,21,23,22],[23,23,23,24],[23,25,23,26],[23,27,23,28],[24,43,24,44],[25,11,25,12],[25,13,25,14],[25,15,25,16],[22,17,22,18],[22,19,22,20],[22,21,22,22],[22,23,22,24],[22,25,22,26],[22,27,22,28],[22,29,22,30],[22,31,22,32],[22,33,22,34],[22,35,22,36],[22,37,22,38],[22,39,22,40],[22,41,22,42],[22,43,22,44],[23,29,23,30],[23,31,23,32],[23,33,23,34],[23,35,23,36],[23,37,23,38],[23,39,23,40],[23,41,23,42],[23,43,23,44],[24,11,24,12],[24,13,24,14],[24,15,24,16],[24,17,24,18],[24,19,24,20],[24,21,24,22],[24,23,24,24],[24,25,24,26],[24,27,24,28],[24,29,24,30],[24,31,24,32],[24,33,24,34],[24,35,24,36],[24,37,24,38],[24,39,24,40],[24,41,24,42],[26,11,26,12],[26,13,26,14],[26,15,26,16],[26,17,26,18],[26,19,26,20],[26,21,26,22],[26,23,26,24],[26,25,26,26],[26,27,26,28],[27,43,27,44],[28,11,28,12],[28,13,28,14],[28,15,28,16],[25,17,25,18],[25,19,25,20],[25,21,25,22],[25,23,25,24],[25,25,25,26],[25,27,25,28],[25,29,25,30],[25,31,25,32],[25,33,25,34],[25,35,25,36],[25,37,25,38],[25,39,25,40],[25,41,25,42],[25,43,25,44],[26,29,26,30],[26,31,26,32],[26,33,26,34],[26,35,26,36],[26,37,26,38],[26,39,26,40],[26,41,26,42],[26,43,26,44],[27,11,27,12],[27,13,27,14],[27,15,27,16],[27,17,27,18],[27,19,27,20],[27,21,27,22],[27,23,27,24],[27,25,27,26],[27,27,27,28],[27,29,27,30],[27,31,27,32],[27,33,27,34],[27,35,27,36],[27,37,27,38],[27,39,27,40],[27,41,27,42],[29,11,29,12],[29,13,29,14],[29,15,29,16],[29,17,29,18],[29,19,29,20],[29,21,29,22],[29,23,29,24],[29,25,29,26],[29,27,29,28],[30,43,30,44],[31,11,31,12],[31,13,31,14],[31,15,31,16],[28,17,28,18],[28,19,28,20],[28,21,28,22],[28,23,28,24],[28,25,28,26],[28,27,28,28],[28,29,28,30],[28,31,28,32],[28,33,28,34],[28,35,28,36],[28,37,28,38],[28,39,28,40],[28,41,28,42],[28,43,28,44],[29,29,29,30],[29,31,29,32],[29,33,29,34],[29,35,29,36],[29,37,29,38],[29,39,29,40],[29,41,29,42],[29,43,29,44],[30,11,30,12],[30,13,30,14],[30,15,30,16],[30,17,30,18],[30,19,30,20],[30,21,30,22],[30,23,30,24],[30,25,30,26],[30,27,30,28],[30,29,30,30],[30,31,30,32],[30,33,30,34],[30,35,30,36],[30,37,30,38],[30,39,30,40],[30,41,30,42],[43,11,43,12],[43,13,43,14],[43,15,43,16],[43,17,43,18],[43,19,43,20],[43,21,43,22],[43,23,43,24],[43,25,43,26],[43,27,43,28],[44,43,44,44],[45,11,45,12],[45,13,45,14],[45,15,45,16],[31,17,31,18],[31,19,31,20],[31,21,31,22],[31,23,31,24],[31,25,31,26],[31,27,31,28],[31,29,31,30],[31,31,31,32],[31,33,31,34],[31,35,31,36],[31,37,31,38],[31,39,31,40],[31,41,31,42],[31,43,31,44],[43,29,43,30],[43,31,43,32],[43,33,43,34],[43,35,43,36],[43,37,43,38],[43,39,43,40],[43,41,43,42],[43,43,43,44],[44,11,44,12],[44,13,44,14],[44,15,44,16],[44,17,44,18],[44,19,44,20],[44,21,44,22],[44,23,44,24],[44,25,44,26],[44,27,44,28],[44,29,44,30],[44,31,44,32],[44,33,44,34],[44,35,44,36],[44,37,44,38],[44,39,44,40],[44,41,44,42]],"merged_total":1371,"flags":["merged_cut"]}
[null,null,null,null,null,"3-1",null,"3-2",null,"4-1",null,"4-2",null,"5-1",null,"5-2",null,"6-1",null,"6-2",null,"8-1",null,"8-2",null,"8-3",null,"8-4",null,"9-1",null,"9-2",null,"10-1",null,"10-2",null,"11-1",null,"11-2",null,"12-1",null,"12-2"]
["薬液注入工",null,null,null,null,{"$f":"IF(LEN(VLOOKUP(F1,仕様の整理!$C:$E,3,0))-LEN(SUBSTITUTE(VLOOKUP(F1,仕様の整理!$C:$E,3,0),\"-\",\"\"))>=2,LEFT(VLOOKUP(F1,仕様の整理!$C:$E,3,0),FIND(\"-\",VLOOKUP(F1,仕様の整理!$C:$E,3,0),FIND(\"-\",VLOOKUP(F1,仕様の整理!$C:$E,3,0))+1)-1),VLOOKUP(F1,仕様の整理!$C:$E,3,0))","v":"KT-990230"},null,{"$f":"IF(LEN(VLOOKUP(H1,仕様の整理!$C:$E,3,0))-LEN(SUBSTITUTE(VLOOKUP(H1,仕様の整理!$C:$E,3,0),\"-\",\"\"))>=2,LEFT(VLOOKUP(H1,仕様の整理!$C:$E,3,0),FIND(\"-\",VLOOKUP(H1,仕様の整理!$C:$E,3,0),FIND(\"-\",VLOOKUP(H1,仕様の整理!$C:$E,3,0))+1)-1),VLOOKUP(H1,仕様の整理!$C:$E,3,0))","v":"KT-990230"},null,{"$f":"IF(LEN(VLOOKUP(J1,仕様の整理!$C:$E,3,0))-LEN(SUBSTITUTE(VLOOKUP(J1,仕様の整理!$C:$E,3,0),\"-\",\"\"))>=2,LEFT(VLOOKUP(J1,仕様の整理!$C:$E,3,0),FIND(\"-\",VLOOKUP(J1,仕様の整理!$C:$E,3,0),FIND(\"-\",VLOOKUP(J1,仕様の整理!$C:$E,3,0))+1)-1),VLOOKUP(J1,仕様の整理!$C:$E,3,0))","v":"KT-060120"},null,{"$f":"IF(LEN(VLOOKUP(L1,仕様の整理!$C:$E,3,0))-LEN(SUBSTITUTE(VLOOKUP(L1,仕様の整理!$C:$E,3,0),\"-\",\"\"))>=2,LEFT(VLOOKUP(L1,仕様の整理!$C:$E,3,0),FIND(\"-\",VLOOKUP(L1,仕様の整理!$C:$E,3,0),FIND(\"-\",VLOOKUP(L1,仕様の整理!$C:$E,3,0))+1)-1),VLOOKUP(L1,仕様の整理!$C:$E,3,0))","v":"KT-060120"},null,{"$f":"IF(LEN(VLOOKUP(N1,仕様の整理!$C:$E,3,0))-LEN(SUBSTITUTE(VLOOKUP(N1,仕様の整理!$C:$E,3,0),\"-\",\"\"))>=2,LEFT(VLOOKUP(N1,仕様の整理!$C:$E,3,0),FIND(\"-\",VLOOKUP(N1,仕様の整理!$C:$E,3,0),FIND(\"-\",VLOOKUP(N1,仕様の整理!$C:$E,3,0))+1)-1),VLOOKUP(N1,仕様の整理!$C:$E,3,0))","v":"CB-180008"},null,{"$f":"IF(LEN(VLOOKUP(P1,仕様の整理!$C:$E,3,0))-LEN(SUBSTITUTE(VLOOKUP(P1,仕様の整理!$C:$E,3,0),\"-\",\"\"))>=2,LEFT(VLOOKUP(P1,仕様の整理!$C:$E,3,0),FIND(\"-\",VLOOKUP(P1,仕様の整理!$C:$E,3,0),FIND(\"-\",VLOOKUP(P1,仕様の整理!$C:$E,3,0))+1)-1),VLOOKUP(P1,仕様の整理!$C:$E,3,0))","v":"CB-180008"},null,{"$f":"IF(LEN(VLOOKUP(R1,仕様の整理!$C:$E,3,0))-LEN(SUBSTITUTE(VLOOKUP(R1,仕様の整理!$C:$E,3,0),\"-\",\"\"))>=2,LEFT(VLOOKUP(R1,仕様の整理!$C:$E,3,0),FIND(\"-\",VLOOKUP(R1,仕様の整理!$C:$E,3,0),FIND(\"-\",VLOOKUP(R1,仕様の整理!$C:$E,3,0))+1)-1),VLOOKUP(R1,仕様の整理!$C:$E,3,0))","v":"CB-180028"},null,{"$f":"IF(LEN(VLOOKUP(T1,仕様の整理!$C:$E,3,0))-LEN(SUBSTITUTE(VLOOKUP(T1,仕様の整理!$C:$E,3,0),\"-\",\"\"))>=2,LEFT(VLOOKUP(T1,仕様の整理!$C:$E,3,0),FIND(\"-\",VLOOKUP(T1,仕様の整理!$C:$E,3,0),FIND(\"-\",VLOOKUP(T1,仕様の整理!$C:$E,3,0))+1)-1),VLOOKUP(T1,仕様の整理!$C:$E,3,0))","v":"CB-180028"},null,{"$f":"IF(LEN(VLOOKUP(V1,仕様の整理!$C:$E,3,0))-LEN(SUBSTITUTE(VLOOKUP(V1,仕様の整理!$C:$E,3,0),\"-\",\"\"))>=2,LEFT(VLOOKUP(V1,仕様の整理!$C:$E,3,0),FIND(\"-\",VLOOKUP(V1,仕様の整理!$C:$E,3,0),FIND(\"-\",VLOOKUP(V1,仕様の整理!$C:$E,3,0))+1)-1),VLOOKUP(V1,仕様の整理!$C:$E,3,0))","v":"KT-190012"},null,{"$f":"IF(LEN(VLOOKUP(X1,仕様の整理!$C:$E,3,0))-LEN(SUBSTITUTE(VLOOKUP(X1,仕様の整理!$C:$E,3,0),\"-\",\"\"))>=2,LEFT(VLOOKUP(X1,仕様の整理!$C:$E,3,0),FIND(\"-\",VLOOKUP(X1,仕様の整理!$C:$E,3,0),FIND(\"-\",VLOOKUP(X1,仕様の整理!$C:$E,3,0))+1)-1),VLOOKUP(X1,仕様の整理!$C:$E,3,0))","v":"KT-190012"},null,{"$f":"IF(LEN(VLOOKUP(Z1,仕様の整理!$C:$E,3,0))-LEN(SUBSTITUTE(VLOOKUP(Z1,仕様の整理!$C:$E,3,0),\"-\",\"\"))>=2,LEFT(VLOOKUP(Z1,仕様の整理!$C:$E,3,0),FIND(\"-\",VLOOKUP(Z1,仕様の整理!$C:$E,3,0),FIND(\"-\",VLOOKUP(Z1,仕様の整理!$C:$E,3,0))+1)-1),VLOOKUP(Z1,仕様の整理!$C:$E,3,0))","v":"KT-190012"},null,{"$f":"IF(LEN(VLOOKUP(AB1,仕様の整理!$C:$E,3,0))-LEN(SUBSTITUTE(VLOOKUP(AB1,仕様の整理!$C:$E,3,0),\"-\",\"\"))>=2,LEFT(VLOOKUP(AB1,仕様の整理!$C:$E,3,0),FIND(\"-\",VLOOKUP(AB1,仕様の整理!$C:$E,3,0),FIND(\"-\",VLOOKUP(AB1,仕様の整理!$C:$E,3,0))+1)-1),VLOOKUP(AB1,仕様の整理!$C:$E,3,0))","v":"KT-190012"},null,{"$f":"IF(LEN(VLOOKUP(AD1,仕様の整理!$C:$E,3,0))-LEN(SUBSTITUTE(VLOOKUP(AD1,仕様の整理!$C:$E,3,0),\"-\",\"\"))>=2,LEFT(VLOOKUP(AD1,仕様の整理!$C:$E,3,0),FIND(\"-\",VLOOKUP(AD1,仕様の整理!$C:$E,3,0),FIND(\"-\",VLOOKUP(AD1,仕様の整理!$C:$E,3,0))+1)-1),VLOOKUP(AD1,仕様の整理!$C:$E,3,0))","v":"KT-190051"},null,{"$f":"IF(LEN(VLOOKUP(AF1,仕様の整理!$C:$E,3,0))-LEN(SUBSTITUTE(VLOOKUP(AF1,仕様の整理!$C:$E,3,0),\"-\",\"\"))>=2,LEFT(VLOOKUP(AF1,仕様の整理!$C:$E,3,0),FIND(\"-\",VLOOKUP(AF1,仕様の整理!$C:$E,3,0),FIND(\"-\",VLOOKUP(AF1,仕様の整理!$C:$E,3,0))+1)-1),VLOOKUP(AF1,仕様の整理!$C:$E,3,0))","v":"KT-190051"},null,{"$f":"IF(LEN(VLOOKUP(AH1,仕様の整理!$C:$E,3,0))-LEN(SUBSTITUTE(VLOOKUP(AH1,仕様の整理!$C:$E,3,0),\"-\",\"\"))>=2,LEFT(VLOOKUP(AH1,仕様の整理!$C:$E,3,0),FIND(\"-\",VLOOKUP(AH1,仕様の整理!$C:$E,3,0),FIND(\"-\",VLOOKUP(AH1,仕様の整理!$C:$E,3,0))+1)-1),VLOOKUP(AH1,仕様の整理!$C:$E,3,0))","v":"KT-200081"},null,{"$f":"IF(LEN(VLOOKUP(AJ1,仕様の整理!$C:$E,3,0))-LEN(SUBSTITUTE(VLOOKUP(AJ1,仕様の整理!$C:$E,3,0),\"-\",\"\"))>=2,LEFT(VLOOKUP(AJ1,仕様の整理!$C:$E,3,0),FIND(\"-\",VLOOKUP(AJ1,仕様の整理!$C:$E,3,0),FIND(\"-\",VLOOKUP(AJ1,仕様の整理!$C:$E,3,0))+1)-1),VLOOKUP(AJ1,仕様の整理!$C:$E,3,0))","v":"KT-200081"},null,{"$f":"IF(LEN(VLOOKUP(AL1,仕様の整理!$C:$E,3,0))-LEN(SUBSTITUTE(VLOOKUP(AL1,仕様の整理!$C:$E,3,0),\"-\",\"\"))>=2,LEFT(VLOOKUP(AL1,仕様の整理!$C:$E,3,0),FIND(\"-\",VLOOKUP(AL1,仕様の整理!$C:$E,3,0),FIND(\"-\",VLOOKUP(AL1,仕様の整理!$C:$E,3,0))+1)-1),VLOOKUP(AL1,仕様の整理!$C:$E,3,0))","v":"KT-220015"},null,{"$f":"IF(LEN(VLOOKUP(AN1,仕様の整理!$C:$E,3,0))-LEN(SUBSTITUTE(VLOOKUP(AN1,仕様の整理!$C:$E,3,0),\"-\",\"\"))>=2,LEFT(VLOOKUP(AN1,仕様の整理!$C:$E,3,0),FIND(\"-\",VLOOKUP(AN1,仕様の整理!$C:$E,3,0),FIND(\"-\",VLOOKUP(AN1,仕様の整理!$C:$E,3,0))+1)-1),VLOOKUP(AN1,仕様の整理!$C:$E,3,0))","v":"KT-220015"},null,{"$f":"IF(LEN(VLOOKUP(AP1,仕様の整理!$C:$E,3,0))-LEN(SUBSTITUTE(VLOOKUP(AP1,仕様の整理!$C:$E,3,0),\"-\",\"\"))>=2,LEFT(VLOOKUP(AP1,仕様の整理!$C:$E,3,0),FIND(\"-\",VLOOKUP(AP1,仕様の整理!$C:$E,3,0),FIND(\"-\",VLOOKUP(AP1,仕様の整理!$C:$E,3,0))+1)-1),VLOOKUP(AP1,仕様の整理!$C:$E,3,0))","v":"QS-240013"},null,{"$f":"IF(LEN(VLOOKUP(AR1,仕様の整理!$C:$E,3,0))-LEN(SUBSTITUTE(VLOOKUP(AR1,仕様の整理!$C:$E,3,0),\"-\",\"\"))>=2,LEFT(VLOOKUP(AR1,仕様の整理!$C:$E,3,0),FIND(\"-\",VLOOKUP(AR1,仕様の整理!$C:$E,3,0),FIND(\"-\",VLOOKUP(AR1,仕様の整理!$C:$E,3,0))+1)-1),VLOOKUP(AR1,仕様の整理!$C:$E,3,0))","v":"QS-240013"}]
[null,null,null,null,null,{"$f":"\"作成日：\"&VLOOKUP(F1,仕様の整理!$C:$J,6,0)","v":"作成日：令和7年8月"},null,{"$f":"\"作成日：\"&VLOOKUP(H1,仕様の整理!$C:$J,6,0)","v":"作成日：令和7年8月"},null,{"$f":"\"作成日：\"&VLOOKUP(J1,仕様の整理!$C:$J,6,0)","v":"作成日：令和7年8月"},null,{"$f":"\"作成日：\"&VLOOKUP(L1,仕様の整理!$C:$J,6,0)","v":"作成日：令和7年8月"},null,{"$f":"\"作成日：\"&VLOOKUP(N1,仕様の整理!$C:$J,6,0)","v":"作成日：令和7年8月"},null,{"$f":"\"作成日：\"&VLOOKUP(P1,仕様の整理!$C:$J,6,0)","v":"作成日：令和7年8月"},null,{"$f":"\"作成日：\"&VLOOKUP(R1,仕様の整理!$C:$J,6,0)","v":"作成日：令和7年8月"},null,{"$f":"\"作成日：\"&VLOOKUP(T1,仕様の整理!$C:$J,6,0)","v":"作成日：令和7年8月"},null,{"$f":"\"作成日：\"&VLOOKUP(V1,仕様の整理!$C:$J,6,0)","v":"作成日：令和7年8月"},null,{"$f":"\"作成日：\"&VLOOKUP(X1,仕様の整理!$C:$J,6,0)","v":"作成日：令和7年8月"},null,{"$f":"\"作成日：\"&VLOOKUP(Z1,仕様の整理!$C:$J,6,0)","v":"作成日：令和7年8月"},null,{"$f":"\"作成日：\"&VLOOKUP(AB1,仕様の整理!$C:$J,6,0)","v":"作成日：令和7年8月"},null,{"$f":"\"作成日：\"&VLOOKUP(AD1,仕様の整理!$C:$J,6,0)","v":"作成日：令和7年8月"},null,{"$f":"\"作成日：\"&VLOOKUP(AF1,仕様の整理!$C:$J,6,0)","v":"作成日：令和7年8月"},null,{"$f":"\"作成日：\"&VLOOKUP(AH1,仕様の整理!$C:$J,6,0)","v":"作成日：令和7年8月"},null,{"$f":"\"作成日：\"&VLOOKUP(AJ1,仕様の整理!$C:$J,6,0)","v":"作成日：令和7年8月"},null,{"$f":"\"作成日：\"&VLOOKUP(AL1,仕様の整理!$C:$J,6,0)","v":"作成日：令和7年8月"},null,{"$f":"\"作成日：\"&VLOOKUP(AN1,仕様の整理!$C:$J,6,0)","v":"作成日：令和7年8月"},null,{"$f":"\"作成日：\"&VLOOKUP(AP1,仕様の整理!$C:$J,6,0)","v":"作成日：令和7年12月"},null,{"$f":"\"作成日：\"&VLOOKUP(AR1,仕様の整理!$C:$J,6,0)","v":"作成日：令和7年12月"}]
[null,null,null,null,null,{"$f":"\"改良深度：\"&VLOOKUP(F1,仕様の整理!$C:$J,7,0)&\"m、土質：\"&VLOOKUP(F1,仕様の整理!$C:$J,8,0)","v":"改良深度：10m、土質：砂質土"},null,{"$f":"\"改良深度：\"&VLOOKUP(H1,仕様の整理!$C:$J,7,0)&\"m、土質：\"&VLOOKUP(H1,仕様の整理!$C:$J,8,0)","v":"改良深度：20m、土質：砂質土"},null,{"$f":"\"改良深度：\"&VLOOKUP(J1,仕様の整理!$C:$J,7,0)&\"m、土質：\"&VLOOKUP(J1,仕様の整理!$C:$J,8,0)","v":"改良深度：10m、土質：砂質土"},null,{"$f":"\"改良深度：\"&VLOOKUP(L1,仕様の整理!$C:$J,7,0)&\"m、土質：\"&VLOOKUP(L1,仕様の整理!$C:$J,8,0)","v":"改良深度：20m、土質：砂質土"},null,{"$f":"\"改良深度：\"&VLOOKUP(N1,仕様の整理!$C:$J,7,0)&\"m、土質：\"&VLOOKUP(N1,仕様の整理!$C:$J,8,0)","v":"改良深度：10m、土質：砂質土"},null,{"$f":"\"改良深度：\"&VLOOKUP(P1,仕様の整理!$C:$J,7,0)&\"m、土質：\"&VLOOKUP(P1,仕様の整理!$C:$J,8,0)","v":"改良深度：20m、土質：砂質土"},null,{"$f":"\"改良深度：\"&VLOOKUP(R1,仕様の整理!$C:$J,7,0)&\"m、土質：\"&VLOOKUP(R1,仕様の整理!$C:$J,8,0)","v":"改良深度：10m、土質：砂質土"},null,{"$f":"\"改良深度：\"&VLOOKUP(T1,仕様の整理!$C:$J,7,0)&\"m、土質：\"&VLOOKUP(T1,仕様の整理!$C:$J,8,0)","v":"改良深度：20m、土質：砂質土"},null,{"$f":"\"改良深度：\"&VLOOKUP(V1,仕様の整理!$C:$J,7,0)&\"m、土質：\"&VLOOKUP(V1,仕様の整理!$C:$J,8,0)","v":"改良深度：10m、土質：砂質土"},null,{"$f":"\"改良深度：\"&VLOOKUP(X1,仕様の整理!$C:$J,7,0)&\"m、土質：\"&VLOOKUP(X1,仕様の整理!$C:$J,8,0)","v":"改良深度：20m、土質：砂質土"},null,{"$f":"\"改良深度：\"&VLOOKUP(Z1,仕様の整理!$C:$J,7,0)&\"m、土質：\"&VLOOKUP(Z1,仕様の整理!$C:$J,8,0)","v":"改良深度：10m、土質：粘性土"},null,{"$f":"\"改良深度：\"&VLOOKUP(AB1,仕様の整理!$C:$J,7,0)&\"m、土質：\"&VLOOKUP(AB1,仕様の整理!$C:$J,8,0)","v":"改良深度：20m、土質：粘性土"},null,{"$f":"\"改良深度：\"&VLOOKUP(AD1,仕様の整理!$C:$J,7,0)&\"m、土質：\"&VLOOKUP(AD1,仕様の整理!$C:$J,8,0)","v":"改良深度：10m、土質：砂質土"},null,{"$f":"\"改良深度：\"&VLOOKUP(AF1,仕様の整理!$C:$J,7,0)&\"m、土質：\"&VLOOKUP(AF1,仕様の整理!$C:$J,8,0)","v":"改良深度：20m、土質：砂質土"},null,{"$f":"\"改良深度：\"&VLOOKUP(AH1,仕様の整理!$C:$J,7,0)&\"m、土質：\"&VLOOKUP(AH1,仕様の整理!$C:$J,8,0)","v":"改良深度：10m、土質：砂質土"},null,{"$f":"\"改良深度：\"&VLOOKUP(AJ1,仕様の整理!$C:$J,7,0)&\"m、土質：\"&VLOOKUP(AJ1,仕様の整理!$C:$J,8,0)","v":"改良深度：20m、土質：砂質土"},null,{"$f":"\"改良深度：\"&VLOOKUP(AL1,仕様の整理!$C:$J,7,0)&\"m、土質：\"&VLOOKUP(AL1,仕様の整理!$C:$J,8,0)","v":"改良深度：10m、土質：砂質土"},null,{"$f":"\"改良深度：\"&VLOOKUP(AN1,仕様の整理!$C:$J,7,0)&\"m、土質：\"&VLOOKUP(AN1,仕様の整理!$C:$J,8,0)","v":"改良深度：20m、土質：砂質土"},null,{"$f":"\"改良深度：\"&VLOOKUP(AP1,仕様の整理!$C:$J,7,0)&\"m、土質：\"&VLOOKUP(AP1,仕様の整理!$C:$J,8,0)","v":"改良深度：10m、土質：砂質土"},null,{"$f":"\"改良深度：\"&VLOOKUP(AR1,仕様の整理!$C:$J,7,0)&\"m、土質：\"&VLOOKUP(AR1,仕様の整理!$C:$J,8,0)","v":"改良深度：20m、土質：砂質土"}]
["ＮＥＴＩＳ情報","技術名",null,null,null,{"$f":"IF(VLOOKUP(F$1,仕様の整理!$C:$Q,4,0)=\"NETIS掲載期間終了技術\",VLOOKUP(F$1,仕様の整理!$C:$Q,2,0),VLOOKUP(F$1,仕様の整理!$C:$Q,2,0)&\"（\"&VLOOKUP(F$1,仕様の整理!$C:$Q,4,0)&\"）\")&IF(VLOOKUP(F$1,仕様の整理!$C:$Q,5,0)=\"○\",\"\",\"《新規登録技術》\")","v":"浸透固化処理工法"},null,{"$f":"IF(VLOOKUP(H$1,仕様の整理!$C:$Q,4,0)=\"NETIS掲載期間終了技術\",VLOOKUP(H$1,仕様の整理!$C:$Q,2,0),VLOOKUP(H$1,仕様の整理!$C:$Q,2,0)&\"（\"&VLOOKUP(H$1,仕様の整理!$C:$Q,4,0)&\"）\")&IF(VLOOKUP(H$1,仕様の整理!$C:$Q,5,0)=\"○\",\"\",\"《新規登録技術》\")","v":"浸透固化処理工法"},null,{"$f":"IF(VLOOKUP(J$1,仕様の整理!$C:$Q,4,0)=\"NETIS掲載期間終了技術\",VLOOKUP(J$1,仕様の整理!$C:$Q,2,0),VLOOKUP(J$1,仕様の整理!$C:$Q,2,0)&\"（\"&VLOOKUP(J$1,仕様の整理!$C:$Q,4,0)&\"）\")&IF(VLOOKUP(J$1,仕様の整理!$C:$Q,5,0)=\"○\",\"\",\"《新規登録技術》\")","v":"曲がり削孔工法"},null,{"$f":"IF(VLOOKUP(L$1,仕様の整理!$C:$Q,4,0)=\"NETIS掲載期間終了技術\",VLOOKUP(L$1,仕様の整理!$C:$Q,2,0),VLOOKUP(L$1,仕様の整理!$C:$Q,2,0)&\"（\"&VLOOKUP(L$1,仕様の整理!$C:$Q,4,0)&\"）\")&IF(VLOOKUP(L$1,仕様の整理!$C:$Q,5,0)=\"○\",\"\",\"《新規登録技術》\")","v":"曲がり削孔工法"},null,{"$f":"IF(VLOOKUP(N$1,仕様の整理!$C:$Q,4,0)=\"NETIS掲載期間終了技術\",VLOOKUP(N$1,仕様の整理!$C:$Q,2,0),VLOOKUP(N$1,仕様の整理!$C:$Q,2,0)&\"（\"&VLOOKUP(N$1,仕様の整理!$C:$Q,4,0)&\"）\")&IF(VLOOKUP(N$1,仕様の整理!$C:$Q,5,0)=\"○\",\"\",\"《新規登録技術》\")","v":"超音波振動注入工法（事後評価未実施技術）"},null,{"$f":"IF(VLOOKUP(P$1,仕様の整理!$C:$Q,4,0)=\"NETIS掲載期間終了技術\",VLOOKUP(P$1,仕様の整理!$C:$Q,2,0),VLOOKUP(P$1,仕様の整理!$C:$Q,2,0)&\"（\"&VLOOKUP(P$1,仕様の整理!$C:$Q,4,0)&\"）\")&IF(VLOOKUP(P$1,仕様の整理!$C:$Q,5,0)=\"○\",\"\",\"《新規登録技術》\")","v":"超音波振動注入工法（事後評価未実施技術）"},null,{"$f":"IF(VLOOKUP(R$1,仕様の整理!$C:$Q,4,0)=\"NETIS掲載期間終了技術\",VLOOKUP(R$1,仕様の整理!$C:$Q,2,0),VLOOKUP(R$1,仕様の整理!$C:$Q,2,0)&\"（\"&VLOOKUP(R$1,仕様の整理!$C:$Q,4,0)&\"）\")&IF(VLOOKUP(R$1,仕様の整理!$C:$Q,5,0)=\"○\",\"\",\"《新規登録技術》\")","v":"ハイグリップグラウト工法（事後評価未実施技術）"},null,{"$f":"IF(VLOOKUP(T$1,仕様の整理!$C:$Q,4,0)=\"NETIS掲載期間終了技術\",VLOOKUP(T$1,仕様の整理!$C:$Q,2,0),VLOOKUP(T$1,仕様の整理!$C:$Q,2,0)&\"（\"&VLOOKUP(T$1,仕様の整理!$C:$Q,4,0)&\"）\")&IF(VLOOKUP(T$1,仕様の整理!$C:$Q,5,0)=\"○\",\"\",\"《新規登録技術》\")","v":"ハイグリップグラウト工法（事後評価未実施技術）"},null,{"$f":"IF(VLOOKUP(V$1,仕様の整理!$C:$Q,4,0)=\"NETIS掲載期間終了技術\",VLOOKUP(V$1,仕様の整理!$C:$Q,2,0),VLOOKUP(V$1,仕様の整理!$C:$Q,2,0)&\"（\"&VLOOKUP(V$1,仕様の整理!$C:$Q,4,0)&\"）\")&IF(VLOOKUP(V$1,仕様の整理!$C:$Q,5,0)=\"○\",\"\",\"《新規登録技術》\")","v":"Newスリーブ注入工法（事後評価未実施技術）"},null,{"$f":"IF(VLOOKUP(X$1,仕様の整理!$C:$Q,4,0)=\"NETIS掲載期間終了技術\",VLOOKUP(X$1,仕様の整理!$C:$Q,2,0),VLOOKUP(X$1,仕様の整理!$C:$Q,2,0)&\"（\"&VLOOKUP(X$1,仕様の整理!$C:$Q,4,0)&\"）\")&IF(VLOOKUP(X$1,仕様の整理!$C:$Q,5,0)=\"○\",\"\",\"《新規登録技術》\")","v":"Newスリーブ注入工法（事後評価未実施技術）"},null,{"$f":"IF(VLOOKUP(Z$1,仕様の整理!$C:$Q,4,0)=\"NETIS掲載期間終了技術\",VLOOKUP(Z$1,仕様の整理!$C:$Q,2,0),VLOOKUP(Z$1,仕様の整理!$C:$Q,2,0)&\"（\"&VLOOKUP(Z$1,仕様の整理!$C:$Q,4,0)&\"）\")&IF(VLOOKUP(Z$1,仕様の整理!$C:$Q,5,0)=\"○\",\"\",\"《新規登録技術》\")","v":"Newスリーブ注入工法（事後評価未実施技術）"},null,{"$f":"IF(VLOOKUP(AB$1,仕様の整理!$C:$Q,4,0)=\"NETIS掲載期間終了技術\",VLOOKUP(AB$1,仕様の整理!$C:$Q,2,0),VLOOKUP(AB$1,仕様の整理!$C:$Q,2,0)&\"（\"&VLOOKUP(AB$1,仕様の整理!$C:$Q,4,0)&\"）\")&IF(VLOOKUP(AB$1,仕様の整理!$C:$Q,5,0)=\"○\",\"\",\"《新規登録技術》\")","v":"Newスリーブ注入工法（事後評価未実施技術）"},null,{"$f":"IF(VLOOKUP(AD$1,仕様の整理!$C:$Q,4,0)=\"NETIS掲載期間終了技術\",VLOOKUP(AD$1,仕様の整理!$C:$Q,2,0),VLOOKUP(AD$1,仕様の整理!$C:$Q,2,0)&\"（\"&VLOOKUP(AD$1,仕様の整理!$C:$Q,4,0)&\"）\")&IF(VLOOKUP(AD$1,仕様の整理!$C:$Q,5,0)=\"○\",\"\",\"《新規登録技術》\")","v":"パーマロックASFシリーズ（事後評価未実施技術）"},null,{"$f":"IF(VLOOKUP(AF$1,仕様の整理!$C:$Q,4,0)=\"NETIS掲載期間終了技術\",VLOOKUP(AF$1,仕様の整理!$C:$Q,2,0),VLOOKUP(AF$1,仕様の整理!$C:$Q,2,0)&\"（\"&VLOOKUP(AF$1,仕様の整理!$C:$Q,4,0)&\"）\")&IF(VLOOKUP(AF$1,仕様の整理!$C:$Q,5,0)=\"○\",\"\",\"《新規登録技術》\")","v":"パーマロックASFシリーズ（事後評価未実施技術）"},null,{"$f":"IF(VLOOKUP(AH$1,仕様の整理!$C:$Q,4,0)=\"NETIS掲載期間終了技術\",VLOOKUP(AH$1,仕様の整理!$C:$Q,2,0),VLOOKUP(AH$1,仕様の整理!$C:$Q,2,0)&\"（\"&VLOOKUP(AH$1,仕様の整理!$C:$Q,4,0)&\"）\")&IF(VLOOKUP(AH$1,仕様の整理!$C:$Q,5,0)=\"○\",\"\",\"《新規登録技術》\")","v":"耐久性無機溶液型シリカゾルグラウトシリーズ（事後評価未実施技術）"},null,{"$f":"IF(VLOOKUP(AJ$1,仕様の整理!$C:$Q,4,0)=\"NETIS掲載期間終了技術\",VLOOKUP(AJ$1,仕様の整理!$C:$Q,2,0),VLOOKUP(AJ$1,仕様の整理!$C:$Q,2,0)&\"（\"&VLOOKUP(AJ$1,仕様の整理!$C:$Q,4,0)&\"）\")&IF(VLOOKUP(AJ$1,仕様の整理!$C:$Q,5,0)=\"○\",\"\",\"《新規登録技術》\")","v":"耐久性無機溶液型シリカゾルグラウトシリーズ（事後評価未実施技術）"},null,{"$f":"IF(VLOOKUP(AL$1,仕様の整理!$C:$Q,4,0)=\"NETIS掲載期間終了技術\",VLOOKUP(AL$1,仕様の整理!$C:$Q,2,0),VLOOKUP(AL$1,仕様の整理!$C:$Q,2,0)&\"（\"&VLOOKUP(AL$1,仕様の整理!$C:$Q,4,0)&\"）\")&IF(VLOOKUP(AL$1,仕様の整理!$C:$Q,5,0)=\"○\",\"\",\"《新規登録技術》\")","v":"懸濁型超微粒子複合シリカグラウト「ハイブリッドシリカ・シリーズ」（事後評価未実施技術）"},null,{"$f":"IF(VLOOKUP(AN$1,仕様の整理!$C:$Q,4,0)=\"NETIS掲載期間終了技術\",VLOOKUP(AN$1,仕様の整理!$C:$Q,2,0),VLOOKUP(AN$1,仕様の整理!$C:$Q,2,0)&\"（\"&VLOOKUP(AN$1,仕様の整理!$C:$Q,4,0)&\"）\")&IF(VLOOKUP(AN$1,仕様の整理!$C:$Q,5,0)=\"○\",\"\",\"《新規登録技術》\")","v":"懸濁型超微粒子複合シリカグラウト「ハイブリッドシリカ・シリーズ」（事後評価未実施技術）"},null,{"$f":"IF(VLOOKUP(AP$1,仕様の整理!$C:$Q,4,0)=\"NETIS掲載期間終了技術\",VLOOKUP(AP$1,仕様の整理!$C:$Q,2,0),VLOOKUP(AP$1,仕様の整理!$C:$Q,2,0)&\"（\"&VLOOKUP(AP$1,仕様の整理!$C:$Q,4,0)&\"）\")&IF(VLOOKUP(AP$1,仕様の整理!$C:$Q,5,0)=\"○\",\"\",\"《新規登録技術》\")","v":"二重管ストレーナ工法用比例注入装置「プロポーション注入工法」（事後評価未実施技術）"},null,{"$f":"IF(VLOOKUP(AR$1,仕様の整理!$C:$Q,4,0)=\"NETIS掲載期間終了技術\",VLOOKUP(AR$1,仕様の整理!$C:$Q,2,0),VLOOKUP(AR$1,仕様の整理!$C:$Q,2,0)&\"（\"&VLOOKUP(AR$1,仕様の整理!$C:$Q,4,0)&\"）\")&IF(VLOOKUP(AR$1,仕様の整理!$C:$Q,5,0)=\"○\",\"\",\"《新規登録技術》\")","v":"二重管ストレーナ工法用比例注入装置「プロポーション注入工法」（事後評価未実施技術）"}]
[null,"①","ＮＥＴＩＳ登録番号",null,null,{"$f":"IF(VLOOKUP(F$1,仕様の整理!$C:$J,4,0)=\"NETIS掲載期間終了技術\",\"NETIS掲載期間終了技術\",VLOOKUP(F$1,仕様の整理!$C:$J,3,0))","v":"NETIS掲載期間終了技術"},null,{"$f":"IF(VLOOKUP(H$1,仕様の整理!$C:$J,4,0)=\"NETIS掲載期間終了技術\",\"NETIS掲載期間終了技術\",VLOOKUP(H$1,仕様の整理!$C:$J,3,0))","v":"NETIS掲載期間終了技術"},null,{"$f":"IF(VLOOKUP(J$1,仕様の整理!$C:$J,4,0)=\"NETIS掲載期間終了技術\",\"NETIS掲載期間終了技術\",VLOOKUP(J$1,仕様の整理!$C:$J,3,0))","v":"NETIS掲載期間終了技術"},null,{"$f":"IF(VLOOKUP(L$1,仕様の整理!$C:$J,4,0)=\"NETIS掲載期間終了技術\",\"NETIS掲載期間終了技術\",VLOOKUP(L$1,仕様の整理!$C:$J,3,0))","v":"NETIS掲載期間終了技術"},null,{"$f":"IF(VLOOKUP(N$1,仕様の整理!$C:$J,4,0)=\"NETIS掲載期間終了技術\",\"NETIS掲載期間終了技術\",VLOOKUP(N$1,仕様の整理!$C:$J,3,0))","v":"CB-180008-A"},null,{"$f":"IF(VLOOKUP(P$1,仕様の整理!$C:$J,4,0)=\"NETIS掲載期間終了技術\",\"NETIS掲載期間終了技術\",VLOOKUP(P$1,仕様の整理!$C:$J,3,0))","v":"CB-180008-A"},null,{"$f":"IF(VLOOKUP(R$1,仕様の整理!$C:$J,4,0)=\"NETIS掲載期間終了技術\",\"NETIS掲載期間終了技術\",VLOOKUP(R$1,仕様の整理!$C:$J,3,0))","v":"CB-180028-A"},null,{"$f":"IF(VLOOKUP(T$1,仕様の整理!$C:$J,4,0)=\"NETIS掲載期間終了技術\",\"NETIS掲載期間終了技術\",VLOOKUP(T$1,仕様の整理!$C:$J,3,0))","v":"CB-180028-A"},null,{"$f":"IF(VLOOKUP(V$1,仕様の整理!$C:$J,4,0)=\"NETIS掲載期間終了技術\",\"NETIS掲載期間終了技術\",VLOOKUP(V$1,仕様の整理!$C:$J,3,0))","v":"KT-190012-A"},null,{"$f":"IF(VLOOKUP(X$1,仕様の整理!$C:$J,4,0)=\"NETIS掲載期間終了技術\",\"NETIS掲載期間終了技術\",VLOOKUP(X$1,仕様の整理!$C:$J,3,0))","v":"KT-190012-A"},null,{"$f":"IF(VLOOKUP(Z$1,仕様の整理!$C:$J,4,0)=\"NETIS掲載期間終了技術\",\"NETIS掲載期間終了技術\",VLOOKUP(Z$1,仕様の整理!$C:$J,3,0))","v":"KT-190012-A"},null,{"$f":"IF(VLOOKUP(AB$1,仕様の整理!$C:$J,4,0)=\"NETIS掲載期間終了技術\",\"NETIS掲載期間終了技術\",VLOOKUP(AB$1,仕様の整理!$C:$J,3,0))","v":"KT-190012-A"},null,{"$f":"IF(VLOOKUP(AD$1,仕様の整理!$C:$J,4,0)=\"NETIS掲載期間終了技術\",\"NETIS掲載期間終了技術\",VLOOKUP(AD$1,仕様の整理!$C:$J,3,0))","v":"KT-190051-A"},null,{"$f":"IF(VLOOKUP(AF$1,仕様の整理!$C:$J,4,0)=\"NETIS掲載期間終了技術\",\"NETIS掲載期間終了技術\",VLOOKUP(AF$1,仕様の整理!$C:$J,3,0))","v":"KT-190051-A"},null,{"$f":"IF(VLOOKUP(AH$1,仕様の整理!$C:$J,4,0)=\"NETIS掲載期間終了技術\",\"NETIS掲載期間終了技術\",VLOOKUP(AH$1,仕様の整理!$C:$J,3,0))","v":"KT-200081-A"},null,{"$f":"IF(VLOOKUP(AJ$1,仕様の整理!$C:$J,4,0)=\"NETIS掲載期間終了技術\",\"NETIS掲載期間終了技術\",VLOOKUP(AJ$1,仕様の整理!$C:$J,3,0))","v":"KT-200081-A"},null,{"$f":"IF(VLOOKUP(AL$1,仕様の整理!$C:$J,4,0)=\"NETIS掲載期間終了技術\",\"NETIS掲載期間終了技術\",VLOOKUP(AL$1,仕様の整理!$C:$J,3,0))","v":"KT-220015-A"},null,{"$f":"IF(VLOOKUP(AN$1,仕様の整理!$C:$J,4,0)=\"NETIS掲載期間終了技術\",\"NETIS掲載期間終了技術\",VLOOKUP(AN$1,仕様の整理!$C:$J,3,0))","v":"KT-220015-A"},null,{"$f":"IF(VLOOKUP(AP$1,仕様の整理!$C:$J,4,0)=\"NETIS掲載期間終了技術\",\"NETIS掲載期間終了技術\",VLOOKUP(AP$1,仕様の整理!$C:$J,3,0))","v":"QS-240013-A"},null,{"$f":"IF(VLOOKUP(AR$1,仕様の整理!$C:$J,4,0)=\"NETIS掲載期間終了技術\",\"NETIS掲載期間終了技術\",VLOOKUP(AR$1,仕様の整理!$C:$J,3,0))","v":"QS-240013-A"}]
[null,"②","技術の位置付け（有用な新技術）",null,null,"[設計比較][活用促進]",null,"[設計比較][活用促進]",null,"[H26準推奨][設計比較]",null,"[H26準推奨][設計比較]",null,"-",null,"-",null,"-",null,"-",null,"-",null,"-",null,"-",null,"-",null,"-",null,"-",null,"-",null,"-",null,"-",null,"-",null,"-",null,"-"]
[null,"③","開発者（本社が存在する都道府県）",null,null,"五洋建設株式会社（東京都）",null,"五洋建設株式会社（東京都）",null,"五洋建設株式会社（東京都）",null,"五洋建設株式会社（東京都）",null,"液状化対策統括工法協会（愛知県）",null,"液状化対策統括工法協会（愛知県）",null,"太洋基礎工業株式会社（愛知県）",null,"太洋基礎工業株式会社（愛知県）",null,"日特建設株式会社（東京都）",null,"日特建設株式会社（東京都）",null,"日特建設株式会社（東京都）",null,"日特建設株式会社（東京都）",null,"強化土エンジニヤリング株式会社（東京都）",null,"強化土エンジニヤリング株式会社（東京都）",null,"強化土エンジニヤリング株式会社(東京都）",null,"強化土エンジニヤリング株式会社(東京都）",null,"強化土エンジニヤリング株式会社（東京都）",null,"強化土エンジニヤリング株式会社（東京都）",null,"強化土エンジニヤリング株式会社（東京都）、東陽商事株式会社（東京都）、東曹産業株式会社（東京都）、ジャテック株式会社（東京都）",null,"強化土エンジニヤリング株式会社（東京都）、東陽商事株式会社（東京都）、東曹産業株式会社（東京都）、ジャテック株式会社（東京都）"]
[null,"④","開発者における九州地方との関連性（九州登録九州本社：◎、\n九州外登録九州本社：○、九州に共同開発者有り：△、その他：－）",null,null,"△（九州大学大学院）",null,"△（九州大学大学院）",null,"-",null,"-",null,"-",null,"-",null,"-",null,"-",null,"-",null,"-",null,"-",null,"-",null,"-",null,"-",null,"-",null,"-",null,"-",null,"-",null,"九州に共同開発者有り：△",null,"九州に共同開発者有り：△"]
[null,"⑤","九州地方への機能性（九州地方に支店等を有する場合：○、その他：－）",null,null,"○（九州地方に支店等を有する）",null,"○（九州地方に支店等を有する）",null,"○（九州地方に支店等を有する）",null,"○（九州地方に支店等を有する）",null,"-",null,"-",null,"○（九州地方に支店を有する）",null,"○（九州地方に支店を有する）",null,"○（九州地方に支店を有する）",null,"○（九州地方に支店を有する）",null,"○（九州地方に支店を有する）",null,"○（九州地方に支店を有する）",null,"-",null,"-",null,"-",null,"-",null,"-",null,"-",null,"-",null,"-"]
[null,"⑥","技術概要",null,null,"本技術は、既設構造物の直下に浸透性の高い薬液を浸透注入する地盤改良技術で、従来は、超微粒子セメントで対応していた。本技術の活用により、1回の注入で直径2～3mの大きな改良体を作成でき、削孔本数が低減できるため、経済性が向上する。",null,"本技術は、既設構造物の直下に浸透性の高い薬液を浸透注入する地盤改良技術で、従来は、超微粒子セメントで対応していた。本技術の活用により、1回の注入で直径2～3mの大きな改良体を作成でき、削孔本数が低減できるため、経済性が向上する。",null,"本技術は、構造物直下等の地盤改良を目的として地盤中の計画路線に対して正確に誘導削孔する技術である。従来は地上からの直斜削孔や立坑からの水平削孔で対応していた。本技術の活用により、削孔精度と長距離施工性の向上、工期・コスト低減が期待できる。",null,"本技術は、構造物直下等の地盤改良を目的として地盤中の計画路線に対して正確に誘導削孔する技術である。従来は地上からの直斜削孔や立坑からの水平削孔で対応していた。本技術の活用により、削孔精度と長距離施工性の向上、工期・コスト低減が期待できる。",null,"本技術は超音波振動を併用しながら施工する薬液注入工法である。従来工法に比べて注入材の浸透性能が大幅に向上し高品質の改良体を形成する。ゲルタイムの長い注入材を用いて確実に浸透させるため、広範な液状化対策や隆起変状が懸念される構造物の近接施工に適する。",null,"本技術は超音波振動を併用しながら施工する薬液注入工法である。従来工法に比べて注入材の浸透性能が大幅に向上し高品質の改良体を形成する。ゲルタイムの長い注入材を用いて確実に浸透させるため、広範な液状化対策や隆起変状が懸念される構造物の近接施工に適する。",null,"本工法は、薬液注入工事にて使用する注入工法である。本工法では、地山パッカによる削孔穴からの薬液漏洩防止機能の強化,特殊シール材による大きな薬液浸透源の確保,薬液注入の集中管理システムによる注入管理の効率化により従来工法と比較して注入効率を高めている。",null,"本工法は、薬液注入工事にて使用する注入工法である。本工法では、地山パッカによる削孔穴からの薬液漏洩防止機能の強化,特殊シール材による大きな薬液浸透源の確保,薬液注入の集中管理システムによる注入管理の効率化により従来工法と比較して注入効率を高めている。",null,"本技術は、注入材料の吐出・浸透注入区間を長くした薬液注入工法で、従来はダブルパッカー工法で対応していた。本技術の活用により、注入作業の高速化と注入孔数が削減され、経済性の向上と工期短縮が図れます。",null,"本技術は、注入材料の吐出・浸透注入区間を長くした薬液注入工法で、従来はダブルパッカー工法で対応していた。本技術の活用により、注入作業の高速化と注入孔数が削減され、経済性の向上と工期短縮が図れます。",null,"本技術は、注入材料の吐出・浸透注入区間を長くした薬液注入工法で、従来はダブルパッカー工法で対応していた。本技術の活用により、注入作業の高速化と注入孔数が削減され、経済性の向上と工期短縮が図れます。",null,"本技術は、注入材料の吐出・浸透注入区間を長くした薬液注入工法で、従来はダブルパッカー工法で対応していた。本技術の活用により、注入作業の高速化と注入孔数が削減され、経済性の向上と工期短縮が図れます。",null,"本技術は薬液注入工法に用いる液状化対策用溶液型恒久注入材で、従来はセメント系固化材(JG-1号)で対応していた。本技術は土粒子間浸透による改良であり、地盤構造を破壊せずに大量の建設泥土も発生しない、小型設備での対策が可能であり、経済性の向上が図れます。  ",null,"本技術は薬液注入工法に用いる液状化対策用溶液型恒久注入材で、従来はセメント系固化材(JG-1号)で対応していた。本技術は土粒子間浸透による改良であり、地盤構造を破壊せずに大量の建設泥土も発生しない、小型設備での対策が可能であり、経済性の向上が図れます。  ",null,"本技術は、地盤改良に用いる注入材で水ガラスの劣化を抑えたシリカゾルをベースとした無機溶液型シリカゾルグラウトであり、従来は溶液型水ガラスグラウト（有機系）で対応していた。本技術の活用によりシリカの溶脱を抑え、改良体の耐久性・改良地盤の経済性が向上する。",null,"本技術は、地盤改良に用いる注入材で水ガラスの劣化を抑えたシリカゾルをベースとした無機溶液型シリカゾルグラウトであり、従来は溶液型水ガラスグラウト（有機系）で対応していた。本技術の活用によりシリカの溶脱を抑え、改良体の耐久性・改良地盤の経済性が向上する。",null,"本技術は、地盤改良に用いる高強度薬液注入材で、従来は、高圧噴射二重管工法のセメント系固化材で対応していた。本技術の活用により、従来技術で見られた建設汚泥処理が減少するため経済性向上・周辺環境への影響が抑制される。",null,"本技術は、地盤改良に用いる高強度薬液注入材で、従来は、高圧噴射二重管工法のセメント系固化材で対応していた。本技術の活用により、従来技術で見られた建設汚泥処理が減少するため経済性向上・周辺環境への影響が抑制される。",null,"本技術は薬液注入工に関する技術である。従来は瞬結・緩結切替えでタイムラグが発生しpH・ゲルタイムも瞬時に確認できなかった。新技術では瞬時に切替えられpH・ゲルタイムも瞬時に確認でき、注入材にシリカゾルグラウトを用いることで単価が抑えられ経済性が向上する。",null,"本技術は薬液注入工に関する技術である。従来は瞬結・緩結切替えでタイムラグが発生しpH・ゲルタイムも瞬時に確認できなかった。新技術では瞬時に切替えられpH・ゲルタイムも瞬時に確認でき、注入材にシリカゾルグラウトを用いることで単価が抑えられ経済性が向上する。"]
[null,"⑦","概要図"]
[null,"⑧","施工条件・適用条件等","施工方法",null,"低圧・浸透注入工法",null,"低圧・浸透注入工法",null,"【地上からの構造物直下等の削孔による浸透固化処理工法】",null,"【地上からの構造物直下等の削孔による浸透固化処理工法】",null,"超音波振動による浸透注入",null,"超音波振動による浸透注入",null,"地山パッカとシールグラウトを併用した薬液注入工法",null,"地山パッカとシールグラウトを併用した薬液注入工法",null,"長い浸透注入区間から高速・高品質に地盤を改良できる薬液注入工法",null,"長い浸透注入区間から高速・高品質に地盤を改良できる薬液注入工法",null,"長い浸透注入区間から高速・高品質に地盤を改良できる薬液注入工法",null,"長い浸透注入区間から高速・高品質に地盤を改良できる薬液注入工法",null,"現在使用されているあらゆる薬液注入工法に適用可能",null,"現在使用されているあらゆる薬液注入工法に適用可能",null,"ダブルパッカ工法(従来技術と同様の施工方法は適用可能）",null,"ダブルパッカ工法(従来技術と同様の施工方法は適用可能）",null,"ダブルパッカー工法",null,"ダブルパッカー工法",null,"二重管ストレーナ工法【複相式】",null,"二重管ストレーナ工法【複相式】"]
[null,null,null,"薬液の種類",null,"【特殊水ガラス（シリカコロイド）：水ガラス中のアルカリ分（Na2O）を除去した注入材）】",null,"【特殊水ガラス（シリカコロイド）：水ガラス中のアルカリ分（Na2O）を除去した注入材）】",null,"【特殊水ガラス（シリカコロイド）：水ガラス中のアルカリ分（Na2O）を除去した注入材）】",null,"【特殊水ガラス（シリカコロイド）：水ガラス中のアルカリ分（Na2O）を除去した注入材）】",null,"シリカゾル系",null,"シリカゾル系",null,"特殊シリカ液",null,"特殊シリカ液",null,"セメントベントナイト、無機溶液型中結材料",null,"セメントベントナイト、無機溶液型中結材料",null,"セメントベントナイト、無機溶液型中結材料",null,"セメントベントナイト、無機溶液型中結材料",null,"溶液型恒久注入材(活性複合シリカグラウト)",null,"溶液型恒久注入材(活性複合シリカグラウト)",null,"耐久性無機溶液型シリカゾルグラウト",null,"耐久性無機溶液型シリカゾルグラウト",null,"無機系の懸濁型超微粒子複合シリカグラウト",null,"無機系の懸濁型超微粒子複合シリカグラウト",null,"シリカゾルグラウト",null,"シリカゾルグラウト"]
[null,null,null,"改良深度",null,"最大施工深度：20m程度",null,"最大施工深度：20m程度",null,"削孔距離:1本当たり最長100m程度（曲線部含む）　【削孔距離:1本当たり最長200m程度】",null,"削孔距離:1本当たり最長100m程度（曲線部含む）　【削孔距離:1本当たり最長200m程度】",null,"改良深度50m程度",null,"改良深度50m程度",null,"【最大施工深度：30ｍ】",null,"【最大施工深度：30ｍ】",null,"1ｍ以上50ｍ未満",null,"1ｍ以上50ｍ未満",null,"1ｍ以上50ｍ未満",null,"1ｍ以上50ｍ未満",null,"【最大改良深度：45ｍ】",null,"【最大改良深度：45ｍ】",null,"【最大改良深度：50ｍ】",null,"【最大改良深度：50ｍ】",null,"【最大改良深度50ｍ】",null,"【最大改良深度50ｍ】",null,"【25ｍ程度】",null,"【25ｍ程度】"]
[null,null,null,"土質条件",null,"液状化の可能性のある砂質土地盤（Fc細粒分含有率≦40％）\n【N≦30、Fc≦40％、ただしFc≧20％以上の場合、浸透性の事前確認が望ましい】",null,"液状化の可能性のある砂質土地盤（Fc細粒分含有率≦40％）\n【N≦30、Fc≦40％、ただしFc≧20％以上の場合、浸透性の事前確認が望ましい】",null,"N≦20の地盤　【砂質土N≦30、細粒分含有率Fc≦40%】",null,"N≦20の地盤　【砂質土N≦30、細粒分含有率Fc≦40%】",null,"砂礫、砂:制限なし、粘性土:N値8以下\n【液状化対策を目的とした注入の場合は、砂質土地盤の細粒分含有率40％程度まで】",null,"砂礫、砂:制限なし、粘性土:N値8以下\n【液状化対策を目的とした注入の場合は、砂質土地盤の細粒分含有率40％程度まで】",null,"砂質土地盤【N≦50】、細粒分含有率Fc≦40%",null,"砂質土地盤【N≦50】、細粒分含有率Fc≦40%",null,"・細粒分含有率Fｃが10％以下の砂質土地盤や砂礫地盤　・粘性土地盤（要検討）\n【注入形態・・・砂質土（Fc≦10％）：低圧による注入、砂質土（Fc＞10％）：適用不可、粘性土：割裂注入で施工可能】",null,"・細粒分含有率Fｃが10％以下の砂質土地盤や砂礫地盤　・粘性土地盤（要検討）\n【注入形態・・・砂質土（Fc≦10％）：低圧による注入、砂質土（Fc＞10％）：適用不可、粘性土：割裂注入で施工可能】",null,"・細粒分含有率Fｃが10％以下の砂質土地盤や砂礫地盤　・粘性土地盤（要検討）\n【注入形態・・・砂質土（Fc≦10％）：低圧による注入、砂質土（Fc＞10％）：適用不可、粘性土：割裂注入で施工可能】",null,"・細粒分含有率Fｃが10％以下の砂質土地盤や砂礫地盤　・粘性土地盤（要検討）\n【注入形態・・・砂質土（Fc≦10％）：低圧による注入、砂質土（Fc＞10％）：適用不可、粘性土：割裂注入で施工可能】",null,"・細粒分含有率40%未満の砂質地盤（10％未満の砂質地盤の場合特に効果が高い）",null,"・細粒分含有率40%未満の砂質地盤（10％未満の砂質地盤の場合特に効果が高い）",null,"・砂質土、砂礫土、礫質土地盤　【細粒分含有率Fc≦40】",null,"・砂質土、砂礫土、礫質土地盤　【細粒分含有率Fc≦40】",null,"【砂質土】細粒分含有率Fc＜40％",null,"【砂質土】細粒分含有率Fc＜40％",null,"砂質土、砂礫土、礫質土",null,"砂質土、砂礫土、礫質土"]
[null,null,null,"適用不可範囲",null,"細粒分含有率Fc>40%の地盤",null,"細粒分含有率Fc>40%の地盤",null,"こぶし大以上の巨礫が多数存在する地盤、岩盤",null,"こぶし大以上の巨礫が多数存在する地盤、岩盤",null,"特になし",null,"特になし",null,"地下水位以浅の地盤、電気伝導率1000μS/ cm以下の地下水地盤",null,"地下水位以浅の地盤、電気伝導率1000μS/ cm以下の地下水地盤",null,"・施工深度が50m以上　・注入対象層の土被り長が1m未満　・地表部に構造物や地中に埋設管などがあり、注入パイプを所定の配置間隔で設置できない場合",null,"・施工深度が50m以上　・注入対象層の土被り長が1m未満　・地表部に構造物や地中に埋設管などがあり、注入パイプを所定の配置間隔で設置できない場合",null,"・施工深度が50m以上　・注入対象層の土被り長が1m未満　・地表部に構造物や地中に埋設管などがあり、注入パイプを所定の配置間隔で設置できない場合",null,"・施工深度が50m以上　・注入対象層の土被り長が1m未満　・地表部に構造物や地中に埋設管などがあり、注入パイプを所定の配置間隔で設置できない場合",null,"・細粒分含有率40%以上の砂質地盤および粘性土地盤",null,"・細粒分含有率40%以上の砂質地盤および粘性土地盤",null,"・粘性土地盤",null,"・粘性土地盤",null,"細粒分含有率Fc≧40％",null,"細粒分含有率Fc≧40％",null,"粘性土",null,"粘性土"]
[null,null,null,"改良強度",null,"50～100kN/㎡　【施工直後105.6kN/㎡であった改良地盤で、11年後147.6kN/㎡】",null,"50～100kN/㎡　【施工直後105.6kN/㎡であった改良地盤で、11年後147.6kN/㎡】",null,"【50～100kN/㎡】",null,"【50～100kN/㎡】",null,"-",null,"-",null,"qu=50～150kN/ｍ2",null,"qu=50～150kN/ｍ2",null,"一軸圧縮強度が121.7～201.7kN/m2であることを確認",null,"一軸圧縮強度が121.7～201.7kN/m2であることを確認",null,"一軸圧縮強度が121.7～201.7kN/m2であることを確認",null,"一軸圧縮強度が121.7～201.7kN/m2であることを確認",null,"施工1年後の－軸圧縮強度qu=170kN/ｍ2～225kN/m2（コアサンプリングによる確認（パーマロック・ASF-Ⅱ・6%）",null,"施工1年後の－軸圧縮強度qu=170kN/ｍ2～225kN/m2（コアサンプリングによる確認（パーマロック・ASF-Ⅱ・6%）",null,"200～450ｋN/m2",null,"200～450ｋN/m2",null,"一軸圧縮強度2,000～3,500ｋN/m2",null,"一軸圧縮強度2,000～3,500ｋN/m2",null,"【qu=100～400kN/m2】",null,"【qu=100～400kN/m2】"]
[null,null,null,"作業空間",null,"削孔機専有面積：10㎡、プラント設置面積：15m×15m(標準)、上空制限4m　【施工ヤード100㎡以上、プラントヤード150㎡以上】",null,"削孔機専有面積：10㎡、プラント設置面積：15m×15m(標準)、上空制限4m　【施工ヤード100㎡以上、プラントヤード150㎡以上】",null,"・削孔機械の大きさ:L8.2m×W2.4m×H2.5m　【施工ヤード100㎡以上、プラントヤード150㎡以上】",null,"・削孔機械の大きさ:L8.2m×W2.4m×H2.5m　【施工ヤード100㎡以上、プラントヤード150㎡以上】",null,"削孔工設備 5×10=50㎡、一次注入工設備 4×14= 56㎡、二次注入工設備 8×10=80㎡",null,"削孔工設備 5×10=50㎡、一次注入工設備 4×14= 56㎡、二次注入工設備 8×10=80㎡",null,"削孔：プラン ト設置面積は50m2/2セット、ボーリングマシン．ドリリングマシンの占有面積3m2～10m2程度、薬液注入：プラント設置面積7m×16m=112m2(標準)",null,"削孔：プラン ト設置面積は50m2/2セット、ボーリングマシン．ドリリングマシンの占有面積3m2～10m2程度、薬液注入：プラント設置面積7m×16m=112m2(標準)",null,"施工ヤードとして最小作業スペースが50㎡(5m×10m)必要　・プラント設置ヤードとして最小設置スペースが100㎡(10m×10m)必要",null,"施工ヤードとして最小作業スペースが50㎡(5m×10m)必要　・プラント設置ヤードとして最小設置スペースが100㎡(10m×10m)必要",null,"施工ヤードとして最小作業スペースが50㎡(5m×10m)必要　・プラント設置ヤードとして最小設置スペースが100㎡(10m×10m)必要",null,"施工ヤードとして最小作業スペースが50㎡(5m×10m)必要　・プラント設置ヤードとして最小設置スペースが100㎡(10m×10m)必要",null,"・混練や圧送等に要する注入プラントとして14.0m×7.0m程度が必要。【施工ヤード49m2以上】",null,"・混練や圧送等に要する注入プラントとして14.0m×7.0m程度が必要。【施工ヤード49m2以上】",null,"・プラント用地として、50m2～100m2程度が必要（ダブルパッカ工法、注入4セット）",null,"・プラント用地として、50m2～100m2程度が必要（ダブルパッカ工法、注入4セット）",null,"【プランヤード100ｍ2+施工ヤード24ｍ2以上，上空制限2.3ｍ】",null,"【プランヤード100ｍ2+施工ヤード24ｍ2以上，上空制限2.3ｍ】",null,"プラント用地として、50～100m2程度が必要（二重管ストレーナ工法、2～4セット）",null,"プラント用地として、50～100m2程度が必要（二重管ストレーナ工法、2～4セット）"]
[null,null,null,"施工管理",null,"-",null,"-",null,"ロッド先端部の3D曲がりセンサー、小型ジャイロと双方向通信を行い、削孔軌跡や削孔ロッドの姿勢・形状データなどをリアルタイムで確認できる。",null,"ロッド先端部の3D曲がりセンサー、小型ジャイロと双方向通信を行い、削孔軌跡や削孔ロッドの姿勢・形状データなどをリアルタイムで確認できる。",null,"-",null,"-",null,"集中管理 システムにより、16ポイントの注入口の集中管理が可能",null,"集中管理 システムにより、16ポイントの注入口の集中管理が可能",null,"-",null,"-",null,"-",null,"-",null,"-",null,"-",null,"-",null,"-",null,"-",null,"-",null,"A液流量から関係表よりpH及びゲルタイムがリアルタイムに把握できることを確認",null,"A液流量から関係表よりpH及びゲルタイムがリアルタイムに把握できることを確認"]
[null,null,null,"周辺地盤等への影響",null,"薬液を低圧で浸透注入するため、地盤の隆起などが生じず、既設構造物直下の液状化対策に利用できる。",null,"薬液を低圧で浸透注入するため、地盤の隆起などが生じず、既設構造物直下の液状化対策に利用できる。",null,"立坑構築等の大規模仮設工事が不要なので、既設構造物への影響が少なく、供用しながら作業できる。",null,"立坑構築等の大規模仮設工事が不要なので、既設構造物への影響が少なく、供用しながら作業できる。",null,"浸透性能の向上により地盤隆起や変状が起きにくくなる",null,"浸透性能の向上により地盤隆起や変状が起きにくくなる",null,"低圧注入が可能であり、既存施設直下、地下構造物周辺の地盤の改良が可能",null,"低圧注入が可能であり、既存施設直下、地下構造物周辺の地盤の改良が可能",null,"最大隆起量は5mm以下を確認（構造物周辺での施工時は動態観測を実施する。）",null,"最大隆起量は5mm以下を確認（構造物周辺での施工時は動態観測を実施する。）",null,"最大隆起量は5mm以下を確認（構造物周辺での施工時は動態観測を実施する。）",null,"最大隆起量は5mm以下を確認（構造物周辺での施工時は動態観測を実施する。）",null,"低吐出量・低圧力で注入が行うため、既設構造物や周辺環境への影響を抑制できる",null,"低吐出量・低圧力で注入が行うため、既設構造物や周辺環境への影響を抑制できる",null,"-",null,"-",null,"-",null,"-",null,"-",null,"-"]
[null,"⑨","比較する従来技術",null,null,"薬液注入工法(超微粒子セメント)",null,"薬液注入工法(超微粒子セメント)",null,"立坑からの水平削孔による地盤改良工事",null,"立坑からの水平削孔による地盤改良工事",null,"二重管ダブルパッカ工法",null,"二重管ダブルパッカ工法",null,"二重管ダブルパッカ工法",null,"二重管ダブルパッカ工法",null,"ダブルパッカー工法",null,"ダブルパッカー工法",null,"ダブルパッカー工法",null,"ダブルパッカー工法",null,"高圧で地盤を撹拌混合するコラムジェットグラウト工法等に用いるセメント系固化材(JG-1号)",null,"高圧で地盤を撹拌混合するコラムジェットグラウト工法等に用いるセメント系固化材(JG-1号)",null,"溶液型水ガラスグラウト（有機系）",null,"溶液型水ガラスグラウト（有機系）",null,"高圧噴射撹拌工二重管工法（JSG工法）に用いるセメント系固化材（JG-1号）",null,"高圧噴射撹拌工二重管工法（JSG工法）に用いるセメント系固化材（JG-1号）",null,"二重管ストレーナ工法において、希釈水ガラスA液に対して瞬結材B液、緩結材C液を用いて、瞬結・緩結注入材に切替えて対応を行う技術",null,"二重管ストレーナ工法において、希釈水ガラスA液に対して瞬結材B液、緩結材C液を用いて、瞬結・緩結注入材に切替えて対応を行う技術"]
["評価情報","⑩","評価基準","項目",null,"最新の活用効果評価結果,所見",null,"最新の活用効果評価結果,所見",null,"最新の活用効果評価結果,所見",null,"最新の活用効果評価結果,所見",null,"最新の活用効果評価結果,所見",null,"最新の活用効果評価結果,所見",null,"最新の活用効果評価結果,所見",null,"最新の活用効果評価結果,所見",null,"最新の活用効果評価結果,所見",null,"最新の活用効果評価結果,所見",null,"最新の活用効果評価結果,所見",null,"最新の活用効果評価結果,所見",null,"最新の活用効果評価結果,所見",null,"最新の活用効果評価結果,所見",null,"最新の活用効果評価結果,所見",null,"最新の活用効果評価結果,所見",null,"最新の活用効果評価結果,所見",null,"最新の活用効果評価結果,所見",null,"最新の活用効果評価結果,所見",null,"最新の活用効果評価結果,所見"]
[null,null,"・A：従来技術より極めて優れる\n・B：従来技術より優れる\n・C：従来技術と同等\n・D：従来技術より劣る","経済性",null,"B:所見：削孔1箇所当りの改良範囲が大きいため削孔本数の減少が可能であることから施工性に優れ、コスト縮減が図られる。",null,"B所見：削孔1箇所当りの改良範囲が大きいため削孔本数の減少が可能であることから施工性に優れ、コスト縮減が図られる。",null,"C-",null,"C-",null,"-",null,"-",null,"-",null,"-",null,"-",null,"-",null,"-",null,"-",null,"-",null,"-",null,"-",null,"-",null,"-",null,"-",null,"-",null,"-"]
[null,null,null,"工程",null,"B:所見：削孔1箇所当りの改良範囲が大きいため削孔本数の減少が可能であることから施工性に優れ、工程短縮が図られる。",null,"B所見：削孔1箇所当りの改良範囲が大きいため削孔本数の減少が可能であることから施工性に優れ、工程短縮が図られる。",null,"C留意事項：削孔が回転と圧入のみであるため、巨礫等が点在する土質においては、掘り直しに時間を要する。",null,"C留意事項：削孔が回転と圧入のみであるため、巨礫等が点在する土質においては、掘り直しに時間を要する。",null,"-",null,"-",null,"-",null,"-",null,"-",null,"-",null,"-",null,"-",null,"-",null,"-",null,"-",null,"-",null,"-",null,"-",null,"-",null,"-"]
[null,null,null,"品質・出来形",null,"B:所見：従来の水ガラスから劣化成分を取り除いた恒久薬液であるため長期的に劣化せず、改良体の耐久性向上が期待できる。留意事項：斜め削孔をする場合は、改良位置の精度を良くするため機械精度（角度調整等）に留意する必要がある。",null,"B所見：従来の水ガラスから劣化成分を取り除いた恒久薬液であるため長期的に劣化せず、改良体の耐久性向上が期待できる。留意事項：斜め削孔をする場合は、改良位置の精度を良くするため機械精度（角度調整等）に留意する必要がある。",null,"B所見：リアルタイムに削孔位置をモニターで確認できることにより、オペレーターが目標位置に誘導しやすく、重要な地中構造物を傷めず回避できるため、高品質の出来形が得られる。",null,"B所見：リアルタイムに削孔位置をモニターで確認できることにより、オペレーターが目標位置に誘導しやすく、重要な地中構造物を傷めず回避できるため、高品質の出来形が得られる。",null,"-",null,"-",null,"-",null,"-",null,"-",null,"-",null,"-",null,"-",null,"-",null,"-",null,"-",null,"-",null,"-",null,"-",null,"-",null,"-"]
[null,null,null,"安全性",null,"C:留意事項：薬液に非アルカリシリカを使う場合は、強酸性（ｐＨ3.0以下）の薬液であるため、反応濃度によりコンクリートに影響を与える恐れがあるので、コンクリート近傍で使用する場合、注意が必要である。",null,"C留意事項：薬液に非アルカリシリカを使う場合は、強酸性（ｐＨ3.0以下）の薬液であるため、反応濃度によりコンクリートに影響を与える恐れがあるので、コンクリート近傍で使用する場合、注意が必要である。",null,"A-",null,"A-",null,"-",null,"-",null,"-",null,"-",null,"-",null,"-",null,"-",null,"-",null,"-",null,"-",null,"-",null,"-",null,"-",null,"-",null,"-",null,"-"]
[null,null,null,"施工性",null,"B:留意事項：薬液を浸透圧入するため、地盤や周辺構造物への影響及び薬液の逸出による環境への影響を押えるために、現場の監視とともに適切な注入圧力・速度を管理する事が重要である。",null,"B留意事項：薬液を浸透圧入するため、地盤や周辺構造物への影響及び薬液の逸出による環境への影響を押えるために、現場の監視とともに適切な注入圧力・速度を管理する事が重要である。",null,"A留意事項：本技術は、削孔の入射角や曲率などの関係から施工深度が作業ヤードの広さに影響を与えるため、適用にあたっては現場施工条件に留意する必要がある。曲がり削孔の施工精度向上には、施工法・機器操作の熟練が必要である。",null,"A留意事項：本技術は、削孔の入射角や曲率などの関係から施工深度が作業ヤードの広さに影響を与えるため、適用にあたっては現場施工条件に留意する必要がある。曲がり削孔の施工精度向上には、施工法・機器操作の熟練が必要である。",null,"-",null,"-",null,"-",null,"-",null,"-",null,"-",null,"-",null,"-",null,"-",null,"-",null,"-",null,"-",null,"-",null,"-",null,"-",null,"-"]
[null,null,null,"環境",null,"B:所見：低圧で薬液を浸透注入することから近接構造物への影響が少ない。",null,"B所見：低圧で薬液を浸透注入することから近接構造物への影響が少ない。",null,"B所見：地上からの施工が可能であり、立坑構築・復旧に伴う仮設工事が不要のため、従来技術と比較して安全性、施工性、環境（振動・騒音）に優れている。　留意事項：削孔時に泥水が発生するため、リサイクルや産業廃棄物処理等の適切な処置が必要である。",null,"B所見：地上からの施工が可能であり、立坑構築・復旧に伴う仮設工事が不要のため、従来技術と比較して安全性、施工性、環境（振動・騒音）に優れている。　留意事項：削孔時に泥水が発生するため、リサイクルや産業廃棄物処理等の適切な処置が必要である。",null,"-",null,"-",null,"-",null,"-",null,"-",null,"-",null,"-",null,"-",null,"-",null,"-",null,"-",null,"-",null,"-",null,"-",null,"-",null,"-"]
[null,null,null,"総合評価",null,"B:留意事項：埋立地盤のような複合地盤では、施工前に詳細な土質調査を実施し、現場の細粒分含有率区分を確認する必要があり、確認された細粒分含有率区分に応じた注入率、注入量及び注入速度の再計画が必要である。",null,"B留意事項：埋立地盤のような複合地盤では、施工前に詳細な土質調査を実施し、現場の細粒分含有率区分を確認する必要があり、確認された細粒分含有率区分に応じた注入率、注入量及び注入速度の再計画が必要である。",null,"B留意事項：高精度位置検出装置(小型ジャイロ)は精密機械であるため、取扱いに注意が必要である。",null,"B留意事項：高精度位置検出装置(小型ジャイロ)は精密機械であるため、取扱いに注意が必要である。",null,"-",null,"-",null,"-",null,"-",null,"-",null,"-",null,"-",null,"-",null,"-",null,"-",null,"-",null,"-",null,"-",null,"-",null,"-",null,"-"]
["統一した従来技術",null,null,null,null,"薬液注入工（二重管ダブルパッカー工法），土質条件：砂質土（N=5、薬液注入率40.5％（1次注入：5％、2次注入：35.5％）），改良対象土量：1000㎥（改良長10m×縦横5×20m（土被り2m）、施工本数100本）",null,"薬液注入工（二重管ダブルパッカー工法），土質条件：砂質土（N=5、薬液注入率40.5％（1次注入：5％、2次注入：35.5％）），改良対象土量：1000㎥（改良長20m×縦横5×10m（土被り2m）、施工本数50本）",null,"薬液注入工（二重管ダブルパッカー工法），土質条件：砂質土（N=5、薬液注入率40.5％（1次注入：5％、2次注入：35.5％）），改良対象土量：1000㎥（改良長10m×縦横5×20m（土被り2m）、施工本数100本）",null,"薬液注入工（二重管ダブルパッカー工法），土質条件：砂質土（N=5、薬液注入率40.5％（1次注入：5％、2次注入：35.5％）），改良対象土量：1000㎥（改良長20m×縦横5×10m（土被り2m）、施工本数50本）",null,"薬液注入工（二重管ダブルパッカー工法），土質条件：砂質土（N=5、薬液注入率40.5％（1次注入：5％、2次注入：35.5％）），改良対象土量：1000㎥（改良長10m×縦横5×20m（土被り2m）、施工本数100本）",null,"薬液注入工（二重管ダブルパッカー工法），土質条件：砂質土（N=5、薬液注入率40.5％（1次注入：5％、2次注入：35.5％）），改良対象土量：1000㎥（改良長20m×縦横5×10m（土被り2m）、施工本数50本）",null,"薬液注入工（二重管ダブルパッカー工法），土質条件：砂質土（N=5、薬液注入率40.5％（1次注入：5％、2次注入：35.5％）），改良対象土量：1000㎥（改良長10m×縦横5×20m（土被り2m）、施工本数100本）",null,"薬液注入工（二重管ダブルパッカー工法），土質条件：砂質土（N=5、薬液注入率40.5％（1次注入：5％、2次注入：35.5％）），改良対象土量：1000㎥（改良長20m×縦横5×10m（土被り2m）、施工本数50本）",null,"薬液注入工（二重管ダブルパッカー工法），土質条件：砂質土（N=5、薬液注入率40.5％（1次注入：5％、2次注入：35.5％）），改良対象土量：1000㎥（改良長10m×縦横5×20m（土被り2m）、施工本数100本）",null,"薬液注入工（二重管ダブルパッカー工法），土質条件：砂質土（N=5、薬液注入率40.5％（1次注入：5％、2次注入：35.5％）），改良対象土量：1000㎥（改良長20m×縦横5×10m（土被り2m）、施工本数50本）",null,"薬液注入工（二重管ダブルパッカー工法），土質条件：粘性土（N=5、薬液注入率24％（1次注入：10％、2次注入：14％）），改良対象土量：1000㎥（改良長10m×縦横5×20m（土被り2m）、施工本数100本）",null,"薬液注入工（二重管ダブルパッカー工法），土質条件：粘性土（N=5、薬液注入率24％（1次注入：10％、2次注入：14％）），改良対象土量：1000㎥（改良長20m×縦横5×10m（土被り2m）、施工本数50本）",null,"薬液注入工（二重管ダブルパッカー工法），土質条件：砂質土（N=5、薬液注入率40.5％（1次注入：5％、2次注入：35.5％）），改良対象土量：1000㎥（改良長10m×縦横5×20m（土被り2m）、施工本数100本）",null,"薬液注入工（二重管ダブルパッカー工法），土質条件：砂質土（N=5、薬液注入率40.5％（1次注入：5％、2次注入：35.5％）），改良対象土量：1000㎥（改良長20m×縦横5×10m（土被り2m）、施工本数50本）",null,"薬液注入工（二重管ダブルパッカー工法），土質条件：砂質土（N=5、薬液注入率40.5％（1次注入：5％、2次注入：35.5％）），改良対象土量：1000㎥（改良長10m×縦横5×20m（土被り2m）、施工本数100本）",null,"薬液注入工（二重管ダブルパッカー工法），土質条件：砂質土（N=5、薬液注入率40.5％（1次注入：5％、2次注入：35.5％）），改良対象土量：1000㎥（改良長20m×縦横5×10m（土被り2m）、施工本数50本）",null,"薬液注入工（二重管ダブルパッカー工法），土質条件：砂質土（N=5、薬液注入率40.5％（1次注入：5％、2次注入：35.5％）），改良対象土量：1000㎥（改良長10m×縦横5×20m（土被り2m）、施工本数100本）",null,"薬液注入工（二重管ダブルパッカー工法），土質条件：砂質土（N=5、薬液注入率40.5％（1次注入：5％、2次注入：35.5％）），改良対象土量：1000㎥（改良長20m×縦横5×10m（土被り2m）、施工本数50本）",null,"薬液注入工（二重管ストレーナ工法複相方式），土質条件：砂質土（N=5、薬液注入率40.5％（1次注入：10.125％、2次注入：30.375％）），改良対象土量：1000㎥（改良長10m×縦横5×20m（土被り2m）、施工本数100本）",null,"薬液注入工（二重管ストレーナ工法複相方式），土質条件：砂質土（N=5、薬液注入率40.5％（1次注入：10.125％、2次注入：30.375％）），改良対象土量：1000㎥（改良長20m×縦横5×10m（土被り2m）、施工本数50本）"]
["補完資料等からの情報","⑪","工法の特徴",null,null,"粘性の小さい薬液を地盤の土粒子構造を変えることなく低圧浸透させるため、既設構造物にほとんど影響を与えず、施設を供用しながら液状化対策が施工できる。",null,"粘性の小さい薬液を地盤の土粒子構造を変えることなく低圧浸透させるため、既設構造物にほとんど影響を与えず、施設を供用しながら液状化対策が施工できる。",null,"新開発の削孔システム・位置検出システム・施工管理システムを用いて、既設構造物直下などの地上からの削孔が困難な地盤中を、高精度に削孔する",null,"新開発の削孔システム・位置検出システム・施工管理システムを用いて、既設構造物直下などの地上からの削孔が困難な地盤中を、高精度に削孔する",null,"従来の注入工法（二重管ダブルパッカ工法）とほぼ同等の設備と作業性のまま、超音波振動エネルギーの効果により薬液の浸透性能が向上し、高品質な改良体を作ることができる。",null,"従来の注入工法（二重管ダブルパッカ工法）とほぼ同等の設備と作業性のまま、超音波振動エネルギーの効果により薬液の浸透性能が向上し、高品質な改良体を作ることができる。",null,"新しい地山パッカによる削孔穴からの薬液漏洩防止機能の強化,特殊シール材による大きな薬液浸透源の確保,薬液注入の集中管理システムによる注入管理の効率化",null,"新しい地山パッカによる削孔穴からの薬液漏洩防止機能の強化,特殊シール材による大きな薬液浸透源の確保,薬液注入の集中管理システムによる注入管理の効率化",null,"注入外管を六角柱状にした新型注入パイプ「ポリゴンパイプ」を採用し、長い浸透注入区間を均質に地盤改良する事を可能",null,"注入外管を六角柱状にした新型注入パイプ「ポリゴンパイプ」を採用し、長い浸透注入区間を均質に地盤改良する事を可能",null,"注入外管を六角柱状にした新型注入パイプ「ポリゴンパイプ」を採用し、長い浸透注入区間を均質に地盤改良する事を可能",null,"注入外管を六角柱状にした新型注入パイプ「ポリゴンパイプ」を採用し、長い浸透注入区間を均質に地盤改良する事を可能",null,"薬液注入の劣化要因であるアルカリをイオン交換法により除去して得られた活性シリカコロイドをベースとした溶液型恒久注入材（活性複合シリカグラウト）",null,"薬液注入の劣化要因であるアルカリをイオン交換法により除去して得られた活性シリカコロイドをベースとした溶液型恒久注入材（活性複合シリカグラウト）",null,"「シリカゾルグラウト」は地盤改良の注入材で、水ガラスの劣化要因であるアルカリを酸で除去して得られたシリカゾルをベースとした耐久性のある無機溶液型注入材。",null,"「シリカゾルグラウト」は地盤改良の注入材で、水ガラスの劣化要因であるアルカリを酸で除去して得られたシリカゾルをベースとした耐久性のある無機溶液型注入材。",null,"高圧噴射撹拌工法と同等の地盤改良強度が発現できる薬液注入材料である。",null,"高圧噴射撹拌工法と同等の地盤改良強度が発現できる薬液注入材料である。",null,"万が一のリーク時にも緩結から瞬結注入材への切替が瞬時に行えるためリーク防止対策も可能である。",null,"万が一のリーク時にも緩結から瞬結注入材への切替が瞬時に行えるためリーク防止対策も可能である。"]
[null,null,null,null,null,"従来技術","新技術","従来技術","新技術","従来技術","新技術","従来技術","新技術","従来技術","新技術","従来技術","新技術","従来技術","新技術","従来技術","新技術","従来技術","新技術","従来技術","新技術","従来技術","新技術","従来技術","新技術","従来技術","新技術","従来技術","新技術","従来技術","新技術","従来技術","新技術","従来技術","新技術","従来技術","新技術","従来技術","新技術","従来技術","新技術"]
[null,"⑫","改良強度",null,null,"水ガラス系：60kN/m2程度","100kN/m2","水ガラス系：60kN/m2程度","100kN/m2","水ガラス系：60kN/m2程度","100kN/m2","水ガラス系：60kN/m2程度","100kN/m2","水ガラス系：60kN/m2程度","60～100kN/m2","水ガラス系：60kN/m2程度","60～100kN/m2","水ガラス系：60kN/m2程度","100kN/m2","水ガラス系：60kN/m2程度","100kN/m2","水ガラス系：60kN/m2程度","60kN/m2","水ガラス系：60kN/m2程度","60kN/m2","水ガラス系：60kN/m2程度","40kN/m2","水ガラス系：60kN/m2程度","40kN/m2","水ガラス系：60kN/m2程度","50kN/m2","水ガラス系：60kN/m2程度","50kN/m2","水ガラス系：60kN/m2程度","100～225kN/m2","水ガラス系：60kN/m2程度","100～225kN/m2","水ガラス系：60kN/m2程度","250～4000kN/m2","水ガラス系：60kN/m2程度","250～4000kN/m2","水ガラス系：60kN/m2程度","50～150kN/m2","水ガラス系：60kN/m2程度","50～150kN/㎡"]
[null,"⑬","共通仮設費用（据付・解体費用）",null,null,880600,831800,880600,831800,880600,831800,880600,831800,880600,1285500,880600,1072100,880600,769854,880600,769854,880600,933240,880600,933240,880600,933240,880600,933240,880600,1381600,880600,1381600,880600,867865,880600,867865,880600,867865,880600,867865,691500,690146,459900,458834]
[null,"⑭","概算費用","施工費用",null,"-",8209,"-",7976,"-",24406,"-",29635,"-",20355,"-",20531,"-",12385.087,"-",11985.874,"-",16678,"-",16006,"-",26857,"-",25317,"-",6165,"-",6061,"-",24519,"-",22785,"-",24519,"-",22992,"-",11619,"-",13045]
[null,null,null,"一次注入材料費",null,"-",37,"-",35,"-",105,"-",133,"-",450,"-",450,"-",0,"-",0,"-",602,"-",602,"-",1204,"-",1204,"-","-","-","-","-",431,"-",431,"-",431,"-",431,"-",10800,"-",10800]
[null,null,null,"二次注入材料費",null,"-",30375,"-",30375,"-",30375,"-",30375,"-",20300,"-",20300,"-",22400,"-",22400,"-",26982,"-",26981,"-",10640,"-",10640,"-",17010,"-",17010,"-",25205,"-",25205,"-",25205,"-",25205,"-",11070,"-",11070]
[null,null,null,"合計",null,45386,38621,43859,38386,45386,54886,43859,60143,45386,41105,43859,41281,45386,34785.087,43859,34385.873999999996,45386,44262,43859,43589,26976,38701,25508.5,37161,45386,23175,43859,23071,45386,50155,43859,48421,45386,50155,43859,48628,35070,33894,36470,35320]
[null,null,null,"標準施工規模",null,"-",26,"-",13,"-",10,"-",10,"-",30,"-",15,"-",30,"-",15,"-",36,"-",18,"-",100,"-",50,"-",25,"-",12,"-",100,"-",50,"-",100,"-",50,"-",100,"-",50]
[null,"⑮","施工日数",null,null,5.6000000000000001E-2,2.4074074074074074E-2,5.0999999999999997E-2,2.3214285714285712E-2,5.6000000000000001E-2,3.8461538461538457E-2,5.0999999999999997E-2,4.3478260869565216E-2,5.6000000000000001E-2,2.9126213592233007E-2,5.0999999999999997E-2,3.3333333333333333E-2,5.6000000000000001E-2,1.3086184234546716E-2,5.0999999999999997E-2,2.412261495151705E-2,5.6000000000000001E-2,2.7067669172932331E-2,5.0999999999999997E-2,2.6470588235294117E-2,0.04,0.04,3.5999999999999997E-2,7.0921985815602842E-2,5.6000000000000001E-2,1.2019230769230768E-2,5.0999999999999997E-2,2.100840336134454E-2,5.6000000000000001E-2,5.7142857142857141E-2,5.0999999999999997E-2,0.10309278350515466,5.6000000000000001E-2,5.5865921787709494E-2,5.0999999999999997E-2,5.1546391752577331E-2,2.1999999999999999E-2,2.1999999999999999E-2,3.9E-2,4.2016806722689079E-2]
[null,"⑯","統一した従来技術との比較","経済性",null,{"$f":"IFERROR(IF(G39=\"-\",\"-\",IF(G39=\"\",\"-\",IF(G39/F39=1,\"△\",IF(G39/F39>1,\"-（\"&ABS(ROUND(100*G39/F39-100,1))&\"％増）\",IF(G39/F39<1,\"○（\"&ABS(ROUND(100*G39/F39-100,1))&\"％減）\",\"\"))))),\"-\")","v":"○（14.9％減）"},{"$f":"IFERROR(IF(F39=\"-\",\"-\",\"（\"&TEXT(G39,\"#,###\")&\"-\"&TEXT(F39,\"#,###\")&\"）/\"&TEXT(F39,\"#,###\")&\"=\"&TEXT((G39-F39)/F39*100,\"0.0\")&\"%\"),\"-\")","v":"（38,621-45,386）/45,386=-14.9%"},{"$f":"IFERROR(IF(I39=\"-\",\"-\",IF(I39=\"\",\"-\",IF(I39/H39=1,\"△\",IF(I39/H39>1,\"-（\"&ABS(ROUND(100*I39/H39-100,1))&\"％増）\",IF(I39/H39<1,\"○（\"&ABS(ROUND(100*I39/H39-100,1))&\"％減）\",\"\"))))),\"-\")","v":"○（12.5％減）"},{"$f":"IFERROR(IF(H39=\"-\",\"-\",\"（\"&TEXT(I39,\"#,###\")&\"-\"&TEXT(H39,\"#,###\")&\"）/\"&TEXT(H39,\"#,###\")&\"=\"&TEXT((I39-H39)/H39*100,\"0.0\")&\"%\"),\"-\")","v":"（38,386-43,859）/43,859=-12.5%"},{"$f":"IFERROR(IF(K39=\"-\",\"-\",IF(K39=\"\",\"-\",IF(K39/J39=1,\"△\",IF(K39/J39>1,\"-（\"&ABS(ROUND(100*K39/J39-100,1))&\"％増）\",IF(K39/J39<1,\"○（\"&ABS(ROUND(100*K39/J39-100,1))&\"％減）\",\"\"))))),\"-\")","v":"-（20.9％増）"},{"$f":"IFERROR(IF(J39=\"-\",\"-\",\"（\"&TEXT(K39,\"#,###\")&\"-\"&TEXT(J39,\"#,###\")&\"）/\"&TEXT(J39,\"#,###\")&\"=\"&TEXT((K39-J39)/J39*100,\"0.0\")&\"%\"),\"-\")","v":"（54,886-45,386）/45,386=20.9%"},{"$f":"IFERROR(IF(M39=\"-\",\"-\",IF(M39=\"\",\"-\",IF(M39/L39=1,\"△\",IF(M39/L39>1,\"-（\"&ABS(ROUND(100*M39/L39-100,1))&\"％増）\",IF(M39/L39<1,\"○（\"&ABS(ROUND(100*M39/L39-100,1))&\"％減）\",\"\"))))),\"-\")","v":"-（37.1％増）"},{"$f":"IFERROR(IF(L39=\"-\",\"-\",\"（\"&TEXT(M39,\"#,###\")&\"-\"&TEXT(L39,\"#,###\")&\"）/\"&TEXT(L39,\"#,###\")&\"=\"&TEXT((M39-L39)/L39*100,\"0.0\")&\"%\"),\"-\")","v":"（60,143-43,859）/43,859=37.1%"},{"$f":"IFERROR(IF(O39=\"-\",\"-\",IF(O39=\"\",\"-\",IF(O39/N39=1,\"△\",IF(O39/N39>1,\"-（\"&ABS(ROUND(100*O39/N39-100,1))&\"％増）\",IF(O39/N39<1,\"○（\"&ABS(ROUND(100*O39/N39-100,1))&\"％減）\",\"\"))))),\"-\")","v":"○（9.4％減）"},{"$f":"IFERROR(IF(N39=\"-\",\"-\",\"（\"&TEXT(O39,\"#,###\")&\"-\"&TEXT(N39,\"#,###\")&\"）/\"&TEXT(N39,\"#,###\")&\"=\"&TEXT((O39-N39)/N39*100,\"0.0\")&\"%\"),\"-\")","v":"（41,105-45,386）/45,386=-9.4%"},{"$f":"IFERROR(IF(Q39=\"-\",\"-\",IF(Q39=\"\",\"-\",IF(Q39/P39=1,\"△\",IF(Q39/P39>1,\"-（\"&ABS(ROUND(100*Q39/P39-100,1))&\"％増）\",IF(Q39/P39<1,\"○（\"&ABS(ROUND(100*Q39/P39-100,1))&\"％減）\",\"\"))))),\"-\")","v":"○（5.9％減）"},{"$f":"IFERROR(IF(P39=\"-\",\"-\",\"（\"&TEXT(Q39,\"#,###\")&\"-\"&TEXT(P39,\"#,###\")&\"）/\"&TEXT(P39,\"#,###\")&\"=\"&TEXT((Q39-P39)/P39*100,\"0.0\")&\"%\"),\"-\")","v":"（41,281-43,859）/43,859=-5.9%"},{"$f":"IFERROR(IF(S39=\"-\",\"-\",IF(S39=\"\",\"-\",IF(S39/R39=1,\"△\",IF(S39/R39>1,\"-（\"&ABS(ROUND(100*S39/R39-100,1))&\"％増）\",IF(S39/R39<1,\"○（\"&ABS(ROUND(100*S39/R39-100,1))&\"％減）\",\"\"))))),\"-\")","v":"○（23.4％減）"},{"$f":"IFERROR(IF(R39=\"-\",\"-\",\"（\"&TEXT(S39,\"#,###\")&\"-\"&TEXT(R39,\"#,###\")&\"）/\"&TEXT(R39,\"#,###\")&\"=\"&TEXT((S39-R39)/R39*100,\"0.0\")&\"%\"),\"-\")","v":"（34,785-45,386）/45,386=-23.4%"},{"$f":"IFERROR(IF(U39=\"-\",\"-\",IF(U39=\"\",\"-\",IF(U39/T39=1,\"△\",IF(U39/T39>1,\"-（\"&ABS(ROUND(100*U39/T39-100,1))&\"％増）\",IF(U39/T39<1,\"○（\"&ABS(ROUND(100*U39/T39-100,1))&\"％減）\",\"\"))))),\"-\")","v":"○（21.6％減）"},{"$f":"IFERROR(IF(T39=\"-\",\"-\",\"（\"&TEXT(U39,\"#,###\")&\"-\"&TEXT(T39,\"#,###\")&\"）/\"&TEXT(T39,\"#,###\")&\"=\"&TEXT((U39-T39)/T39*100,\"0.0\")&\"%\"),\"-\")","v":"（34,386-43,859）/43,859=-21.6%"},{"$f":"IFERROR(IF(W39=\"-\",\"-\",IF(W39=\"\",\"-\",IF(W39/V39=1,\"△\",IF(W39/V39>1,\"-（\"&ABS(ROUND(100*W39/V39-100,1))&\"％増）\",IF(W39/V39<1,\"○（\"&ABS(ROUND(100*W39/V39-100,1))&\"％減）\",\"\"))))),\"-\")","v":"○（2.5％減）"},{"$f":"IFERROR(IF(V39=\"-\",\"-\",\"（\"&TEXT(W39,\"#,###\")&\"-\"&TEXT(V39,\"#,###\")&\"）/\"&TEXT(V39,\"#,###\")&\"=\"&TEXT((W39-V39)/V39*100,\"0.0\")&\"%\"),\"-\")","v":"（44,262-45,386）/45,386=-2.5%"},{"$f":"IFERROR(IF(Y39=\"-\",\"-\",IF(Y39=\"\",\"-\",IF(Y39/X39=1,\"△\",IF(Y39/X39>1,\"-（\"&ABS(ROUND(100*Y39/X39-100,1))&\"％増）\",IF(Y39/X39<1,\"○（\"&ABS(ROUND(100*Y39/X39-100,1))&\"％減）\",\"\"))))),\"-\")","v":"○（0.6％減）"},{"$f":"IFERROR(IF(X39=\"-\",\"-\",\"（\"&TEXT(Y39,\"#,###\")&\"-\"&TEXT(X39,\"#,###\")&\"）/\"&TEXT(X39,\"#,###\")&\"=\"&TEXT((Y39-X39)/X39*100,\"0.0\")&\"%\"),\"-\")","v":"（43,589-43,859）/43,859=-0.6%"},{"$f":"IFERROR(IF(AA39=\"-\",\"-\",IF(AA39=\"\",\"-\",IF(AA39/Z39=1,\"△\",IF(AA39/Z39>1,\"-（\"&ABS(ROUND(100*AA39/Z39-100,1))&\"％増）\",IF(AA39/Z39<1,\"○（\"&ABS(ROUND(100*AA39/Z39-100,1))&\"％減）\",\"\"))))),\"-\")","v":"-（43.5％増）"},{"$f":"IFERROR(IF(Z39=\"-\",\"-\",\"（\"&TEXT(AA39,\"#,###\")&\"-\"&TEXT(Z39,\"#,###\")&\"）/\"&TEXT(Z39,\"#,###\")&\"=\"&TEXT((AA39-Z39)/Z39*100,\"0.0\")&\"%\"),\"-\")","v":"（38,701-26,976）/26,976=43.5%"},{"$f":"IFERROR(IF(AC39=\"-\",\"-\",IF(AC39=\"\",\"-\",IF(AC39/AB39=1,\"△\",IF(AC39/AB39>1,\"-（\"&ABS(ROUND(100*AC39/AB39-100,1))&\"％増）\",IF(AC39/AB39<1,\"○（\"&ABS(ROUND(100*AC39/AB39-100,1))&\"％減）\",\"\"))))),\"-\")","v":"-（45.7％増）"},{"$f":"IFERROR(IF(AB39=\"-\",\"-\",\"（\"&TEXT(AC39,\"#,###\")&\"-\"&TEXT(AB39,\"#,###\")&\"）/\"&TEXT(AB39,\"#,###\")&\"=\"&TEXT((AC39-AB39)/AB39*100,\"0.0\")&\"%\"),\"-\")","v":"（37,161-25,509）/25,509=45.7%"},{"$f":"IFERROR(IF(AE39=\"-\",\"-\",IF(AE39=\"\",\"-\",IF(AE39/AD39=1,\"△\",IF(AE39/AD39>1,\"-（\"&ABS(ROUND(100*AE39/AD39-100,1))&\"％増）\",IF(AE39/AD39<1,\"○（\"&ABS(ROUND(100*AE39/AD39-100,1))&\"％減）\",\"\"))))),\"-\")","v":"○（48.9％減）"},{"$f":"IFERROR(IF(AD39=\"-\",\"-\",\"（\"&TEXT(AE39,\"#,###\")&\"-\"&TEXT(AD39,\"#,###\")&\"）/\"&TEXT(AD39,\"#,###\")&\"=\"&TEXT((AE39-AD39)/AD39*100,\"0.0\")&\"%\"),\"-\")","v":"（23,175-45,386）/45,386=-48.9%"},{"$f":"IFERROR(IF(AG39=\"-\",\"-\",IF(AG39=\"\",\"-\",IF(AG39/AF39=1,\"△\",IF(AG39/AF39>1,\"-（\"&ABS(ROUND(100*AG39/AF39-100,1))&\"％増）\",IF(AG39/AF39<1,\"○（\"&ABS(ROUND(100*AG39/AF39-100,1))&\"％減）\",\"\"))))),\"-\")","v":"○（47.4％減）"},{"$f":"IFERROR(IF(AF39=\"-\",\"-\",\"（\"&TEXT(AG39,\"#,###\")&\"-\"&TEXT(AF39,\"#,###\")&\"）/\"&TEXT(AF39,\"#,###\")&\"=\"&TEXT((AG39-AF39)/AF39*100,\"0.0\")&\"%\"),\"-\")","v":"（23,071-43,859）/43,859=-47.4%"},{"$f":"IFERROR(IF(AI39=\"-\",\"-\",IF(AI39=\"\",\"-\",IF(AI39/AH39=1,\"△\",IF(AI39/AH39>1,\"-（\"&ABS(ROUND(100*AI39/AH39-100,1))&\"％増）\",IF(AI39/AH39<1,\"○（\"&ABS(ROUND(100*AI39/AH39-100,1))&\"％減）\",\"\"))))),\"-\")","v":"-（10.5％増）"},{"$f":"IFERROR(IF(AH39=\"-\",\"-\",\"（\"&TEXT(AI39,\"#,###\")&\"-\"&TEXT(AH39,\"#,###\")&\"）/\"&TEXT(AH39,\"#,###\")&\"=\"&TEXT((AI39-AH39)/AH39*100,\"0.0\")&\"%\"),\"-\")","v":"（50,155-45,386）/45,386=10.5%"},{"$f":"IFERROR(IF(AK39=\"-\",\"-\",IF(AK39=\"\",\"-\",IF(AK39/AJ39=1,\"△\",IF(AK39/AJ39>1,\"-（\"&ABS(ROUND(100*AK39/AJ39-100,1))&\"％増）\",IF(AK39/AJ39<1,\"○（\"&ABS(ROUND(100*AK39/AJ39-100,1))&\"％減）\",\"\"))))),\"-\")","v":"-（10.4％増）"},{"$f":"IFERROR(IF(AJ39=\"-\",\"-\",\"（\"&TEXT(AK39,\"#,###\")&\"-\"&TEXT(AJ39,\"#,###\")&\"）/\"&TEXT(AJ39,\"#,###\")&\"=\"&TEXT((AK39-AJ39)/AJ39*100,\"0.0\")&\"%\"),\"-\")","v":"（48,421-43,859）/43,859=10.4%"},{"$f":"IFERROR(IF(AM39=\"-\",\"-\",IF(AM39=\"\",\"-\",IF(AM39/AL39=1,\"△\",IF(AM39/AL39>1,\"-（\"&ABS(ROUND(100*AM39/AL39-100,1))&\"％増）\",IF(AM39/AL39<1,\"○（\"&ABS(ROUND(100*AM39/AL39-100,1))&\"％減）\",\"\"))))),\"-\")","v":"-（10.5％増）"},{"$f":"IFERROR(IF(AL39=\"-\",\"-\",\"（\"&TEXT(AM39,\"#,###\")&\"-\"&TEXT(AL39,\"#,###\")&\"）/\"&TEXT(AL39,\"#,###\")&\"=\"&TEXT((AM39-AL39)/AL39*100,\"0.0\")&\"%\"),\"-\")","v":"（50,155-45,386）/45,386=10.5%"},{"$f":"IFERROR(IF(AO39=\"-\",\"-\",IF(AO39=\"\",\"-\",IF(AO39/AN39=1,\"△\",IF(AO39/AN39>1,\"-（\"&ABS(ROUND(100*AO39/AN39-100,1))&\"％増）\",IF(AO39/AN39<1,\"○（\"&ABS(ROUND(100*AO39/AN39-100,1))&\"％減）\",\"\"))))),\"-\")","v":"-（10.9％増）"},{"$f":"IFERROR(IF(AN39=\"-\",\"-\",\"（\"&TEXT(AO39,\"#,###\")&\"-\"&TEXT(AN39,\"#,###\")&\"）/\"&TEXT(AN39,\"#,###\")&\"=\"&TEXT((AO39-AN39)/AN39*100,\"0.0\")&\"%\"),\"-\")","v":"（48,628-43,859）/43,859=10.9%"},{"$f":"IFERROR(IF(AQ39=\"-\",\"-\",IF(AQ39=\"\",\"-\",IF(AQ39/AP39=1,\"△\",IF(AQ39/AP39>1,\"-（\"&ABS(ROUND(100*AQ39/AP39-100,1))&\"％増）\",IF(AQ39/AP39<1,\"○（\"&ABS(ROUND(100*AQ39/AP39-100,1))&\"％減）\",\"\"))))),\"-\")","v":"○（3.4％減）"},{"$f":"IFERROR(IF(AP39=\"-\",\"-\",\"（\"&TEXT(AQ39,\"#,###\")&\"-\"&TEXT(AP39,\"#,###\")&\"）/\"&TEXT(AP39,\"#,###\")&\"=\"&TEXT((AQ39-AP39)/AP39*100,\"0.0\")&\"%\"),\"-\")","v":"（33,894-35,070）/35,070=-3.4%"},{"$f":"IFERROR(IF(AS39=\"-\",\"-\",IF(AS39=\"\",\"-\",IF(AS39/AR39=1,\"△\",IF(AS39/AR39>1,\"-（\"&ABS(ROUND(100*AS39/AR39-100,1))&\"％増）\",IF(AS39/AR39<1,\"○（\"&ABS(ROUND(100*AS39/AR39-100,1))&\"％減）\",\"\"))))),\"-\")","v":"○（3.2％減）"},{"$f":"IFERROR(IF(AR39=\"-\",\"-\",\"（\"&TEXT(AS39,\"#,###\")&\"-\"&TEXT(AR39,\"#,###\")&\"）/\"&TEXT(AR39,\"#,###\")&\"=\"&TEXT((AS39-AR39)/AR39*100,\"0.0\")&\"%\"),\"-\")","v":"（35,320-36,470）/36,470=-3.2%"}]
[null,null,null,"工程",null,{"$f":"IFERROR(IF(G41=\"-\",\"-\",IF(G41=\"\",\"-\",IF(ROUND(G41, 3)/F41=1,\"△\",IF(G41/F41>1,\"-（\"&ABS(ROUND(100*G41/F41-100,1))&\"％増）\",IF(G41/F41<1,\"○（\"&ABS(ROUND(100*G41/F41-100,1))&\"％減）\",\"\"))))),\"-\")","v":"○（57％減）"},{"$f":"IFERROR(IF(F41=\"-\",\"-\",\"（\"&TEXT(ROUND(G41, 3),\"##0.000\")&\"-\"&TEXT(F41,\"##0.000\")&\"）/\"&TEXT(F41,\"##0.000\")&\"=\"&TEXT((ROUND(G41, 3)-F41)/F41*100,\"0.0\")&\"%\"),\"-\")","v":"（0.024-0.056）/0.056=-57.1%"},{"$f":"IFERROR(IF(I41=\"-\",\"-\",IF(I41=\"\",\"-\",IF(ROUND(I41, 3)/H41=1,\"△\",IF(I41/H41>1,\"-（\"&ABS(ROUND(100*I41/H41-100,1))&\"％増）\",IF(I41/H41<1,\"○（\"&ABS(ROUND(100*I41/H41-100,1))&\"％減）\",\"\"))))),\"-\")","v":"○（54.5％減）"},{"$f":"IFERROR(IF(H41=\"-\",\"-\",\"（\"&TEXT(ROUND(I41, 3),\"##0.000\")&\"-\"&TEXT(H41,\"##0.000\")&\"）/\"&TEXT(H41,\"##0.000\")&\"=\"&TEXT((ROUND(I41, 3)-H41)/H41*100,\"0.0\")&\"%\"),\"-\")","v":"（0.023-0.051）/0.051=-54.9%"},{"$f":"IFERROR(IF(K41=\"-\",\"-\",IF(K41=\"\",\"-\",IF(ROUND(K41, 3)/J41=1,\"△\",IF(K41/J41>1,\"-（\"&ABS(ROUND(100*K41/J41-100,1))&\"％増）\",IF(K41/J41<1,\"○（\"&ABS(ROUND(100*K41/J41-100,1))&\"％減）\",\"\"))))),\"-\")","v":"○（31.3％減）"},{"$f":"IFERROR(IF(J41=\"-\",\"-\",\"（\"&TEXT(ROUND(K41, 3),\"##0.000\")&\"-\"&TEXT(J41,\"##0.000\")&\"）/\"&TEXT(J41,\"##0.000\")&\"=\"&TEXT((ROUND(K41, 3)-J41)/J41*100,\"0.0\")&\"%\"),\"-\")","v":"（0.038-0.056）/0.056=-32.1%"},{"$f":"IFERROR(IF(M41=\"-\",\"-\",IF(M41=\"\",\"-\",IF(ROUND(M41, 3)/L41=1,\"△\",IF(M41/L41>1,\"-（\"&ABS(ROUND(100*M41/L41-100,1))&\"％増）\",IF(M41/L41<1,\"○（\"&ABS(ROUND(100*M41/L41-100,1))&\"％減）\",\"\"))))),\"-\")","v":"○（14.7％減）"},{"$f":"IFERROR(IF(L41=\"-\",\"-\",\"（\"&TEXT(ROUND(M41, 3),\"##0.000\")&\"-\"&TEXT(L41,\"##0.000\")&\"）/\"&TEXT(L41,\"##0.000\")&\"=\"&TEXT((ROUND(M41, 3)-L41)/L41*100,\"0.0\")&\"%\"),\"-\")","v":"（0.043-0.051）/0.051=-15.7%"},{"$f":"IFERROR(IF(O41=\"-\",\"-\",IF(O41=\"\",\"-\",IF(ROUND(O41, 3)/N41=1,\"△\",IF(O41/N41>1,\"-（\"&ABS(ROUND(100*O41/N41-100,1))&\"％増）\",IF(O41/N41<1,\"○（\"&ABS(ROUND(100*O41/N41-100,1))&\"％減）\",\"\"))))),\"-\")","v":"○（48％減）"},{"$f":"IFERROR(IF(N41=\"-\",\"-\",\"（\"&TEXT(ROUND(O41, 3),\"##0.000\")&\"-\"&TEXT(N41,\"##0.000\")&\"）/\"&TEXT(N41,\"##0.000\")&\"=\"&TEXT((ROUND(O41, 3)-N41)/N41*100,\"0.0\")&\"%\"),\"-\")","v":"（0.029-0.056）/0.056=-48.2%"},{"$f":"IFERROR(IF(Q41=\"-\",\"-\",IF(Q41=\"\",\"-\",IF(ROUND(Q41, 3)/P41=1,\"△\",IF(Q41/P41>1,\"-（\"&ABS(ROUND(100*Q41/P41-100,1))&\"％増）\",IF(Q41/P41<1,\"○（\"&ABS(ROUND(100*Q41/P41-100,1))&\"％減）\",\"\"))))),\"-\")","v":"○（34.6％減）"},{"$f":"IFERROR(IF(P41=\"-\",\"-\",\"（\"&TEXT(ROUND(Q41, 3),\"##0.000\")&\"-\"&TEXT(P41,\"##0.000\")&\"）/\"&TEXT(P41,\"##0.000\")&\"=\"&TEXT((ROUND(Q41, 3)-P41)/P41*100,\"0.0\")&\"%\"),\"-\")","v":"（0.033-0.051）/0.051=-35.3%"},{"$f":"IFERROR(IF(S41=\"-\",\"-\",IF(S41=\"\",\"-\",IF(ROUND(S41, 3)/R41=1,\"△\",IF(S41/R41>1,\"-（\"&ABS(ROUND(100*S41/R41-100,1))&\"％増）\",IF(S41/R41<1,\"○（\"&ABS(ROUND(100*S41/R41-100,1))&\"％減）\",\"\"))))),\"-\")","v":"○（76.6％減）"},{"$f":"IFERROR(IF(R41=\"-\",\"-\",\"（\"&TEXT(ROUND(S41, 3),\"##0.000\")&\"-\"&TEXT(R41,\"##0.000\")&\"）/\"&TEXT(R41,\"##0.000\")&\"=\"&TEXT((ROUND(S41, 3)-R41)/R41*100,\"0.0\")&\"%\"),\"-\")","v":"（0.013-0.056）/0.056=-76.8%"},{"$f":"IFERROR(IF(U41=\"-\",\"-\",IF(U41=\"\",\"-\",IF(ROUND(U41, 3)/T41=1,\"△\",IF(U41/T41>1,\"-（\"&ABS(ROUND(100*U41/T41-100,1))&\"％増）\",IF(U41/T41<1,\"○（\"&ABS(ROUND(100*U41/T41-100,1))&\"％減）\",\"\"))))),\"-\")","v":"○（52.7％減）"},{"$f":"IFERROR(IF(T41=\"-\",\"-\",\"（\"&TEXT(ROUND(U41, 3),\"##0.000\")&\"-\"&TEXT(T41,\"##0.000\")&\"）/\"&TEXT(T41,\"##0.000\")&\"=\"&TEXT((ROUND(U41, 3)-T41)/T41*100,\"0.0\")&\"%\"),\"-\")","v":"（0.024-0.051）/0.051=-52.9%"},{"$f":"IFERROR(IF(W41=\"-\",\"-\",IF(W41=\"\",\"-\",IF(ROUND(W41, 3)/V41=1,\"△\",IF(W41/V41>1,\"-（\"&ABS(ROUND(100*W41/V41-100,1))&\"％増）\",IF(W41/V41<1,\"○（\"&ABS(ROUND(100*W41/V41-100,1))&\"％減）\",\"\"))))),\"-\")","v":"○（51.7％減）"},{"$f":"IFERROR(IF(V41=\"-\",\"-\",\"（\"&TEXT(ROUND(W41, 3),\"##0.000\")&\"-\"&TEXT(V41,\"##0.000\")&\"）/\"&TEXT(V41,\"##0.000\")&\"=\"&TEXT((ROUND(W41, 3)-V41)/V41*100,\"0.0\")&\"%\"),\"-\")","v":"（0.027-0.056）/0.056=-51.8%"},{"$f":"IFERROR(IF(Y41=\"-\",\"-\",IF(Y41=\"\",\"-\",IF(ROUND(Y41, 3)/X41=1,\"△\",IF(Y41/X41>1,\"-（\"&ABS(ROUND(100*Y41/X41-100,1))&\"％増）\",IF(Y41/X41<1,\"○（\"&ABS(ROUND(100*Y41/X41-100,1))&\"％減）\",\"\"))))),\"-\")","v":"○（48.1％減）"},{"$f":"IFERROR(IF(X41=\"-\",\"-\",\"（\"&TEXT(ROUND(Y41, 3),\"##0.000\")&\"-\"&TEXT(X41,\"##0.000\")&\"）/\"&TEXT(X41,\"##0.000\")&\"=\"&TEXT((ROUND(Y41, 3)-X41)/X41*100,\"0.0\")&\"%\"),\"-\")","v":"（0.026-0.051）/0.051=-49.0%"},{"$f":"IFERROR(IF(AA41=\"-\",\"-\",IF(AA41=\"\",\"-\",IF(ROUND(AA41, 3)/Z41=1,\"△\",IF(AA41/Z41>1,\"-（\"&ABS(ROUND(100*AA41/Z41-100,1))&\"％増）\",IF(AA41/Z41<1,\"○（\"&ABS(ROUND(100*AA41/Z41-100,1))&\"％減）\",\"\"))))),\"-\")","v":"△"},{"$f":"IFERROR(IF(Z41=\"-\",\"-\",\"（\"&TEXT(ROUND(AA41, 3),\"##0.000\")&\"-\"&TEXT(Z41,\"##0.000\")&\"）/\"&TEXT(Z41,\"##0.000\")&\"=\"&TEXT((ROUND(AA41, 3)-Z41)/Z41*100,\"0.0\")&\"%\"),\"-\")","v":"（0.040-0.040）/0.040=0.0%"},{"$f":"IFERROR(IF(AC41=\"-\",\"-\",IF(AC41=\"\",\"-\",IF(ROUND(AC41, 3)/AB41=1,\"△\",IF(AC41/AB41>1,\"-（\"&ABS(ROUND(100*AC41/AB41-100,1))&\"％増）\",IF(AC41/AB41<1,\"○（\"&ABS(ROUND(100*AC41/AB41-100,1))&\"％減）\",\"\"))))),\"-\")","v":"-（97％増）"},{"$f":"IFERROR(IF(AB41=\"-\",\"-\",\"（\"&TEXT(ROUND(AC41, 3),\"##0.000\")&\"-\"&TEXT(AB41,\"##0.000\")&\"）/\"&TEXT(AB41,\"##0.000\")&\"=\"&TEXT((ROUND(AC41, 3)-AB41)/AB41*100,\"0.0\")&\"%\"),\"-\")","v":"（0.071-0.036）/0.036=97.2%"},{"$f":"IFERROR(IF(AE41=\"-\",\"-\",IF(AE41=\"\",\"-\",IF(ROUND(AE41, 3)/AD41=1,\"△\",IF(AE41/AD41>1,\"-（\"&ABS(ROUND(100*AE41/AD41-100,1))&\"％増）\",IF(AE41/AD41<1,\"○（\"&ABS(ROUND(100*AE41/AD41-100,1))&\"％減）\",\"\"))))),\"-\")","v":"○（78.5％減）"},{"$f":"IFERROR(IF(AD41=\"-\",\"-\",\"（\"&TEXT(ROUND(AE41, 3),\"##0.000\")&\"-\"&TEXT(AD41,\"##0.000\")&\"）/\"&TEXT(AD41,\"##0.000\")&\"=\"&TEXT((ROUND(AE41, 3)-AD41)/AD41*100,\"0.0\")&\"%\"),\"-\")","v":"（0.012-0.056）/0.056=-78.6%"},{"$f":"IFERROR(IF(AG41=\"-\",\"-\",IF(AG41=\"\",\"-\",IF(ROUND(AG41, 3)/AF41=1,\"△\",IF(AG41/AF41>1,\"-（\"&ABS(ROUND(100*AG41/AF41-100,1))&\"％増）\",IF(AG41/AF41<1,\"○（\"&ABS(ROUND(100*AG41/AF41-100,1))&\"％減）\",\"\"))))),\"-\")","v":"○（58.8％減）"},{"$f":"IFERROR(IF(AF41=\"-\",\"-\",\"（\"&TEXT(ROUND(AG41, 3),\"##0.000\")&\"-\"&TEXT(AF41,\"##0.000\")&\"）/\"&TEXT(AF41,\"##0.000\")&\"=\"&TEXT((ROUND(AG41, 3)-AF41)/AF41*100,\"0.0\")&\"%\"),\"-\")","v":"（0.021-0.051）/0.051=-58.8%"},{"$f":"IFERROR(IF(AI41=\"-\",\"-\",IF(AI41=\"\",\"-\",IF(ROUND(AI41, 3)/AH41=1,\"△\",IF(AI41/AH41>1,\"-（\"&ABS(ROUND(100*AI41/AH41-100,1))&\"％増）\",IF(AI41/AH41<1,\"○（\"&ABS(ROUND(100*AI41/AH41-100,1))&\"％減）\",\"\"))))),\"-\")","v":"-（2％増）"},{"$f":"IFERROR(IF(AH41=\"-\",\"-\",\"（\"&TEXT(ROUND(AI41, 3),\"##0.000\")&\"-\"&TEXT(AH41,\"##0.000\")&\"）/\"&TEXT(AH41,\"##0.000\")&\"=\"&TEXT((ROUND(AI41, 3)-AH41)/AH41*100,\"0.0\")&\"%\"),\"-\")","v":"（0.057-0.056）/0.056=1.8%"},{"$f":"IFERROR(IF(AK41=\"-\",\"-\",IF(AK41=\"\",\"-\",IF(ROUND(AK41, 3)/AJ41=1,\"△\",IF(AK41/AJ41>1,\"-（\"&ABS(ROUND(100*AK41/AJ41-100,1))&\"％増）\",IF(AK41/AJ41<1,\"○（\"&ABS(ROUND(100*AK41/AJ41-100,1))&\"％減）\",\"\"))))),\"-\")","v":"-（102.1％増）"},{"$f":"IFERROR(IF(AJ41=\"-\",\"-\",\"（\"&TEXT(ROUND(AK41, 3),\"##0.000\")&\"-\"&TEXT(AJ41,\"##0.000\")&\"）/\"&TEXT(AJ41,\"##0.000\")&\"=\"&TEXT((ROUND(AK41, 3)-AJ41)/AJ41*100,\"0.0\")&\"%\"),\"-\")","v":"（0.103-0.051）/0.051=102.0%"},{"$f":"IFERROR(IF(AM41=\"-\",\"-\",IF(AM41=\"\",\"-\",IF(ROUND(AM41, 3)/AL41=1,\"△\",IF(AM41/AL41>1,\"-（\"&ABS(ROUND(100*AM41/AL41-100,1))&\"％増）\",IF(AM41/AL41<1,\"○（\"&ABS(ROUND(100*AM41/AL41-100,1))&\"％減）\",\"\"))))),\"-\")","v":"△"},{"$f":"IFERROR(IF(AL41=\"-\",\"-\",\"（\"&TEXT(ROUND(AM41, 3),\"##0.000\")&\"-\"&TEXT(AL41,\"##0.000\")&\"）/\"&TEXT(AL41,\"##0.000\")&\"=\"&TEXT((ROUND(AM41, 3)-AL41)/AL41*100,\"0.0\")&\"%\"),\"-\")","v":"（0.056-0.056）/0.056=0.0%"},{"$f":"IFERROR(IF(AO41=\"-\",\"-\",IF(AO41=\"\",\"-\",IF(ROUND(AO41, 3)/AN41=1,\"△\",IF(AO41/AN41>1,\"-（\"&ABS(ROUND(100*AO41/AN41-100,1))&\"％増）\",IF(AO41/AN41<1,\"○（\"&ABS(ROUND(100*AO41/AN41-100,1))&\"％減）\",\"\"))))),\"-\")","v":"-（1.1％増）"},{"$f":"IFERROR(IF(AN41=\"-\",\"-\",\"（\"&TEXT(ROUND(AO41, 3),\"##0.000\")&\"-\"&TEXT(AN41,\"##0.000\")&\"）/\"&TEXT(AN41,\"##0.000\")&\"=\"&TEXT((ROUND(AO41, 3)-AN41)/AN41*100,\"0.0\")&\"%\"),\"-\")","v":"（0.052-0.051）/0.051=2.0%"},{"$f":"IFERROR(IF(AQ41=\"-\",\"-\",IF(AQ41=\"\",\"-\",IF(ROUND(AQ41, 3)/AP41=1,\"△\",IF(AQ41/AP41>1,\"-（\"&ABS(ROUND(100*AQ41/AP41-100,1))&\"％増）\",IF(AQ41/AP41<1,\"○（\"&ABS(ROUND(100*AQ41/AP41-100,1))&\"％減）\",\"\"))))),\"-\")","v":"△"},{"$f":"IFERROR(IF(AP41=\"-\",\"-\",\"（\"&TEXT(ROUND(AQ41, 3),\"##0.000\")&\"-\"&TEXT(AP41,\"##0.000\")&\"）/\"&TEXT(AP41,\"##0.000\")&\"=\"&TEXT((ROUND(AQ41, 3)-AP41)/AP41*100,\"0.0\")&\"%\"),\"-\")","v":"（0.022-0.022）/0.022=0.0%"},{"$f":"IFERROR(IF(AS41=\"-\",\"-\",IF(AS41=\"\",\"-\",IF(ROUND(AS41, 3)/AR41=1,\"△\",IF(AS41/AR41>1,\"-（\"&ABS(ROUND(100*AS41/AR41-100,1))&\"％増）\",IF(AS41/AR41<1,\"○（\"&ABS(ROUND(100*AS41/AR41-100,1))&\"％減）\",\"\"))))),\"-\")","v":"-（7.7％増）"},{"$f":"IFERROR(IF(AR41=\"-\",\"-\",\"（\"&TEXT(ROUND(AS41, 3),\"##0.000\")&\"-\"&TEXT(AR41,\"##0.000\")&\"）/\"&TEXT(AR41,\"##0.000\")&\"=\"&TEXT((ROUND(AS41, 3)-AR41)/AR41*100,\"0.0\")&\"%\"),\"-\")","v":"（0.042-0.039）/0.039=7.7%"}]
[null,null,"判定の凡例\n○：従来技術より優れる\n△：従来技術と同程度\n－：上記以外","品質・出来形",null,"○：長期耐久性に優れる（施工後11年経過後に施工時と同等以上の強度を確認 ）",null,"○：長期耐久性に優れる（施工後11年経過後に施工時と同等以上の強度を確認 ）",null,"○：長期耐久性に優れる（施工後11年経過後に施工時と同等以上の強度を確認 ）",null,"○：長期耐久性に優れる（施工後11年経過後に施工時と同等以上の強度を確認 ）",null,"○：超音波振動エネルギーにより浸透性能が向上し、薬液が広く均等に行きわたりやすくなる。",null,"○：超音波振動エネルギーにより浸透性能が向上し、薬液が広く均等に行きわたりやすくなる。",null,"○：注入効率の改良により改良径（直径2.5m）が向上",null,"○：注入効率の改良により改良径（直径2.5m）が向上",null,"○：互層地盤への注入効果が上昇し、品質が向上した。",null,"○：互層地盤への注入効果が上昇し、品質が向上した。",null,"○：互層地盤への注入効果が上昇し、品質が向上した。",null,"○：互層地盤への注入効果が上昇し、品質が向上した。",null,"△：従来技術と同程度",null,"△：従来技術と同程度",null,"〇：ゲルタイムを長く設定できることにより、浸透性が向上する。また、未反応水ガラスが殆どないため長期耐久性に優れる。",null,"〇：ゲルタイムを長く設定できることにより、浸透性が向上する。また、未反応水ガラスが殆どないため長期耐久性に優れる。",null,"○：長期耐久性のある恒久グラウトであり、高強度の地盤改良が可能となるため。",null,"○：長期耐久性のある恒久グラウトであり、高強度の地盤改良が可能となるため。",null,"△:従来技術と同程度",null,"△:従来技術と同程度"]
[null,null,null,"安全性",null,"△：従来技術と同程度",null,"△：従来技術と同程度",null,"△：従来技術と同程度",null,"△：従来技術と同程度",null,"△：従来技術と同程度。",null,"△：従来技術と同程度。",null,"○：特殊シール材は、セメントベントナイトと比較して毒性、皮膚腐食性、刺激性が向上している。",null,"○：特殊シール材は、セメントベントナイトと比較して毒性、皮膚腐食性、刺激性が向上している。",null,"△：従来技術と同程度",null,"△：従来技術と同程度",null,"△：従来技術と同程度",null,"△：従来技術と同程度",null,"△：従来技術と同程度",null,"△：従来技術と同程度",null,"△：従来技術と同程度",null,"△：従来技術と同程度",null,"△：従来技術と同程度。",null,"△：従来技術と同程度。",null,"△:従来技術と同程度",null,"△:従来技術と同程度"]
[null,null,null,"施工性",null,"△：従来技術と同程度",null,"△：従来技術と同程度",null,"△：従来技術と同程度",null,"△：従来技術と同程度",null,"△：従来技術と同程度。",null,"△：従来技術と同程度。",null,"○：薬液の削孔穴からの逸走低減により作業ロスが削減。",null,"○：薬液の削孔穴からの逸走低減により作業ロスが削減。",null,"○：注入孔数が削減され削孔機械の移動回数が減少したため、施工性が向上した。",null,"○：注入孔数が削減され削孔機械の移動回数が減少したため、施工性が向上した。",null,"△：従来技術と同程度",null,"△：従来技術と同程度",null,"△：従来技術と同程度",null,"△：従来技術と同程度",null,"△：従来技術と同程度",null,"△：従来技術と同程度",null,"△：従来技術と同程度。",null,"△：従来技術と同程度。",null,"○:瞬結から緩結、緩結から瞬結の切替が瞬時に行えるため、施工性が向上する。",null,"○:瞬結から緩結、緩結から瞬結の切替が瞬時に行えるため、施工性が向上する。"]
[null,null,null,"環境",null,"○：低圧で浸透注入するため、当該技術は構造上変位が出にくい。",null,"○：低圧で浸透注入するため、当該技術は構造上変位が出にくい。",null,"○：低圧で浸透注入するため、当該技術は構造上変位が出にくい。",null,"○：低圧で浸透注入するため、当該技術は構造上変位が出にくい。",null,"△：従来技術と同程度。",null,"△：従来技術と同程度。",null,"○：施工時の注入圧力低減により、周辺構造物等への影響が無く周辺環境への影響が向上される。",null,"○：施工時の注入圧力低減により、周辺構造物等への影響が無く周辺環境への影響が向上される。",null,"○：周辺地盤、近接構造物の変位置が低減したため、環境影響性が向上した。",null,"○：周辺地盤、近接構造物の変位置が低減したため、環境影響性が向上した。",null,"○：周辺地盤、近接構造物の変位置が低減したため、環境影響性が向上した。",null,"○：周辺地盤、近接構造物の変位置が低減したため、環境影響性が向上した。",null,"○：急速浸透注入工法により施工することで、地盤置換工法とは違い、大量の残土が発生しない。",null,"○：急速浸透注入工法により施工することで、地盤置換工法とは違い、大量の残土が発生しない。",null,"○：注入材は全てが無機質で構成されており、可能な限り水質汚染を抑制しているため向上する。",null,"○：注入材は全てが無機質で構成されており、可能な限り水質汚染を抑制しているため向上する。",null,"△：従来技術と同程度。",null,"△：従来技術と同程度。",null,"△:従来技術と同程度",null,"△:従来技術と同程度"]
[null,"⑰","九州のフィールドへの適応性","施工実績\n（過去３年）","国土交通省：活用効果調査表数","26件（九州で8件）",null,"26件（九州で8件）",null,"26件（九州で8件）",null,"26件（九州で8件）",null,"6件（九州で5件）",null,"6件（九州で5件）",null,"6件（九州で5件）",null,"6件（九州で5件）",null,"0件（九州で0件）",null,"0件（九州で0件）",null,"0件（九州で0件）",null,"0件（九州で0件）",null,"0件（九州で0件）",null,"0件（九州で0件）",null,"0件（九州で0件）",null,"0件（九州で0件）",null,"0件（九州で0件）",null,"0件（九州で0件）",null,"0件（九州で0件）",null,"0件（九州で0件）"]
[null,null,null,null,"地方自治体：開発者ヒアリング","70件（九州で9件）",null,"70件（九州で9件）",null,"2件（九州で1件）",null,"2件（九州で1件）",null,"-",null,"-",null,"0件（九州で0件）",null,"0件（九州で0件）",null,"13件（九州で0件）",null,"13件（九州で0件）",null,"13件（九州で0件）",null,"13件（九州で0件）",null,"42件（九州で1件）",null,"42件（九州で1件）",null,"2200件以上（九州で600件以上）",null,"2200件以上（九州で600件以上）",null,"544件（九州で68件）",null,"544件（九州で68件）",null,"0件（九州で0件）",null,"0件（九州で0件）"]
[null,null,null,null,"その他：開発者ヒアリング","2件（九州で0件）",null,"2件（九州で0件）",null,"0件（九州で0件）",null,"0件（九州で0件）",null,"-",null,"-",null,"1件（九州で0件）",null,"1件（九州で0件）",null,"12件（九州で0件）",null,"12件（九州で0件）",null,"12件（九州で0件）",null,"12件（九州で0件）",null,"40件（九州で2件）",null,"40件（九州で2件）",null,"500件以上（九州で100件以上）",null,"500件以上（九州で100件以上）",null,"242件（九州で31件）",null,"242件（九州で31件）",null,"1件（九州で0件）",null,"1件（九州で0件）"]
[null,"⑱",null,"九州管内での活用市町村（直轄工事活用分）",null,"福岡県（福岡市）大分県（佐伯市）",null,"福岡県（福岡市）大分県（佐伯市）",null,"福岡県（福岡市）",null,"福岡県（福岡市）",null,"-",null,"-",null,"-",null,"-",null,"-",null,"-",null,"-",null,"-",null,"-",null,"-",null,"実績多数（直轄工事分不明）",null,"実績多数（直轄工事分不明）",null,"-",null,"-",null,"-",null,"-"]
[null,null,null,"本工法比較表の仕様における九州地方整備局管内での施工実績の有無",null,"有",null,"有",null,"有",null,"有",null,"無",null,"無",null,"無",null,"無",null,"無",null,"無",null,"無",null,"無",null,"有",null,"有",null,"有",null,"有",null,"有",null,"有",null,"無",null,"無"]
[null,"⑲",null,"九州の特殊土壌の施工実績例","シラス","-",null,"-",null,"-",null,"-",null,"-",null,"-",null,"-",null,"-",null,"-",null,"-",null,"-",null,"-",null,"-",null,"-",null,"-",null,"-",null,"-",null,"-",null,"-",null,"-"]
[null,null,null,null,"有明粘土","-",null,"-",null,"-",null,"-",null,"-",null,"-",null,"-",null,"-",null,"-",null,"-",null,"-",null,"-",null,"-",null,"-",null,"-",null,"-",null,"-",null,"-",null,"-",null,"-"]
[null,null,null,null,"黒ボク・赤ボク等","-",null,"-",null,"-",null,"-",null,"-",null,"-",null,"-",null,"-",null,"-",null,"-",null,"-",null,"-",null,"-",null,"-",null,"-",null,"-",null,"-",null,"-",null,"-",null,"-"]
[null,null,null,null,"そうら層（泥炭）","-",null,"-",null,"-",null,"-",null,"-",null,"-",null,"-",null,"-",null,"-",null,"-",null,"-",null,"-",null,"-",null,"-",null,"-",null,"-",null,"-",null,"-",null,"-",null,"-"]
[null,null,null,null,"その他（島原焼土等）","-",null,"-",null,"-",null,"-",null,"-",null,"-",null,"-",null,"-",null,"-",null,"-",null,"-",null,"-",null,"-",null,"-",null,"-",null,"-",null,"-",null,"-",null,"-",null,"-"]
[null,"⑳","特許等","特許",null,"第3561645号「砂地盤の液状化防止工法及びその装置」、第3803024号「薬液注入による砂地盤の液状化対策工法」等　特許使用料：300円/㎥（対象地盤）",null,"第3561645号「砂地盤の液状化防止工法及びその装置」、第3803024号「薬液注入による砂地盤の液状化対策工法」等　特許使用料：300円/㎥（対象地盤）",null,"第3826386号「削孔装置の削孔位置管理方法」、第3852592号「ジャイロ装置及び掘削用ジャイロ装置の使用方法」",null,"第3826386号「削孔装置の削孔位置管理方法」、第3852592号「ジャイロ装置及び掘削用ジャイロ装置の使用方法」",null,"第5016947号「固化材振動注入工法及びその装置」",null,"第5016947号「固化材振動注入工法及びその装置」",null,"1)特許5107212号 地盤注入装置及び地盤注入工法、 2)特開-2019-078053 注入外管及び薬液注入工法、3)特開-2019-078054 注入外管及び薬液注入工法、4)特開-2019-078055 シール剤、シール剤用品，及び薬液注入工法",null,"1)特許5107212号 地盤注入装置及び地盤注入工法、 2)特開-2019-078053 注入外管及び薬液注入工法、3)特開-2019-078054 注入外管及び薬液注入工法、4)特開-2019-078055 シール剤、シール剤用品，及び薬液注入工法",null,"特許第5920881号 地盤注入装置及び地盤注入工法、特許第6150387号 地盤注入装置",null,"特許第5920881号 地盤注入装置及び地盤注入工法、特許第6150387号 地盤注入装置",null,"特許第5920881号 地盤注入装置及び地盤注入工法、特許第6150387号 地盤注入装置",null,"特許第5920881号 地盤注入装置及び地盤注入工法、特許第6150387号 地盤注入装置",null,"特許第4766532号（地盤注入工法）、特許第4908184号（地盤注入用グラウト材及び地盤注入工法）、特許第4948661号（地盤改良工法）",null,"特許第4766532号（地盤注入工法）、特許第4908184号（地盤注入用グラウト材及び地盤注入工法）、特許第4948661号（地盤改良工法）",null,"第4097664号「地盤注入工法」、第4437481号「地盤改良工法」、第4486564号「地盤改良効果の確認方法並びにこの工法を用いた地盤注入工法」、第5156928号「耐久性地盤改良工法」",null,"第4097664号「地盤注入工法」、第4437481号「地盤改良工法」、第4486564号「地盤改良効果の確認方法並びにこの工法を用いた地盤注入工法」、第5156928号「耐久性地盤改良工法」",null,"-",null,"-",null,"特許第7212423号「地盤注入工法および地盤注入装置」",null,"特許第7212423号「地盤注入工法および地盤注入装置」"]
[null,null,null,"建設技術審査証明",null,"（一財）沿岸技術研究センター第99111号",null,"（一財）沿岸技術研究センター第99111号",null,"（一財）沿岸技術研究センター第08001号",null,"（一財）沿岸技術研究センター第08001号",null,"-",null,"-",null,"-",null,"-",null,"-",null,"-",null,"-",null,"-",null,"一般財団法人沿岸技術研究センター　第14002号　多点同時注入工法-恒久グラウトを用いた変位抑制型の薬液浸透注入工法",null,"一般財団法人沿岸技術研究センター　第14002号　多点同時注入工法-恒久グラウトを用いた変位抑制型の薬液浸透注入工法",null,"-",null,"-",null,"-",null,"-",null,"-",null,"-"]
[null,"㉑","生産供給体制（機械保有台数等）",null,null,"ボーリングマシン70台、薬液注入ポンプ100台",null,"ボーリングマシン70台、薬液注入ポンプ100台",null,"曲り削孔機10台、薬液注入ポンプ100台",null,"曲り削孔機10台、薬液注入ポンプ100台",null,"技術提供が可能な地域：全国\n機械の保有台数：4台×2社＝8台",null,"技術提供が可能な地域：全国\n機械の保有台数：4台×2社＝8台",null,"技術提供可能地域：全国\n機械保有台数：自動計測ミキシングプラント８台（愛知県８台）、集中管理装置１０台（愛知県１０台）",null,"技術提供可能地域：全国\n機械保有台数：自動計測ミキシングプラント８台（愛知県８台）、集中管理装置１０台（愛知県１０台）",null,"汎用型の機械で施工可能。",null,"汎用型の機械で施工可能。",null,"汎用型の機械で施工可能。",null,"汎用型の機械で施工可能。",null,"施工機械は，兵庫県と群馬県の機械センターで保有しているが，稼働状況により適宜確認が必要。",null,"施工機械は，兵庫県と群馬県の機械センターで保有しているが，稼働状況により適宜確認が必要。",null,"汎用型の機械で施工が可能。",null,"汎用型の機械で施工が可能。",null,"汎用性のある施工機械であり，台数等の制限はない。",null,"汎用性のある施工機械であり，台数等の制限はない。",null,"全国（機械保有：東京都，北海道，宮城県，千葉県，大阪府，福岡県）",null,"全国（機械保有：東京都，北海道，宮城県，千葉県，大阪府，福岡県）"]
[null,"㉒","備考",null,null,"-",null,"-",null,"本技術は高精度で曲線ボーリングを行う技術であり、薬液注入工法としては、同じ開発者の「浸透固化処理工法（NETIS登録期間終了技術）」との併用となる。",null,"本技術は高精度で曲線ボーリングを行う技術であり、薬液注入工法としては、同じ開発者の「浸透固化処理工法（NETIS登録期間終了技術）」との併用となる。",null,"・電波法に基づく高周波利用設備の申請(総務省の各地方総合通信局へ届出)については、注入装置の型式指定を取得したため不要である。",null,"・電波法に基づく高周波利用設備の申請(総務省の各地方総合通信局へ届出)については、注入装置の型式指定を取得したため不要である。",null,"-",null,"-",null,"-",null,"-",null,"-",null,"-",null,"地方自治体及びその他における施工実績の対象は、注入材にパーマロックASFシリーズを使用し、注入工法は超多点注入工法の組合せで施工を行った件数である。",null,"地方自治体及びその他における施工実績の対象は、注入材にパーマロックASFシリーズを使用し、注入工法は超多点注入工法の組合せで施工を行った件数である。",null,"-",null,"-",null,"-",null,"-",null,"-",null,"-"]
["発注者ニーズへの適応性","㉓","周辺地盤への変位抑制",null,null,"○：低圧で浸透注入するため、当該技術は構造上変位が出にくい。",null,"○：低圧で浸透注入するため、当該技術は構造上変位が出にくい。",null,"○：基本的に「浸透固化処理工法」との併用であり、低圧で浸透注入するため、当該技術は構造上変位が出にくい。",null,"○：基本的に「浸透固化処理工法」との併用であり、低圧で浸透注入するため、当該技術は構造上変位が出にくい。",null,"-",null,"-",null,"○：施工時の注入圧力低減により、周辺構造物等への影響が無く周辺への変位抑制が図られる。",null,"○：施工時の注入圧力低減により、周辺構造物等への影響が無く周辺への変位抑制が図られる。",null,"○：長い浸透区間から材料を吐出するため注入圧力を低下させることが可能。",null,"○：長い浸透区間から材料を吐出するため注入圧力を低下させることが可能。",null,"-",null,"-",null,"○：急速浸透注入工法により、低吐出での施工となり注入圧の上昇を抑える事が可能",null,"○：急速浸透注入工法により、低吐出での施工となり注入圧の上昇を抑える事が可能",null,"〇：長いゲルタイムによる低吐出での浸透注入をすることで、土粒子の配列を乱すことがないため、周辺地盤への変位抑制が可能",null,"〇：長いゲルタイムによる低吐出での浸透注入をすることで、土粒子の配列を乱すことがないため、周辺地盤への変位抑制が可能",null,"-",null,"-",null,"△:従来技術と同程度",null,"△:従来技術と同程度"]
[null,"㉔","騒音・振動の低減",null,null,"△：従来技術と同程度。",null,"△：従来技術と同程度。",null,"△：従来技術と同程度。",null,"△：従来技術と同程度。",null,"△：従来技術と同程度。",null,"△：従来技術と同程度。",null,"△：従来技術と同程度。",null,"△：従来技術と同程度。",null,"△：従来技術と同程度。",null,"△：従来技術と同程度。",null,"△：従来技術と同程度。",null,"△：従来技術と同程度。",null,"△：従来技術と同程度。",null,"△：従来技術と同程度。",null,"△：従来技術と同程度。",null,"△：従来技術と同程度。",null,"△：従来技術と同程度。",null,"△：従来技術と同程度。",null,"△:従来技術と同程度",null,"△:従来技術と同程度"]
[null,"㉕","従来技術との比較評価\n\n判定の凡例\n○：従来技術より優れる\n△：従来技術と同程度\n―：上記以外","狭隘な現場での施工性",null,"△：従来技術と同程度。",null,"△：従来技術と同程度。",null,"△：従来技術と同程度。",null,"△：従来技術と同程度。",null,"△：従来技術と同程度。",null,"△：従来技術と同程度。",null,"△：従来技術と同程度。",null,"△：従来技術と同程度。",null,"△：従来技術と同程度。",null,"△：従来技術と同程度。",null,"△：従来技術と同程度。",null,"△：従来技術と同程度。",null,"△：従来技術と同程度。",null,"△：従来技術と同程度。",null,"△：従来技術と同程度。",null,"△：従来技術と同程度。",null,"△：従来技術と同程度。",null,"△：従来技術と同程度。",null,"△:従来技術と同程度",null,"△:従来技術と同程度"]
[null,"㉖",null,"軟弱地盤上での施工性\n（トラフィカビリティ）",null,"△：従来技術と同程度。",null,"△：従来技術と同程度。",null,"△：従来技術と同程度。",null,"△：従来技術と同程度。",null,"△：従来技術と同程度。",null,"△：従来技術と同程度。",null,"△：従来技術と同程度。",null,"△：従来技術と同程度。",null,"△：従来技術と同程度。",null,"△：従来技術と同程度。",null,"△：従来技術と同程度。",null,"△：従来技術と同程度。",null,"△：従来技術と同程度。",null,"△：従来技術と同程度。",null,"△：従来技術と同程度。",null,"△：従来技術と同程度。",null,"△：従来技術と同程度。",null,"△：従来技術と同程度。",null,"△:従来技術と同程度",null,"△:従来技術と同程度"]
[null,"㉗",null,"省人化・省力化",null,"○：注入工一本に対して複数地点を同時に大量注入できることなどにより、段取替えの回数が少なくなり、人員構成が減るため省人化が図られる。",null,"○：注入工一本に対して複数地点を同時に大量注入できることなどにより、段取替えの回数が少なくなり、人員構成が減るため省人化が図られる。",null,"○：「位置検出システム」、「施工管理システム」、「削孔システム」を導入していることにより、省力化が可能。",null,"○：「位置検出システム」、「施工管理システム」、「削孔システム」を導入していることにより、省力化が可能。",null,"△：従来技術と同程度。",null,"△：従来技術と同程度。",null,"○：薬液注入管理の集中管理システム導入により複数（16ポイント）の注入ポンプを同時に管理可能となるため，省人化を図ることができる。",null,"○：薬液注入管理の集中管理システム導入により複数（16ポイント）の注入ポンプを同時に管理可能となるため，省人化を図ることができる。",null,"○：削孔本数の低減、注入速度の向上により、従来技術より工期の短縮が可能なため、省人化・省力化が図られる。",null,"○：削孔本数の低減、注入速度の向上により、従来技術より工期の短縮が可能なため、省人化・省力化が図られる。",null,"-：粘性土地盤においては、適宜検討を要する。",null,"-：粘性土地盤においては、適宜検討を要する。",null,"○：急速浸透注入工法による大径化により、削孔本数が低減されるため、省人化・省力化が可能",null,"○：急速浸透注入工法による大径化により、削孔本数が低減されるため、省人化・省力化が可能",null,"△：従来技術と同程度。",null,"△：従来技術と同程度。",null,"△：従来技術と同程度。",null,"△：従来技術と同程度。",null,"○:従来の注入材ではA液、B液、C液の3種の組合せであったが、シリカゾルグラウトはA液、B液で構成されるため省力化が図れる。",null,"○:従来の注入材ではA液、B液、C液の3種の組合せであったが、シリカゾルグラウトはA液、B液で構成されるため省力化が図れる。"]
["㉘",null,"総括",null,null,"・削孔1箇所当りの改良範囲が大きいため削孔本数の減少が可能であることから施工性に優れ、工程短縮、コスト縮減が図られる（評価情報より）。\n・低圧で薬液を浸透注入することから近接構造物への影響が少ない（評価情報より）。\n・従来の水ガラスから劣化成分を取り除いた恒久薬液であるため長期的に劣化せず、改良体の耐久性向上が期待できる（評価情報より）。\n・斜め削孔をする場合は、改良位置の精度を良くするため機械精度（角度調整等）に留意する必要がある（評価情報より）。",null,"・削孔1箇所当りの改良範囲が大きいため削孔本数の減少が可能であることから施工性に優れ、工程短縮、コスト縮減が図られる（評価情報より）。\n・低圧で薬液を浸透注入することから近接構造物への影響が少ない（評価情報より）。\n・従来の水ガラスから劣化成分を取り除いた恒久薬液であるため長期的に劣化せず、改良体の耐久性向上が期待できる（評価情報より）。\n・斜め削孔をする場合は、改良位置の精度を良くするため機械精度（角度調整等）に留意する必要がある（評価情報より）。",null,"・リアルタイムに削孔位置をモニターで確認できることにより、オペレーターが目標位置に誘導しやすく、重要な地中構造物を傷めず回避できるため、高品質の出来形が得られる（評価情報より）。\n・削孔が回転と圧入のみであるため、巨礫等が点在する土質においては、掘り直しに時間を要する（評価情報より）。\n・本技術は、削孔の入射角や曲率などの関係から施工深度が作業ヤードの広さに影響を与えるため、適用にあたっては現場施工条件に留意する必要がある。曲がり削孔の施工精度向上には、施工法・機器操作の熟練が必要である（評価情報より）。\n・高精度位置検出装置(小型ジャイロ)は精密機械であるため、取扱いに注意が必要である（評価情報より）。\n・構造物直下の施工時には、立杭構築・復旧等に伴う仮設工事が不要であるため、既設構造物への影響が少ない（WGからのコメント）。",null,"・リアルタイムに削孔位置をモニターで確認できることにより、オペレーターが目標位置に誘導しやすく、重要な地中構造物を傷めず回避できるため、高品質の出来形が得られる（評価情報より）。\n・削孔が回転と圧入のみであるため、巨礫等が点在する土質においては、掘り直しに時間を要する（評価情報より）。\n・本技術は、削孔の入射角や曲率などの関係から施工深度が作業ヤードの広さに影響を与えるため、適用にあたっては現場施工条件に留意する必要がある。曲がり削孔の施工精度向上には、施工法・機器操作の熟練が必要である（評価情報より）。\n・高精度位置検出装置(小型ジャイロ)は精密機械であるため、取扱いに注意が必要である（評価情報より）。\n・構造物直下の施工時には、立杭構築・復旧等に伴う仮設工事が不要であるため、既設構造物への影響が少ない（WGからのコメント）。",null,"・従来の注入工法（二重管ダブルパッカ工法）とほぼ同等の設備と作業性のまま、超音波振動エネルギーの効果により薬液の浸透性能が向上し、高品質な改良体を作ることができる（例：超音波振動あり、超音波振動なしの改良面積の比は約1.6 倍となっている）（補完情報より）。\n・粘性土そのものに対しての適用性は従来技術と同程度（割裂注入）。注入対象の砂質土地盤の上に粘性土地盤があるような場合に、地盤の層境で拡散させずに、砂質土地盤への均一な注入が見込まれる。\n・注入時の超音波振動発生の設定以外は従来の二重管ダブルパッカ工法の施工方法に準ずる（ＮＥＴＩＳ情報より）。",null,"・従来の注入工法（二重管ダブルパッカ工法）とほぼ同等の設備と作業性のまま、超音波振動エネルギーの効果により薬液の浸透性能が向上し、高品質な改良体を作ることができる（例：超音波振動あり、超音波振動なしの改良面積の比は約1.6 倍となっている）（補完情報より）。\n・粘性土そのものに対しての適用性は従来技術と同程度（割裂注入）。注入対象の砂質土地盤の上に粘性土地盤があるような場合に、地盤の層境で拡散させずに、砂質土地盤への均一な注入が見込まれる。\n・注入時の超音波振動発生の設定以外は従来の二重管ダブルパッカ工法の施工方法に準ずる（ＮＥＴＩＳ情報より）。",null,"・本工法では、新しい地山パッカによる削孔穴からの薬液漏洩防止機能の強化,特殊シール材による大きな薬液浸透源の確保,薬液注入の集中管理システムによる注入管理の効率化により従来工法と比較して注入効率を高めている（補完情報より）。\n・イオン濃度の高い地盤では、特殊シール材の配合、種類を事前に検討する必要がある（NETIS情報より。）\n・粘性土が 互層状に存在する地盤、薬液の逸走が懸念される砂礫または礫混じり砂地盤、地下水の流れが速い地盤等では、注入計画,薬液の配合に留意が必要（NETIS情報より）。",null,"・本工法では、新しい地山パッカによる削孔穴からの薬液漏洩防止機能の強化,特殊シール材による大きな薬液浸透源の確保,薬液注入の集中管理システムによる注入管理の効率化により従来工法と比較して注入効率を高めている（補完情報より）。\n・イオン濃度の高い地盤では、特殊シール材の配合、種類を事前に検討する必要がある（NETIS情報より。）\n・粘性土が 互層状に存在する地盤、薬液の逸走が懸念される砂礫または礫混じり砂地盤、地下水の流れが速い地盤等では、注入計画,薬液の配合に留意が必要（NETIS情報より）。",null,"・粘性土地盤においては、従来工法と同様に注入材料の種別によらず割裂注入形態となるため、注入目的に合致しているかを検討する必要がある（NETIS情報より。）\n・従来工法 (ダブルパッカー工法)で使用する機械・設備をそのまま使用することが可能であり、特殊な専用機械類を開発・購入する必要はない（NETIS情報より）。\n・注入材料は、ゲルタイムの 短い瞬結型材料は使用不可であるが、中結型材料以上であれば、溶液型、懸濁型の両者を使用できる（NETIS情報より）。",null,"・粘性土地盤においては、従来工法と同様に注入材料の種別によらず割裂注入形態となるため、注入目的に合致しているかを検討する必要がある（NETIS情報より。）\n・従来工法 (ダブルパッカー工法)で使用する機械・設備をそのまま使用することが可能であり、特殊な専用機械類を開発・購入する必要はない（NETIS情報より）。\n・注入材料は、ゲルタイムの 短い瞬結型材料は使用不可であるが、中結型材料以上であれば、溶液型、懸濁型の両者を使用できる（NETIS情報より）。",null,"・粘性工地盤においては、従来工法と同様に注入材料の種別によらず割裂注入形態となるため、注入目的に合致しているかを検討する必要がある（NETIS情報より。）\n・従来工法 (ダブルパッカー工法)で使用する機械・設備をそのまま使用することが可能であり、特殊な専用機械類を開発・購入する必要はない（NETIS情報より）。\n・注入材料は、ゲルタイムの 短い瞬結型材料は使用不可であるが、中結型材料以上であれば、溶液型、懸濁型の両者を使用できる（NETIS情報より）。",null,"・粘性工地盤においては、従来工法と同様に注入材料の種別によらず割裂注入形態となるため、注入目的に合致しているかを検討する必要がある（NETIS情報より。）\n・従来工法 (ダブルパッカー工法)で使用する機械・設備をそのまま使用することが可能であり、特殊な専用機械類を開発・購入する必要はない（NETIS情報より）。\n・注入材料は、ゲルタイムの 短い瞬結型材料は使用不可であるが、中結型材料以上であれば、溶液型、懸濁型の両者を使用できる（NETIS情報より）。",null,"・現在使用されているあらゆる薬液注入工法に適用可能。特に急速浸透注入工法(超多点注入工法等)を用いると効果的な改良が可能（NETIS情報より）。\n・細粒分含有率が20％以上40％未満の地盤については、十分な検討を要する（NETISより）。\n・小型機による施工で騒音・振動は少ないが、必要に応じて防音設備を設けることがある（NETIS情報より）。",null,"・現在使用されているあらゆる薬液注入工法に適用可能。特に急速浸透注入工法(超多点注入工法等)を用いると効果的な改良が可能（NETIS情報より）。\n・細粒分含有率が20％以上40％未満の地盤については、十分な検討を要する（NETISより）。\n・小型機による施工で騒音・振動は少ないが、必要に応じて防音設備を設けることがある（NETIS情報より）。",null,"・耐久性無機溶液型シリカゾルグラウトは、水ガラスのアルカリを酸で除去した非アルカリ性珪酸水溶液をベースにした注入材であり、ゲルからのシリカの溶出量は極めて少なく、長期耐久性に優れた注入材である（NETIS情報より）。\n・本技術は非アルカリ系の注入材となるが、金属イオン封鎖材（マスキングシリカ）を使用することにより、埋設コンクリート構造物への影響を回避することが可能である（NETIS情報より）。\n・無機質の注入材料は、弱酸性～中性領域でゲル化するため、アルカリの溶脱はほとんどなく、固結物は中性域を保つことより、地下水への影響を抑制できる（補完情報より）。\n・施工方法は、従来工法（二重管ダブルパッカー工法等）で施工可能（NETIS情報より）。",null,"・耐久性無機溶液型シリカゾルグラウトは、水ガラスのアルカリを酸で除去した非アルカリ性珪酸水溶液をベースにした注入材であり、ゲルからのシリカの溶出量は極めて少なく、長期耐久性に優れた注入材である（NETIS情報より）。\n・本技術は非アルカリ系の注入材となるが、金属イオン封鎖材（マスキングシリカ）を使用することにより、埋設コンクリート構造物への影響を回避することが可能である（NETIS情報より）。\n・無機質の注入材料は、弱酸性～中性領域でゲル化するため、アルカリの溶脱はほとんどなく、固結物は中性域を保つことより、地下水への影響を抑制できる（補完情報より）。\n・施工方法は、従来工法（二重管ダブルパッカー工法等）で施工可能（NETIS情報より）。",null,"・急速浸透注入工法（エキスパッカ工法、超多点注入工法、多点同時注入工法、マルチストレーナ工法、マルチパッカ工法、複合注入工法）と組合わせることにより、ダブルパッカー工法よりも削孔本数が抑制される（NETIS情報より）。\n・施工方法は、従来工法（二重管ダブルパッカー工法等）で施工可能（NETIS情報より）。\n・ゲルタイムの範囲は、ゲルタイム（20℃）で二重管ダブルパッカは5分～60分、二重管ストレーナは6秒～15分となる（補完情報より）。",null,"・急速浸透注入工法（エキスパッカ工法、超多点注入工法、多点同時注入工法、マルチストレーナ工法、マルチパッカ工法、複合注入工法）と組合わせることにより、ダブルパッカー工法よりも削孔本数が抑制される（NETIS情報より）。\n・施工方法は、従来工法（二重管ダブルパッカー工法等）で施工可能（NETIS情報より）。\n・ゲルタイムの範囲は、ゲルタイム（20℃）で二重管ダブルパッカは5分～60分、二重管ストレーナは6秒～15分となる（補完情報より）。",null,"・九州地方（国土交通省）での活用実績はない（評価情報より）。\n・流量圧力管理測定装置には、プロポーション注入工法用の改良型を用いること（NETIS情報より）。\n・本技術は、従来の3液構成から2液構成へと簡素化されたことで、経済性・施工性が向上した技術である（補完情報より）。",null,"・九州地方（国土交通省）での活用実績はない（評価情報より）。\n・流量圧力管理測定装置には、プロポーション注入工法用の改良型を用いること（NETIS情報より）。\n・本技術は、従来の3液構成から2液構成へと簡素化されたことで、経済性・施工性が向上した技術である（補完情報より）。"]
[]
[null,null,"改良強度",null,null,{"$f":"G34","v":"100kN/m2"},null,{"$f":"I34","v":"100kN/m2"},null,{"$f":"K34","v":"100kN/m2"},null,{"$f":"M34","v":"100kN/m2"},null,{"$f":"O34","v":"60～100kN/m2"},null,{"$f":"Q34","v":"60～100kN/m2"},null,{"$f":"S34","v":"100kN/m2"},null,{"$f":"U34","v":"100kN/m2"},null,{"$f":"W34","v":"60kN/m2"},null,{"$f":"Y34","v":"60kN/m2"},null,{"$f":"AA34","v":"40kN/m2"},null,{"$f":"AC34","v":"40kN/m2"},null,{"$f":"AE34","v":"50kN/m2"},null,{"$f":"AG34","v":"50kN/m2"},null,{"$f":"AI34","v":"100～225kN/m2"},null,{"$f":"AK34","v":"100～225kN/m2"},null,{"$f":"AM34","v":"250～4000kN/m2"},null,{"$f":"AO34","v":"250～4000kN/m2"},null,{"$f":"AQ34","v":"50～150kN/m2"},null,{"$f":"AS34","v":"50～150kN/㎡"}]
[null,null,"共通仮設費用（据付・解体費用）",null,null,{"$f":"G35","v":831800},null,831800,null,831800,null,831800,null,1285500,null,1072100,null,769854,null,769854,null,933240,null,933240,null,933240,null,933240,null,1381600,null,1381600,null,867865,null,867865,null,867865,null,867865,null,690146,null,458834]
[null,null,"概算費用","施工費用",null,8209,null,{"$f":"I36","v":7976},null,24406,null,29635,null,20355,null,20531,null,12385.087,null,11985.874,null,16678,null,16006,null,26857,null,25317,null,6165,null,6061,null,24519,null,22785,null,24519,null,22992,null,11619,null,13045]
[null,null,null,"一次注入材料費",null,37,null,35,null,105,null,133,null,450,null,450,null,0,null,0,null,602,null,602,null,1204,null,1204,null,"-",null,"-",null,431,null,431,null,431,null,431,null,10800,null,10800]
[null,null,null,"二次注入材料費",null,30375,null,30375,null,30375,null,30375,null,20300,null,20300,null,22400,null,22400,null,26982,null,26981,null,10640,null,10640,null,17010,null,17010,null,25205,null,25205,null,25205,null,25205,null,11070,null,11070]
[null,null,null,"合計",null,38621,null,38386,null,54886,null,60143,null,41105,null,41281,null,34785.087,null,34385.873999999996,null,44262,null,43589,null,38701,null,37161,null,23175,null,23071,null,50155,null,48421,null,50155,null,48628,null,33894,null,35320]
[null,null,null,"標準施工規模",null,26,null,13,null,10,null,10,null,30,null,15,null,30,null,15,null,36,null,18,null,100,null,50,null,25,null,12,null,100,null,50,null,100,null,50,null,100,null,50]
[null,null,"施工日数",null,null,2.4074074074074074E-2,null,2.3214285714285712E-2,null,3.8461538461538457E-2,null,4.3478260869565216E-2,null,2.9126213592233007E-2,null,3.3333333333333333E-2,null,1.3086184234546716E-2,null,2.412261495151705E-2,null,2.7067669172932331E-2,null,2.6470588235294117E-2,null,0.04,null,7.0921985815602842E-2,null,1.2019230769230768E-2,null,2.100840336134454E-2,null,5.7142857142857141E-2,null,0.10309278350515466,null,5.5865921787709494E-2,null,5.1546391752577331E-2,null,2.1999999999999999E-2,null,4.2016806722689079E-2]
[null,null,"統一した従来技術との比較","経済性",null,"（38,621-45,386）/45,386=-14.9%",null,"（38,386-43,859）/43,859=-12.5%",null,"（54,886-45,386）/45,386=20.9%",null,"（60,143-43,859）/43,859=37.1%",null,"（41,105-45,386）/45,386=-9.4%",null,"（41,281-43,859）/43,859=-5.9%",null,"（34,785-45,386）/45,386=-23.4%",null,"（34,386-43,859）/43,859=-21.6%",null,"（44,262-45,386）/45,386=-2.5%",null,"（43,589-43,859）/43,859=-0.6%",null,"（38,701-26,976）/26,976=43.5%",null,"（37,161-25,509）/25,509=45.7%",null,"（23,175-45,386）/45,386=-48.9%",null,"（23,071-43,859）/43,859=-47.4%",null,"（50,155-45,386）/45,386=10.5%",null,"（48,421-43,859）/43,859=10.4%",null,"（50,155-45,386）/45,386=10.5%",null,"（48,628-43,859）/43,859=10.9%",null,"（33,894-35,070）/35,070=-3.4%",null,"（35,320-36,470）/36,470=-3.2%"]
[null,null,null,"工程",null,"（0.024-0.056）/0.056=-57.1%",null,"（0.023-0.051）/0.051=-54.9%",null,"（0.038-0.056）/0.056=-32.1%",null,"（0.043-0.051）/0.051=-15.7%",null,"（0.029-0.056）/0.056=-48.2%",null,"（0.033-0.051）/0.051=-35.3%",null,"（0.013-0.056）/0.056=-76.8%",null,"（0.024-0.051）/0.051=-52.9%",null,"（0.027-0.056）/0.056=-51.8%",null,"（0.026-0.051）/0.051=-49.0%",null,"（0.040-0.040）/0.040=0.0%",null,"（0.071-0.036）/0.036=97.2%",null,"（0.012-0.056）/0.056=-78.6%",null,"（0.021-0.051）/0.051=-58.8%",null,"（0.057-0.056）/0.056=1.8%",null,"（0.103-0.051）/0.051=102.0%",null,"（0.056-0.056）/0.056=0.0%",null,"（0.052-0.051）/0.051=2.0%",null,"（0.022-0.022）/0.022=0.0%",null,"（0.042-0.039）/0.039=7.7%"]

{"sheet":"仕様の整理","index":5,"n_rows":23,"n_cols":50,"rows_kept":23,"cut":false,"hidden":false,"merged":[[1,22,2,22],[1,26,2,26]]}
[null," 対象工種の仕様の整理",null,null,"登録技術：",{"$f":"SUMPRODUCT((E4:E1000<>\"\")/COUNTIF(E4:E1000,E4:E1000&\"\"))&\"技術\"&MAX(B:B)&\"仕様\"","v":"9技術20仕様"},"検索結果：",{"$f":"\"\"&SUM(IF((A4:A1000<>\"\")*(A4:A1000<>\"-\")*(E4:E1000<>\"\"),1/COUNTIFS(A4:A1000,\"<>\",A4:A1000,\"<>-\",E4:E1000,E4:E1000)))&\"技術\"&COUNT(A:A)&\"仕様\"","v":"1技術1仕様"},null,null,null,null,null,null,null,null,null,null,null,null,null,null,"→検索結果",null,null,null,null,null,null,null,null,null,null,null,null,null,null,null,null,"→絶対順位"]
[null,"基本情報",null,null,null,null,null,null,null,null,null,null,null,null,null,null,null,"DB情報",null,null,null,null,"条件一致","改良深度","土質","九州有無","制約判定","改良深度が25ｍ以上","重要構造物の近接施工","高い遮水性が要求される場合","大規模開削の底盤改良","特に高い耐久性を要求する場合","構造物直下の地盤改良（曲がり削孔工法）","発注者ニーズ","周辺地盤への変位抑制","騒音・振動の低減","狭隘な現場での施工性","軟弱地盤上での施工性（トラフィカビリティ）","省人化・省力化"]
["検索順位","番号","技術\n番号","技術名","NETIS登録番号","技術の種類","審議終了技術","更新日","改良深度","土質","九州\n有無","改良深度が25ｍ以上","重要構造物の近接施工","高い遮水性が要求される場合","大規模開削の底盤改良","特に高い耐久性を要求する場合","構造物直下の地盤改良（曲がり削孔工法）","周辺地盤への変位抑制","騒音・振動の低減","狭隘な現場での施工性","軟弱地盤上での施工性\n（トラフィカビリティ）","省人化・省力化",null,{"$f":"検索!S5","v":10},{"$f":"検索!S6","v":"粘性土"},{"$f":"検索!S7","v":"特に指定しない"},null,{"$f":"検索!S9","v":""},{"$f":"検索!S10","v":""},{"$f":"検索!S11","v":""},{"$f":"検索!S12","v":""},{"$f":"検索!S13","v":""},{"$f":"検索!S14","v":""},{"$f":"検索!S20","v":"優れている"},{"$f":"検索!S21","v":""},{"$f":"検索!S22","v":""},{"$f":"検索!S23","v":""},{"$f":"検索!S24","v":""},{"$f":"検索!S25","v":""},"九州本社","Aの技術","九州でA","記号","登録年度","登録番号","審議終了","仕様","地整","重み付け","絶対順位"]
[{"$f":"IF(検索!$U$1=\"条件検索\", IF(W4=\"○\", COUNTIFS(W:W,\"○\",AX:AX,\"<\"&AX4)+1, \"-\"), IF(検索!$U$1=\"技術名検索\", IF(検索!$B$35=仕様の整理!E4, 仕様の整理!AX4, \"-\"), \"-\"))","v":"-"},1,"3-1","浸透固化処理工法","KT-990230-VG","NETIS掲載期間終了技術","○","令和7年8月",10,"砂質土","有",null,"○","○","○","○",null,{"$f":"LEFT(HLOOKUP($C4,DB!$1:$1048576,62,0),1)","v":"○"},{"$f":"LEFT(HLOOKUP($C4,DB!$1:$1048576,63,0),1)","v":"△"},{"$f":"LEFT(HLOOKUP($C4,DB!$1:$1048576,64,0),1)","v":"△"},{"$f":"LEFT(HLOOKUP($C4,DB!$1:$1048576,65,0),1)","v":"△"},{"$f":"LEFT(HLOOKUP($C4,DB!$1:$1048576,66,0),1)","v":"○"},{"$f":"IF(COUNTIF(X4:AA4,\"○\")+COUNTIF(AH4,\"○\")=5,\"○\",\"×\")","v":"×"},{"$f":"IF(X$3=I4,\"○\",\"×\")","v":"○"},{"$f":"IF(Y$3=J4,\"○\",\"×\")","v":"×"},{"$f":"IF(Z$3=\"特に指定しない\",\"○\",IF(Z$3=K4,\"○\",\"×\"))","v":"○"},{"$f":"IF(COUNTIF($AB$3:$AG$3,\"○\")=0,\"○\",IF(COUNTIF(AB4:AG4,\"○\")>0,\"○\",\"×\"))","v":"○"},{"$f":"IF(AND(AB$3=\"○\",L4=\"○\"),\"○\",\"×\")","v":"×"},{"$f":"IF(AND(AC$3=\"○\",M4=\"○\"),\"○\",\"×\")","v":"×"},"×","×","×","×",{"$f":"IF(COUNTIF(AI4:AM4,\"○\")=5,\"○\",\"×\")","v":"○"},{"$f":"IF(COUNTIF($AI$3:$AM$3,\"✓\")=0, \"○\",  IF(AI$3<>\"✓\", \"○\",    IF(AND(AI$3=\"✓\", OR(AND($AH$3=\"優れている\", R4=\"○\"), AND($AH$3=\"同等以上\", OR(R4=\"○\", R4=\"△\")))),\"○\", \"×\")))","v":"○"},{"$f":"IF(COUNTIF($AI$3:$AM$3,\"✓\")=0, \"○\",  IF(AJ$3<>\"✓\", \"○\",    IF(AND(AJ$3=\"✓\", OR(AND($AH$3=\"優れている\", S4=\"○\"), AND($AH$3=\"同等以上\", OR(S4=\"○\", S4=\"△\")))),\"○\", \"×\")))","v":"○"},{"$f":"IF(COUNTIF($AI$3:$AM$3,\"✓\")=0, \"○\",  IF(AK$3<>\"✓\", \"○\",    IF(AND(AK$3=\"✓\", OR(AND($AH$3=\"優れている\", T4=\"○\"), AND($AH$3=\"同等以上\", OR(T4=\"○\", T4=\"△\")))),\"○\", \"×\")))","v":"○"},{"$f":"IF(COUNTIF($AI$3:$AM$3,\"✓\")=0, \"○\",  IF(AL$3<>\"✓\", \"○\",    IF(AND(AL$3=\"✓\", OR(AND($AH$3=\"優れている\", U4=\"○\"), AND($AH$3=\"同等以上\", OR(U4=\"○\", U4=\"△\")))),\"○\", \"×\")))","v":"○"},{"$f":"IF(COUNTIF($AI$3:$AM$3,\"✓\")=0, \"○\",  IF(AM$3<>\"✓\", \"○\",    IF(AND(AM$3=\"✓\", OR(AND($AH$3=\"優れている\", V4=\"○\"), AND($AH$3=\"同等以上\", OR(V4=\"○\", V4=\"△\")))),\"○\", \"×\")))","v":"○"},{"$f":"HLOOKUP($C4,DB!$1:$1048576,9,0)","v":"△（九州大学大学院）"},{"$f":"RIGHT(E4,LEN(E4)-FIND(\"-\",E4,FIND(\"-\",E4)+1))","v":"VG"},{"$f":"IF(AND(AN4=\"◎\",AO4=\"A\"),1,2)","v":2},{"$f":"VLOOKUP(AO4,条件!D:E,2,0)","v":2},{"$f":"IFERROR(IF(VALUE(LEFT(MID(E4,FIND(\"-\",E4)+1,FIND(\"-\",E4,FIND(\"-\",E4)+1)-FIND(\"-\",E4)-1),2))>=90,\"19\"&LEFT(MID(E4,FIND(\"-\",E4)+1,FIND(\"-\",E4,FIND(\"-\",E4)+1)-FIND(\"-\",E4)-1),2),\"20\"&LEFT(MID(E4,FIND(\"-\",E4)+1,FIND(\"-\",E4,FIND(\"-\",E4)+1)-FIND(\"-\",E4)-1),2)),\"\")","v":"1999"},{"$f":"MID(E4, FIND(\"-\", E4) + 3, FIND(\"-\", E4, FIND(\"-\", E4) + 1) - FIND(\"-\", E4) - 3)","v":"0230"},{"$f":"IF(G4=\"\",2,1)","v":1},{"$f":"MID(C4,FIND(\"-\",C4)+1,LEN(C4))","v":"1"},{"$f":"VLOOKUP(LEFT(E4,2),条件!A:B,2,0)","v":"07"},{"$f":"(AP4&AQ4&AR4&AS4&AT4&TEXT(AU4,\"00\")&AV4)*1","v":221999023010107},{"$f":"_xlfn.RANK.EQ(AW4,AW:AW,1)","v":17}]
[{"$f":"IF(検索!$U$1=\"条件検索\", IF(W5=\"○\", COUNTIFS(W:W,\"○\",AX:AX,\"<\"&AX5)+1, \"-\"), IF(検索!$U$1=\"技術名検索\", IF(検索!$B$35=仕様の整理!E5, 仕様の整理!AX5, \"-\"), \"-\"))","v":"-"},2,"3-2","浸透固化処理工法","KT-990230-VG","NETIS掲載期間終了技術","○","令和7年8月",20,"砂質土","有",null,"○","○","○","○",null,{"$f":"LEFT(HLOOKUP($C5,DB!$1:$1048576,62,0),1)","v":"○"},{"$f":"LEFT(HLOOKUP($C5,DB!$1:$1048576,63,0),1)","v":"△"},{"$f":"LEFT(HLOOKUP($C5,DB!$1:$1048576,64,0),1)","v":"△"},{"$f":"LEFT(HLOOKUP($C5,DB!$1:$1048576,65,0),1)","v":"△"},{"$f":"LEFT(HLOOKUP($C5,DB!$1:$1048576,66,0),1)","v":"○"},{"$f":"IF(COUNTIF(X5:AA5,\"○\")+COUNTIF(AH5,\"○\")=5,\"○\",\"×\")","v":"×"},{"$f":"IF(X$3=I5,\"○\",\"×\")","v":"×"},"×","○",{"$f":"IF(COUNTIF($AB$3:$AG$3,\"○\")=0,\"○\",IF(COUNTIF(AB5:AG5,\"○\")>0,\"○\",\"×\"))","v":"○"},{"$f":"IF(AND(AB$3=\"○\",L5=\"○\"),\"○\",\"×\")","v":"×"},"×","×","×","×","×",{"$f":"IF(COUNTIF(AI5:AM5,\"○\")=5,\"○\",\"×\")","v":"○"},"○",{"$f":"IF(COUNTIF($AI$3:$AM$3,\"✓\")=0, \"○\",  IF(AJ$3<>\"✓\", \"○\",    IF(AND(AJ$3=\"✓\", OR(AND($AH$3=\"優れている\", S5=\"○\"), AND($AH$3=\"同等以上\", OR(S5=\"○\", S5=\"△\")))),\"○\", \"×\")))","v":"○"},"○","○","○",{"$f":"HLOOKUP($C5,DB!$1:$1048576,9,0)","v":"△（九州大学大学院）"},"VG",{"$f":"IF(AND(AN5=\"◎\",AO5=\"A\"),1,2)","v":2},{"$f":"VLOOKUP(AO5,条件!D:E,2,0)","v":2},"1999","0230",1,"2",{"$f":"VLOOKUP(LEFT(E5,2),条件!A:B,2,0)","v":"07"},{"$f":"(AP5&AQ5&AR5&AS5&AT5&TEXT(AU5,\"00\")&AV5)*1","v":221999023010207},{"$f":"_xlfn.RANK.EQ(AW5,AW:AW,1)","v":18}]
[{"$f":"IF(検索!$U$1=\"条件検索\", IF(W6=\"○\", COUNTIFS(W:W,\"○\",AX:AX,\"<\"&AX6)+1, \"-\"), IF(検索!$U$1=\"技術名検索\", IF(検索!$B$35=仕様の整理!E6, 仕様の整理!AX6, \"-\"), \"-\"))","v":"-"},3,"4-1","曲がり削孔工法","KT-060120-VG","NETIS掲載期間終了技術","○","令和7年8月",10,"砂質土","無","○","○","○","○","○","○",{"$f":"LEFT(HLOOKUP($C6,DB!$1:$1048576,62,0),1)","v":"○"},{"$f":"LEFT(HLOOKUP($C6,DB!$1:$1048576,63,0),1)","v":"△"},{"$f":"LEFT(HLOOKUP($C6,DB!$1:$1048576,64,0),1)","v":"△"},{"$f":"LEFT(HLOOKUP($C6,DB!$1:$1048576,65,0),1)","v":"△"},{"$f":"LEFT(HLOOKUP($C6,DB!$1:$1048576,66,0),1)","v":"○"},"×","○","×","○","○","×","×","×","×","×","×","○","○","○","○","○","○",{"$f":"HLOOKUP($C6,DB!$1:$1048576,9,0)","v":"-"},"VG",2,{"$f":"VLOOKUP(AO6,条件!D:E,2,0)","v":2},"2006","0120",1,"1",{"$f":"VLOOKUP(LEFT(E6,2),条件!A:B,2,0)","v":"07"},222006012010107,19]
[{"$f":"IF(検索!$U$1=\"条件検索\", IF(W7=\"○\", COUNTIFS(W:W,\"○\",AX:AX,\"<\"&AX7)+1, \"-\"), IF(検索!$U$1=\"技術名検索\", IF(検索!$B$35=仕様の整理!E7, 仕様の整理!AX7, \"-\"), \"-\"))","v":"-"},4,"4-2","曲がり削孔工法","KT-060120-VG","NETIS掲載期間終了技術","○","令和7年8月",20,"砂質土","無","○","○","○","○","○","○",{"$f":"LEFT(HLOOKUP($C7,DB!$1:$1048576,62,0),1)","v":"○"},{"$f":"LEFT(HLOOKUP($C7,DB!$1:$1048576,63,0),1)","v":"△"},{"$f":"LEFT(HLOOKUP($C7,DB!$1:$1048576,64,0),1)","v":"△"},{"$f":"LEFT(HLOOKUP($C7,DB!$1:$1048576,65,0),1)","v":"△"},{"$f":"LEFT(HLOOKUP($C7,DB!$1:$1048576,66,0),1)","v":"○"},"×","×","×","○","○","×","×","×","×","×","×",{"$f":"IF(COUNTIF(AI7:AM7,\"○\")=5,\"○\",\"×\")","v":"○"},"○","○","○","○","○",{"$f":"HLOOKUP($C7,DB!$1:$1048576,9,0)","v":"-"},"VG",2,{"$f":"VLOOKUP(AO7,条件!D:E,2,0)","v":2},"2006","0120",1,"2",{"$f":"VLOOKUP(LEFT(E7,2),条件!A:B,2,0)","v":"07"},222006012010207,20]
[{"$f":"IF(検索!$U$1=\"条件検索\", IF(W8=\"○\", COUNTIFS(W:W,\"○\",AX:AX,\"<\"&AX8)+1, \"-\"), IF(検索!$U$1=\"技術名検索\", IF(検索!$B$35=仕様の整理!E8, 仕様の整理!AX8, \"-\"), \"-\"))","v":"-"},5,"5-1","超音波振動注入工法","CB-180008-A","事後評価未実施技術","○","令和7年8月",10,"砂質土","無","○","○","○","○","○",null,{"$f":"LEFT(HLOOKUP($C8,DB!$1:$1048576,62,0),1)","v":"-"},{"$f":"LEFT(HLOOKUP($C8,DB!$1:$1048576,63,0),1)","v":"△"},{"$f":"LEFT(HLOOKUP($C8,DB!$1:$1048576,64,0),1)","v":"△"},{"$f":"LEFT(HLOOKUP($C8,DB!$1:$1048576,65,0),1)","v":"△"},{"$f":"LEFT(HLOOKUP($C8,DB!$1:$1048576,66,0),1)","v":"△"},"×","○","×","○","○","×","×","×","×","×","×","○","○","○","○","○","○",{"$f":"HLOOKUP($C8,DB!$1:$1048576,9,0)","v":"-"},"A",2,{"$f":"VLOOKUP(AO8,条件!D:E,2,0)","v":1},"2018","0008",1,"1",{"$f":"VLOOKUP(LEFT(E8,2),条件!A:B,2,0)","v":"05"},212018000810105,1]
[{"$f":"IF(検索!$U$1=\"条件検索\", IF(W9=\"○\", COUNTIFS(W:W,\"○\",AX:AX,\"<\"&AX9)+1, \"-\"), IF(検索!$U$1=\"技術名検索\", IF(検索!$B$35=仕様の整理!E9, 仕様の整理!AX9, \"-\"), \"-\"))","v":"-"},6,"5-2","超音波振動注入工法","CB-180008-A","事後評価未実施技術","○","令和7年8月",20,"砂質土","無","○","○","○","○","○",null,{"$f":"LEFT(HLOOKUP($C9,DB!$1:$1048576,62,0),1)","v":"-"},{"$f":"LEFT(HLOOKUP($C9,DB!$1:$1048576,63,0),1)","v":"△"},{"$f":"LEFT(HLOOKUP($C9,DB!$1:$1048576,64,0),1)","v":"△"},{"$f":"LEFT(HLOOKUP($C9,DB!$1:$1048576,65,0),1)","v":"△"},{"$f":"LEFT(HLOOKUP($C9,DB!$1:$1048576,66,0),1)","v":"△"},"×","×","×","○","○","×","×","×","×","×","×","○","○","○","○","○","○",{"$f":"HLOOKUP($C9,DB!$1:$1048576,9,0)","v":"-"},"A",2,{"$f":"VLOOKUP(AO9,条件!D:E,2,0)","v":1},"2018","0008",1,"2",{"$f":"VLOOKUP(LEFT(E9,2),条件!A:B,2,0)","v":"05"},212018000810205,2]
[{"$f":"IF(検索!$U$1=\"条件検索\", IF(W10=\"○\", COUNTIFS(W:W,\"○\",AX:AX,\"<\"&AX10)+1, \"-\"), IF(検索!$U$1=\"技術名検索\", IF(検索!$B$35=仕様の整理!E10, 仕様の整理!AX10, \"-\"), \"-\"))","v":"-"},7,"6-1","ハイグリップグラウト工法","CB-180028-A","事後評価未実施技術","○","令和7年8月",10,"砂質土","無","○","○","○","○","○",null,{"$f":"LEFT(HLOOKUP($C10,DB!$1:$1048576,62,0),1)","v":"○"},{"$f":"LEFT(HLOOKUP($C10,DB!$1:$1048576,63,0),1)","v":"△"},{"$f":"LEFT(HLOOKUP($C10,DB!$1:$1048576,64,0),1)","v":"△"},{"$f":"LEFT(HLOOKUP($C10,DB!$1:$1048576,65,0),1)","v":"△"},{"$f":"LEFT(HLOOKUP($C10,DB!$1:$1048576,66,0),1)","v":"○"},"×","○","×","○","○","×","×","×","×","×","×","○","○","○","○","○","○",{"$f":"HLOOKUP($C10,DB!$1:$1048576,9,0)","v":"-"},"A",2,{"$f":"VLOOKUP(AO10,条件!D:E,2,0)","v":1},"2018","0028",1,"1",{"$f":"VLOOKUP(LEFT(E10,2),条件!A:B,2,0)","v":"05"},212018002810105,3]
[{"$f":"IF(検索!$U$1=\"条件検索\", IF(W11=\"○\", COUNTIFS(W:W,\"○\",AX:AX,\"<\"&AX11)+1, \"-\"), IF(検索!$U$1=\"技術名検索\", IF(検索!$B$35=仕様の整理!E11, 仕様の整理!AX11, \"-\"), \"-\"))","v":"-"},8,"6-2","ハイグリップグラウト工法","CB-180028-A","事後評価未実施技術","○","令和7年8月",20,"砂質土","無","○","○","○","○","○",null,{"$f":"LEFT(HLOOKUP($C11,DB!$1:$1048576,62,0),1)","v":"○"},{"$f":"LEFT(HLOOKUP($C11,DB!$1:$1048576,63,0),1)","v":"△"},{"$f":"LEFT(HLOOKUP($C11,DB!$1:$1048576,64,0),1)","v":"△"},{"$f":"LEFT(HLOOKUP($C11,DB!$1:$1048576,65,0),1)","v":"△"},{"$f":"LEFT(HLOOKUP($C11,DB!$1:$1048576,66,0),1)","v":"○"},"×","×","×","○","○","×","×","×","×","×","×","○","○","○","○","○","○",{"$f":"HLOOKUP($C11,DB!$1:$1048576,9,0)","v":"-"},"A",2,{"$f":"VLOOKUP(AO11,条件!D:E,2,0)","v":1},"2018","0028",1,"2",{"$f":"VLOOKUP(LEFT(E11,2),条件!A:B,2,0)","v":"05"},212018002810205,4]
[{"$f":"IF(検索!$U$1=\"条件検索\", IF(W12=\"○\", COUNTIFS(W:W,\"○\",AX:AX,\"<\"&AX12)+1, \"-\"), IF(検索!$U$1=\"技術名検索\", IF(検索!$B$35=仕様の整理!E12, 仕様の整理!AX12, \"-\"), \"-\"))","v":"-"},9,"8-1","Newスリーブ注入工法","KT-190012-A","事後評価未実施技術","○","令和7年8月",10,"砂質土","無","○","○","○","○","○",null,{"$f":"LEFT(HLOOKUP($C12,DB!$1:$1048576,62,0),1)","v":"○"},{"$f":"LEFT(HLOOKUP($C12,DB!$1:$1048576,63,0),1)","v":"△"},{"$f":"LEFT(HLOOKUP($C12,DB!$1:$1048576,64,0),1)","v":"△"},{"$f":"LEFT(HLOOKUP($C12,DB!$1:$1048576,65,0),1)","v":"△"},{"$f":"LEFT(HLOOKUP($C12,DB!$1:$1048576,66,0),1)","v":"○"},"×","○","×","○","○","×","×","×","×","×","×","○","○","○","○","○","○",{"$f":"HLOOKUP($C12,DB!$1:$1048576,9,0)","v":"-"},"A",2,{"$f":"VLOOKUP(AO12,条件!D:E,2,0)","v":1},"2019","0012",1,"1",{"$f":"VLOOKUP(LEFT(E12,2),条件!A:B,2,0)","v":"07"},212019001210107,5]
[{"$f":"IF(検索!$U$1=\"条件検索\", IF(W13=\"○\", COUNTIFS(W:W,\"○\",AX:AX,\"<\"&AX13)+1, \"-\"), IF(検索!$U$1=\"技術名検索\", IF(検索!$B$35=仕様の整理!E13, 仕様の整理!AX13, \"-\"), \"-\"))","v":"-"},10,"8-2","Newスリーブ注入工法","KT-190012-A","事後評価未実施技術","○","令和7年8月",20,"砂質土","無","○","○","○","○","○",null,{"$f":"LEFT(HLOOKUP($C13,DB!$1:$1048576,62,0),1)","v":"○"},{"$f":"LEFT(HLOOKUP($C13,DB!$1:$1048576,63,0),1)","v":"△"},{"$f":"LEFT(HLOOKUP($C13,DB!$1:$1048576,64,0),1)","v":"△"},{"$f":"LEFT(HLOOKUP($C13,DB!$1:$1048576,65,0),1)","v":"△"},{"$f":"LEFT(HLOOKUP($C13,DB!$1:$1048576,66,0),1)","v":"○"},"×","×","×","○","○","×","×","×","×","×","×","○","○","○","○","○","○",{"$f":"HLOOKUP($C13,DB!$1:$1048576,9,0)","v":"-"},"A",2,{"$f":"VLOOKUP(AO13,条件!D:E,2,0)","v":1},"2019","0012",1,"2",{"$f":"VLOOKUP(LEFT(E13,2),条件!A:B,2,0)","v":"07"},212019001210207,6]
[{"$f":"IF(検索!$U$1=\"条件検索\", IF(W14=\"○\", COUNTIFS(W:W,\"○\",AX:AX,\"<\"&AX14)+1, \"-\"), IF(検索!$U$1=\"技術名検索\", IF(検索!$B$35=仕様の整理!E14, 仕様の整理!AX14, \"-\"), \"-\"))","v":1},11,"8-3","Newスリーブ注入工法","KT-190012-A","事後評価未実施技術","○","令和7年8月",10,"粘性土","無","○","○","○","○","○",null,{"$f":"LEFT(HLOOKUP($C14,DB!$1:$1048576,62,0),1)","v":"-"},{"$f":"LEFT(HLOOKUP($C14,DB!$1:$1048576,63,0),1)","v":"△"},{"$f":"LEFT(HLOOKUP($C14,DB!$1:$1048576,64,0),1)","v":"△"},{"$f":"LEFT(HLOOKUP($C14,DB!$1:$1048576,65,0),1)","v":"△"},{"$f":"LEFT(HLOOKUP($C14,DB!$1:$1048576,66,0),1)","v":"-"},"○",{"$f":"IF(X$3=I14,\"○\",\"×\")","v":"○"},"○","○","○","×","×","×","×","×","×","○","○","○","○","○","○",{"$f":"HLOOKUP($C14,DB!$1:$1048576,9,0)","v":"-"},"A",2,{"$f":"VLOOKUP(AO14,条件!D:E,2,0)","v":1},"2019","0012",1,"3",{"$f":"VLOOKUP(LEFT(E14,2),条件!A:B,2,0)","v":"07"},212019001210307,7]
[{"$f":"IF(検索!$U$1=\"条件検索\", IF(W15=\"○\", COUNTIFS(W:W,\"○\",AX:AX,\"<\"&AX15)+1, \"-\"), IF(検索!$U$1=\"技術名検索\", IF(検索!$B$35=仕様の整理!E15, 仕様の整理!AX15, \"-\"), \"-\"))","v":"-"},12,"8-4","Newスリーブ注入工法","KT-190012-A","事後評価未実施技術","○","令和7年8月",20,"粘性土","無","○","○","○","○","○",null,{"$f":"LEFT(HLOOKUP($C15,DB!$1:$1048576,62,0),1)","v":"-"},{"$f":"LEFT(HLOOKUP($C15,DB!$1:$1048576,63,0),1)","v":"△"},{"$f":"LEFT(HLOOKUP($C15,DB!$1:$1048576,64,0),1)","v":"△"},{"$f":"LEFT(HLOOKUP($C15,DB!$1:$1048576,65,0),1)","v":"△"},{"$f":"LEFT(HLOOKUP($C15,DB!$1:$1048576,66,0),1)","v":"-"},"×","×","○","○","○","×","×","×","×","×","×","○","○","○","○","○","○",{"$f":"HLOOKUP($C15,DB!$1:$1048576,9,0)","v":"-"},"A",2,{"$f":"VLOOKUP(AO15,条件!D:E,2,0)","v":1},"2019","0012",1,"4",{"$f":"VLOOKUP(LEFT(E15,2),条件!A:B,2,0)","v":"07"},212019001210407,8]
[{"$f":"IF(検索!$U$1=\"条件検索\", IF(W16=\"○\", COUNTIFS(W:W,\"○\",AX:AX,\"<\"&AX16)+1, \"-\"), IF(検索!$U$1=\"技術名検索\", IF(検索!$B$35=仕様の整理!E16, 仕様の整理!AX16, \"-\"), \"-\"))","v":"-"},13,"9-1","パーマロックASFシリーズ","KT-190051-A","事後評価未実施技術","○","令和7年8月",10,"砂質土","無",null,"○","○","○","○",null,{"$f":"LEFT(HLOOKUP($C16,DB!$1:$1048576,62,0),1)","v":"○"},{"$f":"LEFT(HLOOKUP($C16,DB!$1:$1048576,63,0),1)","v":"△"},{"$f":"LEFT(HLOOKUP($C16,DB!$1:$1048576,64,0),1)","v":"△"},{"$f":"LEFT(HLOOKUP($C16,DB!$1:$1048576,65,0),1)","v":"△"},{"$f":"LEFT(HLOOKUP($C16,DB!$1:$1048576,66,0),1)","v":"○"},"×","○","×","○","○","×","×","×","×","×","×","○","○","○","○","○","○",{"$f":"HLOOKUP($C16,DB!$1:$1048576,9,0)","v":"-"},"A",2,{"$f":"VLOOKUP(AO16,条件!D:E,2,0)","v":1},"2019","0051",1,"1",{"$f":"VLOOKUP(LEFT(E16,2),条件!A:B,2,0)","v":"07"},212019005110107,9]
[{"$f":"IF(検索!$U$1=\"条件検索\", IF(W17=\"○\", COUNTIFS(W:W,\"○\",AX:AX,\"<\"&AX17)+1, \"-\"), IF(検索!$U$1=\"技術名検索\", IF(検索!$B$35=仕様の整理!E17, 仕様の整理!AX17, \"-\"), \"-\"))","v":"-"},14,"9-2","パーマロックASFシリーズ","KT-190051-A","事後評価未実施技術","○","令和7年8月",20,"砂質土","無",null,"○","○","○","○",null,{"$f":"LEFT(HLOOKUP($C17,DB!$1:$1048576,62,0),1)","v":"○"},{"$f":"LEFT(HLOOKUP($C17,DB!$1:$1048576,63,0),1)","v":"△"},{"$f":"LEFT(HLOOKUP($C17,DB!$1:$1048576,64,0),1)","v":"△"},{"$f":"LEFT(HLOOKUP($C17,DB!$1:$1048576,65,0),1)","v":"△"},{"$f":"LEFT(HLOOKUP($C17,DB!$1:$1048576,66,0),1)","v":"○"},"×","×","×","○","○","×","×","×","×","×","×","○","○","○","○","○","○",{"$f":"HLOOKUP($C17,DB!$1:$1048576,9,0)","v":"-"},"A",2,{"$f":"VLOOKUP(AO17,条件!D:E,2,0)","v":1},"2019","0051",1,"2",{"$f":"VLOOKUP(LEFT(E17,2),条件!A:B,2,0)","v":"07"},212019005110207,10]
[{"$f":"IF(検索!$U$1=\"条件検索\", IF(W18=\"○\", COUNTIFS(W:W,\"○\",AX:AX,\"<\"&AX18)+1, \"-\"), IF(検索!$U$1=\"技術名検索\", IF(検索!$B$35=仕様の整理!E18, 仕様の整理!AX18, \"-\"), \"-\"))","v":"-"},15,"10-1","耐久性無機溶液型シリカゾルグラウトシリーズ","KT-200081-A","事後評価未実施技術","○","令和7年8月",10,"砂質土","無",null,"○","○","○","○",null,{"$f":"LEFT(HLOOKUP($C18,DB!$1:$1048576,62,0),1)","v":"〇"},{"$f":"LEFT(HLOOKUP($C18,DB!$1:$1048576,63,0),1)","v":"△"},{"$f":"LEFT(HLOOKUP($C18,DB!$1:$1048576,64,0),1)","v":"△"},{"$f":"LEFT(HLOOKUP($C18,DB!$1:$1048576,65,0),1)","v":"△"},{"$f":"LEFT(HLOOKUP($C18,DB!$1:$1048576,66,0),1)","v":"△"},"×","○","×","○","○","×","×","×","×","×","×","○","○","○","○","○","○",{"$f":"HLOOKUP($C18,DB!$1:$1048576,9,0)","v":"-"},"A",2,{"$f":"VLOOKUP(AO18,条件!D:E,2,0)","v":1},"2020","0081",1,"1",{"$f":"VLOOKUP(LEFT(E18,2),条件!A:B,2,0)","v":"07"},212020008110107,11]
[{"$f":"IF(検索!$U$1=\"条件検索\", IF(W19=\"○\", COUNTIFS(W:W,\"○\",AX:AX,\"<\"&AX19)+1, \"-\"), IF(検索!$U$1=\"技術名検索\", IF(検索!$B$35=仕様の整理!E19, 仕様の整理!AX19, \"-\"), \"-\"))","v":"-"},16,"10-2","耐久性無機溶液型シリカゾルグラウトシリーズ","KT-200081-A","事後評価未実施技術","○","令和7年8月",20,"砂質土","無",null,"○","○","○","○",null,{"$f":"LEFT(HLOOKUP($C19,DB!$1:$1048576,62,0),1)","v":"〇"},{"$f":"LEFT(HLOOKUP($C19,DB!$1:$1048576,63,0),1)","v":"△"},{"$f":"LEFT(HLOOKUP($C19,DB!$1:$1048576,64,0),1)","v":"△"},{"$f":"LEFT(HLOOKUP($C19,DB!$1:$1048576,65,0),1)","v":"△"},{"$f":"LEFT(HLOOKUP($C19,DB!$1:$1048576,66,0),1)","v":"△"},"×","×","×","○","○","×","×","×","×","×","×","○","○","○","○","○","○",{"$f":"HLOOKUP($C19,DB!$1:$1048576,9,0)","v":"-"},"A",2,{"$f":"VLOOKUP(AO19,条件!D:E,2,0)","v":1},"2020","0081",1,"2",{"$f":"VLOOKUP(LEFT(E19,2),条件!A:B,2,0)","v":"07"},212020008110207,12]
[{"$f":"IF(検索!$U$1=\"条件検索\", IF(W20=\"○\", COUNTIFS(W:W,\"○\",AX:AX,\"<\"&AX20)+1, \"-\"), IF(検索!$U$1=\"技術名検索\", IF(検索!$B$35=仕様の整理!E20, 仕様の整理!AX20, \"-\"), \"-\"))","v":"-"},17,"11-1","懸濁型超微粒子複合シリカグラウト「ハイブリッドシリカ・シリーズ」","KT-220015-A","事後評価未実施技術","○","令和7年8月",10,"砂質土","無",null,"○","○","○","○",null,{"$f":"LEFT(HLOOKUP($C20,DB!$1:$1048576,62,0),1)","v":"-"},{"$f":"LEFT(HLOOKUP($C20,DB!$1:$1048576,63,0),1)","v":"△"},{"$f":"LEFT(HLOOKUP($C20,DB!$1:$1048576,64,0),1)","v":"△"},{"$f":"LEFT(HLOOKUP($C20,DB!$1:$1048576,65,0),1)","v":"△"},{"$f":"LEFT(HLOOKUP($C20,DB!$1:$1048576,66,0),1)","v":"△"},"×","○","×","○","○","×",{"$f":"IF(AND(AC$3=\"○\",M20=\"○\"),\"○\",\"×\")","v":"×"},{"$f":"IF(AND(AD$3=\"○\",N20=\"○\"),\"○\",\"×\")","v":"×"},{"$f":"IF(AND(AE$3=\"○\",O20=\"○\"),\"○\",\"×\")","v":"×"},{"$f":"IF(AND(AF$3=\"○\",P20=\"○\"),\"○\",\"×\")","v":"×"},{"$f":"IF(AND(AG$3=\"○\",Q20=\"○\"),\"○\",\"×\")","v":"×"},"○","○","○","○","○","○",{"$f":"HLOOKUP($C20,DB!$1:$1048576,9,0)","v":"-"},"A",2,{"$f":"VLOOKUP(AO20,条件!D:E,2,0)","v":1},"2022","0015",1,"1",{"$f":"VLOOKUP(LEFT(E20,2),条件!A:B,2,0)","v":"07"},212022001510107,13]
[{"$f":"IF(検索!$U$1=\"条件検索\", IF(W21=\"○\", COUNTIFS(W:W,\"○\",AX:AX,\"<\"&AX21)+1, \"-\"), IF(検索!$U$1=\"技術名検索\", IF(検索!$B$35=仕様の整理!E21, 仕様の整理!AX21, \"-\"), \"-\"))","v":"-"},18,"11-2","懸濁型超微粒子複合シリカグラウト「ハイブリッドシリカ・シリーズ」","KT-220015-A","事後評価未実施技術","○","令和7年8月",20,"砂質土","無",null,"○","○","○","○",null,{"$f":"LEFT(HLOOKUP($C21,DB!$1:$1048576,62,0),1)","v":"-"},{"$f":"LEFT(HLOOKUP($C21,DB!$1:$1048576,63,0),1)","v":"△"},{"$f":"LEFT(HLOOKUP($C21,DB!$1:$1048576,64,0),1)","v":"△"},{"$f":"LEFT(HLOOKUP($C21,DB!$1:$1048576,65,0),1)","v":"△"},{"$f":"LEFT(HLOOKUP($C21,DB!$1:$1048576,66,0),1)","v":"△"},"×","×","×","○","○","×","×","×","×","×","×","○","○","○","○","○","○",{"$f":"HLOOKUP($C21,DB!$1:$1048576,9,0)","v":"-"},"A",2,{"$f":"VLOOKUP(AO21,条件!D:E,2,0)","v":1},"2022","0015",1,"2",{"$f":"VLOOKUP(LEFT(E21,2),条件!A:B,2,0)","v":"07"},212022001510207,14]
[{"$f":"IF(検索!$U$1=\"条件検索\", IF(W22=\"○\", COUNTIFS(W:W,\"○\",AX:AX,\"<\"&AX22)+1, \"-\"), IF(検索!$U$1=\"技術名検索\", IF(検索!$B$35=仕様の整理!E22, 仕様の整理!AX22, \"-\"), \"-\"))","v":"-"},19,"12-1","二重管ストレーナ工法用比例注入装置「プロポーション注入工法」","QS-240013-A","事後評価未実施技術","○","令和7年12月",10,"砂質土","無",null,"○","○","○","○",null,{"$f":"LEFT(HLOOKUP($C22,DB!$1:$1048576,62,0),1)","v":"△"},{"$f":"LEFT(HLOOKUP($C22,DB!$1:$1048576,63,0),1)","v":"△"},{"$f":"LEFT(HLOOKUP($C22,DB!$1:$1048576,64,0),1)","v":"△"},{"$f":"LEFT(HLOOKUP($C22,DB!$1:$1048576,65,0),1)","v":"△"},{"$f":"LEFT(HLOOKUP($C22,DB!$1:$1048576,66,0),1)","v":"○"},"×","○","×","○","○","×","×","×","×","×","×","○","○","○","○","○","○",{"$f":"HLOOKUP($C22,DB!$1:$1048576,9,0)","v":"九州に共同開発者有り：△"},"A",2,{"$f":"VLOOKUP(AO22,条件!D:E,2,0)","v":1},"2024","0013",1,"1",{"$f":"VLOOKUP(LEFT(E22,2),条件!A:B,2,0)","v":"01"},212024001310101,15]
[{"$f":"IF(検索!$U$1=\"条件検索\", IF(W23=\"○\", COUNTIFS(W:W,\"○\",AX:AX,\"<\"&AX23)+1, \"-\"), IF(検索!$U$1=\"技術名検索\", IF(検索!$B$35=仕様の整理!E23, 仕様の整理!AX23, \"-\"), \"-\"))","v":"-"},20,"12-2","二重管ストレーナ工法用比例注入装置「プロポーション注入工法」","QS-240013-A","事後評価未実施技術","○","令和7年12月",20,"砂質土","無",null,"○","○","○","○",null,{"$f":"LEFT(HLOOKUP($C23,DB!$1:$1048576,62,0),1)","v":"△"},{"$f":"LEFT(HLOOKUP($C23,DB!$1:$1048576,63,0),1)","v":"△"},{"$f":"LEFT(HLOOKUP($C23,DB!$1:$1048576,64,0),1)","v":"△"},{"$f":"LEFT(HLOOKUP($C23,DB!$1:$1048576,65,0),1)","v":"△"},{"$f":"LEFT(HLOOKUP($C23,DB!$1:$1048576,66,0),1)","v":"○"},"×","×","×","○","○","×","×","×","×","×","×","○","○","○","○","○","○",{"$f":"HLOOKUP($C23,DB!$1:$1048576,9,0)","v":"九州に共同開発者有り：△"},"A",2,{"$f":"VLOOKUP(AO23,条件!D:E,2,0)","v":1},"2024","0013",1,"2",{"$f":"VLOOKUP(LEFT(E23,2),条件!A:B,2,0)","v":"01"},212024001310201,16]

{"sheet":"条件","index":6,"n_rows":20,"n_cols":9,"rows_kept":20,"cut":false,"hidden":false,"merged":[]}
[null,null,null,null,null,"検索用",null,null,"※技術名に仕様が追記されているので、調整すること"]
["QS","01",null,"VR",1,null,"KT-990230-VG","浸透固化処理工法",{"$f":"IF(LEN(G2)-LEN(SUBSTITUTE(G2,\"-\",\"\"))>=2,LEFT(G2,FIND(\"-\",G2,FIND(\"-\",G2)+1)-1),G2)","v":"KT-990230"}]
["QSK","01",null,"VE",1,null,"KT-060120-VG","曲がり削孔工法",{"$f":"IF(LEN(G3)-LEN(SUBSTITUTE(G3,\"-\",\"\"))>=2,LEFT(G3,FIND(\"-\",G3,FIND(\"-\",G3)+1)-1),G3)","v":"KT-060120"}]
["SK","02",null,"AE",1,null,"CB-180008-A","超音波振動注入工法","CB-180008"]
["SKK","02",null,"A",1,null,"CB-180028-A","ハイグリップグラウト工法","CB-180028"]
["CG","03",null,"VG",2,null,"KT-190012-A","Newスリーブ注入工法","KT-190012"]
["CGK","03",null,null,null,null,"KT-190051-A","パーマロックASFシリーズ","KT-190051"]
["KK","04",null,null,null,null,"KT-200081-A","耐久性無機溶液型シリカゾルグラウトシリーズ","KT-200081"]
["KKK","04",null,null,null,null,"KT-220015-A","懸濁型超微粒子複合シリカグラウト「ハイブリッドシリカ・シリーズ」","KT-220015"]
["CB","05",null,null,null,null,"QS-240013-A","二重管ストレーナ工法用比例注入装置「プロポーション注入工法」","QS-240013"]
["CBK","05"]
["HR","06"]
["HRK","06"]
["KT","07"]
["KTK","07"]
["TH","08"]
["THK","08"]
["HK","09"]
["HKK","09"]
["TS",10]

{"sheet":"同意書","index":7,"n_rows":22,"n_cols":3,"rows_kept":22,"cut":false,"hidden":false,"merged":[[3,2,3,18],[4,2,4,18],[5,2,5,18]]}
[]
[null,"工法比較表データベース借用同意書"]
[]
[null,"業務名・工事名"]
[null,"会社名"]
[null,"氏名"]
[]
[]
[]
[null,"借用者は、工法比較法データベース（以下「DB」と称する）を九州技術事務所から借用する場合に際し、以下の事項を遵守することを同意いたします。 "]
[null,"（使用目的）","1).借用者は、DBを借用申請書に記載された業務・工事にのみ使用します。なお、DBのリバースエンジニアリング、配布及び公衆送信等はいかなる目的においても行いません。"]
[null,"（使用範囲)","2).DBの使用は、九州地方整備局管内の業務・工事における関係者に限定します。"]
[null,"（データの複製）","3).借用者は、九州技術事務所から借用したデータの複製は行いません。"]
[null,"（権利関係）","4).DB及びDBを利用したものに係わる権利は、いずれも借用者に帰属しないことを確認します。"]
[null,"（守秘義務）","5).借用者は、DBによって知り得た情報を他に漏らしません。"]
[null,"（免責事項）","6).借用者は、DBの使用によって損害及び紛争等が生じても、九州技術事務所が一切責任を負わないことに同意します。 "]
[null,"（同意内容の変更）","7).借用者は、この同意書の内容に変更が生じた場合、その変更が生じた日から２週間以内に九州技術事務所（qsr-kyugi-netis@ki.mlit.go.jp）へ報告します。"]
[null,"（利用実態調査の記入）","8).借用者は、利用実態調査を正確かつ誠実に記入し、利用期限内に提出することを同意します。"]
[null,"（協議事項）","9).借用者は、本同意書に定めのない事項及び本同意書に関して疑義が生じた事項に関しては、九州技術事務所（qsr-kyugi-netis@ki.mlit.go.jp）と協議します。  "]
[]
[]
[null,"同意"]