{"text_format":"1","workbook":"xlsx","n_sheets":8,"sheets":["検索","更新履歴","詳細版","簡易版","DB","仕様の整理","条件","同意書"],"not_rendered":{"charts":0,"images":53,"macros":1,"external_links":0,"defined_names":14,"comments":0,"pivot_tables":0},"unopened":[],"bounds":{"document_bytes":16777216,"sheet_cells":100000,"rows_first":2000,"rows_last":500,"rows_between":2000,"halvings":0,"cell_chars":16384,"cell_head_chars":4096},"cells_cut":0,"cells_raw":0,"read":"whole","date_system":"1900"}

{"sheet":"検索","index":0,"n_rows":28,"n_cols":21,"rows_kept":28,"cut":false,"hidden":false,"merged":[[29,1,29,3],[29,6,29,12],[3,13,3,14]]}
[null,null,null,null,null,null,null,null,null,null,null,null,"ver.",6.85,null,"借用同意書：",null,"問い合わせ先："," kouhouhikakuhyou-db@kyugikyo.or.jp",null,"条件検索"]
[null,null,null,null,null,null,null,null,null,null,null,null,null,null,null,"ご利用期間：","2026-02-10","～",{"$f":"IF(Q2=\"\",\"\",EOMONTH(Q2, 0))","v":"2026-02-28"}]
[null,null,null,null,null,null,null,null,null,null,null,null,null,null,null,{"$f":"仕様の整理!F1","v":"50技術53仕様"},null,{"$f":"\"検索結果：全\"&$P$3&\"仕様の内、\"&$Q$3&\"が検索されました。\"","v":"検索結果：全50技術53仕様仕様の内、が検索されました。"},{"$f":"\"劣化機構：\"&_xlfn.TEXTJOIN(\",\",,S5,S6,S7,S8)&\"／\"&P9&_xlfn.TEXTJOIN(\",\",,Q9&S9,Q10&S10,Q11&S11)","v":"劣化機構：／施工条件：素地_特に指定しない,本塗り_特に指定しない,後養生_特に指定しない"}]
["本システムは、毎月NETIS情報を確認し、追加があれば更新していきますので、最新版を入手してお使いください。",null,null,null,null,null,null,null,null,null,null,null,null,"令和8年1月現在",null,null,null,null,{"$f":"\"工法比較表検索結果[\"&$P$3&\"の内、\"&$Q$3&\"]\"","v":"工法比較表検索結果[50技術53仕様の内、]"}]
[null,null,null,null,null,null,null,null,null,null,null,null,null,null,null,null,"劣化機構：",false,{"$f":"IF(R5=TRUE,\"中性化\",\"\")","v":""}]
[null,null,null,null,null,null,null,null,null,null,null,null,null,null,null,null,null,false,{"$f":"IF(R6=TRUE,\"塩害\",\"\")","v":""}]
[null,null,null,null,null,null,null,null,null,null,null,null,null,null,null,null,null,false,{"$f":"IF(R7=TRUE,\"ASR(アルカリシリカ反応)\",\"\")","v":""}]
[null,null,null,null,null,null,null,null,null,null,null,null,null,null,null,null,null,false,{"$f":"IF(R8=TRUE,\"その他（凍害、化学的浸食他）\",\"\")","v":""}]
[null,null,null,null,null,null,null,null,null,null,null,null,null,null,null,"施工条件：","素地_",1,{"$f":"IF(R9=1,\"特に指定しない\",IF(R9=2,\"乾燥状態\",IF(R9=3,\"湿潤状態\",\"\")))","v":"特に指定しない"}]
[null,null,null,null,null,null,null,null,null,null,null,null,null,null,null,null,"本塗り_",1,{"$f":"IF(R10=1,\"特に指定しない\",IF(R10=2,\"乾燥させることが可能\",IF(R10=3,\"乾燥させることが不可能\",\"\")))","v":"特に指定しない"}]
[null,null,null,null,null,null,null,null,null,null,null,null,null,null,null,null,"後養生_",1,{"$f":"IF(R11=1,\"特に指定しない\",IF(R11=2,\"乾燥させることが可能\",IF(R11=3,\"乾燥させることが不可能\",\"\")))","v":"特に指定しない"}]
[]
[]
[]
[]
[]
[]
[]
[]
[]
[]
[]
[]
[]
[]
[]
[]
["新技術の検索"]

{"sheet":"更新履歴","index":1,"n_rows":302,"n_cols":2,"rows_kept":302,"cut":false,"hidden":false,"merged":[]}
[null,"■更新履歴"]
[null,"2015/12/2\n＜Ver1.00からVer2.00への変更点について＞"]
[null,"・平成27年度11月20日にNETISから削除された1技術を削除しました。"]
[]
[null,"2016/2/12\n＜Ver2.00からVer3.00への変更点について＞"]
[null,"・平成27年にNETIS登録された5技術を追加し、「平成27年4月現在」を「平成27年11月現在」に変更しました。"]
[]
[null,"2017/6/20\n＜Ver3.00からVer4.00への変更点について＞"]
[null,"・平成27年にNETIS登録された6技術を追加し、「平成27年11月現在」を「平成28年10月現在」に変更しました。\n"]
[null,"・各技術の工法比較表作成日及び、新技術の単価の年月及び地域を記載しました。"]
[null,"・NETIS掲載期間終了技術（有用な新技術、活用の多い技術）を工法比較表検索結果の後尾にNETIS登録番号を削除し、グレーの背景で掲載しました。"]
[]
[null,"2018/3/15\n＜Ver4.00からVer5.00への変更点について＞"]
[null,"・平成28年にNETIS登録技術された5技術を追加し、「平成28年10月現在」を「平成29年10月現在」に変更しました。\n"]
[null,"・NETIS掲載期間終了技術（有用な新技術、活用の多い技術以外）を1技術削除しました。"]
[]
[null,"2018/4/27\n＜Ver5.04＞"]
[null,"・ＮＥＴＩＳ登録状況を確認し1技術を新規登録しました（NETIS申請情報のみ）。"]
[null,"・NETIS掲載期間終了技術（有用な新技術、活用の多い技術）2技術の掲載様式を変更しました。"]
[]
[null,"2018/5/29\n＜Ver5.05＞"]
[null,"・ＮＥＴＩＳ登録状況を確認し2技術を新規登録しました（NETIS申請情報のみ）。"]
[]
[null,"2018/6/28\n＜Ver5.06＞"]
[null,"・新規登録は無し。"]
[]
[null,"2018/7/31\n＜Ver5.07＞"]
[null,"・ＮＥＴＩＳ登録状況を確認し1技術を新規登録しました（NETIS申請情報のみ）。"]
[]
[null,"2018/8/31\n＜Ver5.08＞"]
[null,"・ＮＥＴＩＳ登録状況を確認し1技術を削除して1技術を新規登録しました（NETIS申請情報のみ）。"]
[null,"・ＮＥＴＩＳ掲載中止となっている1技術を非表示としました。"]
[]
[null,"2018/9/28\n＜Ver5.09＞"]
[null,"・新規登録は無し。"]
[]
[null,"2018/10/31\n＜Ver5.10＞"]
[null,"・新規登録は無し。"]
[]
[null,"2018/11/30\n＜Ver5.11＞"]
[null,"・新規登録は無し。"]
[]
[null,"2018/12/25\n＜Ver5.12＞"]
[null,"・ＮＥＴＩＳ登録状況を確認し1技術を新規登録しました（NETIS申請情報のみ）。"]
[]
[null,"2019/1/31\n＜Ver5.13＞"]
[null,"・NETIS掲載期間終了技術（有用な新技術、活用の多い技術以外）を3技術削除しました。"]
[null,"・NETIS登録状況を確認し1技術を新規登録しました（NETIS申請情報のみ）。"]
[]
[null,"2019/2/28\n＜Ver5.14＞"]
[null,"・NETIS登録状況を確認し1技術を新規登録しました（NETIS申請情報のみ）。"]
[]
[null,"2019/03/29\n＜Ver5.15＞"]
[null,"・新規登録は無し。"]
[]
[null,"2019/4/26\n＜Ver6.04＞"]
[null,"・NETIS掲載期間終了技術（有用な新技術、活用の多い技術）2技術の掲載様式を変更しました。"]
[]
[null,"2019/5/31\n＜Ver6.05＞"]
[null,"・NETIS登録状況を確認し1技術を新規登録しました（NETIS申請情報のみ）。"]
[]
[null,"2019/6/28\n＜Ver6.06＞"]
[null,"・新規登録は無し。"]
[]
[null,"2019/7/31\n＜Ver6.07＞"]
[null,"・NETIS登録状況を確認し1技術を新規登録しました（NETIS申請情報のみ）。"]
[]
[null,"2019/8/30\n＜Ver6.08＞"]
[null,"・新規登録は無し。"]
[]
[null,"2019/9/30\n＜Ver6.09＞"]
[null,"・新規登録は無し。"]
[]
[null,"2019/10/31\n＜Ver6.10＞"]
[null,"・新規登録は無し。"]
[]
[null,"2019/11/29\n＜Ver6.11＞"]
[null,"・新規登録は無し。"]
[]
[null,"2019/12/31\n＜Ver6.12＞"]
[null,"・ＮＥＴＩＳ登録状況を確認し1技術を新規登録しました（NETIS申請情報のみ）。"]
[]
[null,"2020/01/31\n＜Ver6.13＞"]
[null,"・新規登録は無し。"]
[]
[null,"2020/02/28\n＜Ver6.14＞"]
[null,"・新規登録は無し。"]
[]
[null,"2020/03/31\n＜Ver6.15＞"]
[null,"・NETIS登録状況を確認し1技術を新規登録しました（NETIS申請情報のみ）。"]
[]
[null,"2020/04/30\n＜Ver6.16＞"]
[null,"・新規登録は無し。"]
[]
[null,"2020/05/29\n＜Ver6.17＞"]
[null,"・新規登録は無し。"]
[]
[null,"2020/06/30\n＜Ver6.18＞"]
[null,"・新規登録は無し。"]
[]
[null,"2020/07/31\n＜Ver6.19＞"]
[null,"・ＮＥＴＩＳ登録状況を確認し2技術を新規登録しました（NETIS申請情報のみ）。"]
[]
[null,"2020/08/31\n＜Ver6.20＞"]
[null,"・NETIS登録状況を確認し1技術を新規登録しました（NETIS申請情報のみ）。"]
[]
[null,"2020/09/30\n＜Ver6.21＞"]
[null,"・NETIS登録状況を確認し1技術を新規登録しました（NETIS申請情報のみ）。"]
[]
[null,"2020/10/31\n＜Ver6.22＞"]
[null,"・新規登録は無し。"]
[]
[null,"2020/11/30\n＜Ver6.23＞"]
[null,"・新規登録は無し。"]
[]
[null,"2020/12/31\n＜Ver6.24＞"]
[null,"・新規登録は無し。"]
[]
[null,"2021/1/31\n＜Ver6.25＞"]
[null,"・新規登録は無し。"]
[]
[null,"2021/2/26\n＜Ver6.26＞"]
[null,"・新規登録は無し。"]
[]
[null,"2021/3/31\n＜Ver6.27＞"]
[null,"・新規登録は無し。"]
[]
[null,"2021/4/30\n＜Ver6.28＞"]
[null,"・NETIS登録状況を確認し1技術を新規登録しました（NETIS申請情報のみ）。"]
[]
[null,"2021/5/31\n＜Ver6.29＞"]
[null,"・新規登録は無し。"]
[]
[null,"2021/6/30\n＜Ver6.30＞"]
[null,"・新規登録は無し。"]
[]
[null,"2021/7/31\n＜Ver6.31＞"]
[null,"・新規登録は無し。"]
[]
[null,"2021/8/31\n＜Ver6.32＞"]
[null,"・新規登録は無し。"]
[]
[null,"2021/9/30\n＜Ver6.33＞"]
[null,"・新規登録は無し。"]
[]
[null,"2021/10/31\n＜Ver6.34＞"]
[null,"・新規登録は無し。"]
[]
[null,"2021/11/30\n＜Ver6.35＞"]
[null,"・新規登録は無し。"]
[]
[null,"2021/12/31\n＜Ver6.36＞"]
[null,"・新規登録は無し。"]
[]
[null,"2022/1/31\n＜Ver6.37＞"]
[null,"・新規登録は無し。"]
[]
[null,"2022/2/28\n＜Ver6.38＞"]
[null,"・新規登録は無し。"]
[]
[null,"2022/3/31\n＜Ver6.39＞"]
[null,"・新規登録は無し。"]
[]
[null,"2022/4/30\n＜Ver6.40＞"]
[null,"・新規登録は無し。"]
[]
[null,"2022/5/31\n＜Ver6.41＞"]
[null,"・NETIS登録状況を確認し1技術を新規登録しました（NETIS申請情報のみ）。"]
[]
[null,"2022/6/30\n＜Ver6.42＞"]
[null,"・新規登録は無し。"]
[]
[null,"2022/7/31\n＜Ver6.43＞"]
[null,"・新規登録は無し。"]
[]
[null,"2022/8/31\n＜Ver6.44＞"]
[null,"・新規登録は無し。"]
[]
[null,"2022/9/30\n＜Ver6.45＞"]
[null,"・新規登録は無し。"]
[]
[null,"2022/10/31\n＜Ver6.46＞"]
[null,"・新規登録は無し。"]
[]
[null,"2022/11/30\n＜Ver6.47＞"]
[null,"・新規登録は無し。"]
[]
[null,"2022/12/31\n＜Ver6.48＞"]
[null,"・新規登録は無し。"]
[]
[null,"2023/1/31\n＜Ver6.49＞"]
[null,"・新規登録は無し。"]
[]
[null,"2023/2/28\n＜Ver6.50＞"]
[null,"・新規登録は無し。"]
[]
[null,"2023/3/31\n＜Ver6.51＞"]
[null,"・NETIS登録状況を確認し1技術を新規登録しました（NETIS申請情報のみ）。"]
[]
[null,"2023/4/30\n＜Ver6.52＞"]
[null,"・NETIS登録状況を確認し1技術を新規登録しました（NETIS申請情報のみ）。"]
[]
[null,"2023/5/31\n＜Ver6.53＞"]
[null,"・新規登録は無し。"]
[]
[null,"2023/6/30\n＜Ver6.54＞"]
[null,"・NETIS登録状況を確認し1技術を新規登録しました（NETIS申請情報のみ）。"]
[]
[null,"2023/7/31\n＜Ver6.55＞"]
[null,"・新規登録は無し。"]
[]
[null,"2023/8/31\n＜Ver6.56＞"]
[null,"・新規登録は無し。"]
[]
[null,"2023/9/30\n＜Ver6.57＞"]
[null,"・新規登録は無し。"]
[]
[null,"2023/10/31\n＜Ver6.58＞"]
[null,"・NETIS登録状況を確認し1技術を新規登録しました（NETIS申請情報のみ）。"]
[]
[null,"2023/11/30\n＜Ver6.59＞"]
[null,"・NETIS登録状況を確認し1技術を新規登録しました（NETIS申請情報のみ）。"]
[]
[null,"2023/12/31\n＜Ver6.60＞"]
[null,"・NETIS登録状況を確認し1技術を新規登録しました（NETIS申請情報のみ）。"]
[]
[null,"2024/1/31\n＜Ver6.61＞"]
[null,"・新規登録は無し。"]
[]
[null,"2024/2/29\n＜Ver6.62＞"]
[null,"・NETIS登録状況を確認し1技術を新規登録しました（NETIS申請情報のみ）。"]
[]
[null,"2024/3/31\n＜Ver6.63＞"]
[null,"・新規登録は無し。"]
[]
[null,"2024/4/30\n＜Ver6.64＞"]
[null,"・新規登録は無し。"]
[]
[null,"2024/5/31\n＜Ver6.65＞"]
[null,"・新規登録は無し。"]
[]
[null,"2024/6/30\n＜Ver6.66＞"]
[null,"・新規登録は無し。"]
[]
[null,"2024/7/31\n＜Ver6.67＞"]
[null,"・新規登録は無し。"]
[]
[null,"2024/8/31\n＜Ver6.68＞"]
[null,"・新規登録は無し。"]
[]
[null,"2024/9/30\n＜Ver6.69＞"]
[null,"・新規登録は無し。"]
[]
[null,"2024/10/31\n＜Ver6.70＞"]
[null,"・新規登録は無し。"]
[]
[null,"2024/11/30\n＜Ver6.71＞"]
[null,"・新規登録は無し。"]
[null,"・施工費用および施工日数等を令和6年度の情報に更新"]
[]
[null,"2024/12/31\n＜Ver6.72＞"]
[null,"・新規登録は無し。"]
[]
[null,"2025/1/31\n＜Ver6.73＞"]
[null,"・新規登録は無し。"]
[]
[null,"2025/2/28\n＜Ver6.74＞"]
[null,"・新規登録は無し。"]
[]
[null,"2025/3/31\n＜Ver6.75＞"]
[null,"・新規登録は無し。"]
[]
[null,"2025/4/30\n＜Ver6.76＞"]
[null,"・新規登録は無し。"]
[]
[null,"2025/5/31\n＜Ver6.77＞"]
[null,"・新規登録は無し。"]
[]
[null,"2025/6/30\n＜Ver6.78＞"]
[null,"・新規登録は無し。"]
[]
[null,"2025/7/31\n＜Ver6.79＞"]
[null,"・新規登録は無し。"]
[]
[null,"2025/8/31\n＜Ver6.80＞"]
[null,"・新規登録は無し。"]
[]
[null,"2025/9/30\n＜Ver6.81＞"]
[null,"・新規登録は無し。"]
[]
[null,"2025/10/31\n＜Ver6.82＞"]
[null,"・新規登録は無し。"]
[]
[null,"2025/11/30\n＜Ver6.83＞"]
[null,"・新規登録は無し。"]
[null,"・施工費用および施工日数等を令和7年度の情報に更新"]
[]
[null,"2025/12/31\n＜Ver6.84＞"]
[null,"・新規登録は無し。"]
[]
[null,"2026/1/31＜Ver6.85＞"]
[null,"・新規登録は無し。"]

{"sheet":"詳細版","index":2,"n_rows":67,"n_cols":5,"rows_kept":67,"cut":false,"hidden":false,"merged":[[63,0,65,0],[63,2,63,4],[64,2,64,4],[65,2,65,4],[35,3,36,3],[37,2,37,4],[38,2,38,4],[39,2,39,4],[33,3,33,4],[34,1,36,1],[34,2,36,2],[34,3,34,4],[20,2,20,4],[21,0,28,0],[21,1,28,1],[55,2,55,4],[56,2,56,4],[57,1,59,1],[57,2,59,3],[60,1,61,1],[60,2,61,3],[48,2,48,3],[49,2,49,3],[50,2,50,3],[19,5,19,6],[20,5,20,6],[21,5,21,6],[10,5,10,6],[11,5,11,6],[12,5,12,6],[13,5,13,6],[14,5,14,6],[15,5,15,6],[5,2,5,4],[6,2,6,4],[7,2,7,4],[8,2,8,4],[9,2,9,4],[10,2,10,4],[11,2,11,4],[12,1,19,1],[4,5,4,6],[5,5,5,6],[6,5,6,6],[7,5,7,6],[8,5,8,6],[9,5,9,6],[62,2,62,4],[32,3,32,4],[21,2,21,3],[22,2,28,3],[29,0,29,4],[12,2,19,2],[12,3,12,4],[13,3,13,4],[14,3,14,4],[15,3,15,4],[16,3,16,4],[17,3,17,4],[18,3,18,4],[19,3,19,4],[4,0,20,0],[4,1,4,4],[54,5,54,6],[51,2,51,3],[52,2,52,3],[30,0,62,0],[30,1,30,4],[31,1,33,1],[31,2,33,2],[31,3,31,4],[54,2,54,4],[18,5,18,6],[6,7,6,8],[6,9,6,10],[6,11,6,12],[6,13,6,14],[6,15,6,16],[6,17,6,18],[6,19,6,20],[7,7,7,8],[3,0,3,4],[65,5,65,6],[59,5,59,6],[60,5,60,6],[61,5,61,6],[62,5,62,6],[63,5,63,6],[64,5,64,6],[55,5,55,6],[56,5,56,6],[57,5,57,6],[58,5,58,6],[28,5,28,6],[29,5,29,6],[44,5,44,6],[45,5,45,6],[22,5,22,6],[23,5,23,6],[24,5,24,6],[25,5,25,6],[26,5,26,6],[27,5,27,6],[16,5,16,6],[17,5,17,6],[4,43,4,44],[4,45,4,46],[4,47,4,48],[4,49,4,50],[4,51,4,52],[4,53,4,54],[4,55,4,56],[4,21,4,22],[4,23,4,24],[4,25,4,26],[4,27,4,28],[4,29,4,30],[4,31,4,32],[4,33,4,34],[4,35,4,36],[4,37,4,38],[11,7,11,8],[11,9,11,10],[4,7,4,8],[4,9,4,10],[4,11,4,12],[4,13,4,14],[4,15,4,16],[4,17,4,18],[4,19,4,20],[5,7,5,8],[5,9,5,10],[5,11,5,12],[5,13,5,14],[5,15,5,16],[5,17,5,18],[5,19,5,20],[5,33,5,34],[5,35,5,36],[5,37,5,38],[4,93,4,94],[4,95,4,96],[4,97,4,98],[4,99,4,100],[4,101,4,102],[4,103,4,104],[4,105,4,106],[4,107,4,108],[4,109,4,110],[4,75,4,76],[4,77,4,78],[4,79,4,80],[4,81,4,82],[4,83,4,84],[4,85,4,86],[4,87,4,88],[4,89,4,90],[4,91,4,92],[4,57,4,58],[4,59,4,60],[4,61,4,62],[4,63,4,64],[4,65,4,66],[4,67,4,68],[4,69,4,70],[4,71,4,72],[4,73,4,74],[4,39,4,40],[4,41,4,42],[5,109,5,110],[5,75,5,76],[5,77,5,78],[5,79,5,80],[5,81,5,82],[5,83,5,84],[5,85,5,86],[5,87,5,88],[5,89,5,90],[5,91,5,92],[5,57,5,58],[5,59,5,60],[5,61,5,62],[5,63,5,64],[5,65,5,66],[5,67,5,68],[5,69,5,70],[5,71,5,72],[5,73,5,74],[6,21,6,22],[6,23,6,24],[6,25,6,26],[6,27,6,28],[6,29,6,30],[6,31,6,32],[6,33,6,34],[6,35,6,36],[6,37,6,38],[5,93,5,94],[5,95,5,96],[5,97,5,98],[5,99,5,100],[5,101,5,102],[5,103,5,104],[5,105,5,106],[5,107,5,108],[5,39,5,40],[5,41,5,42],[5,43,5,44],[5,45,5,46],[5,47,5,48],[5,49,5,50],[5,51,5,52],[5,53,5,54],[5,55,5,56],[5,21,5,22],[5,23,5,24],[5,25,5,26],[5,27,5,28],[5,29,5,30],[5,31,5,32],[6,57,6,58],[6,59,6,60],[6,61,6,62],[6,63,6,64],[6,65,6,66],[6,67,6,68],[6,69,6,70],[6,71,6,72],[6,73,6,74],[6,39,6,40],[6,41,6,42],[6,43,6,44],[6,45,6,46],[6,47,6,48],[6,49,6,50],[6,51,6,52],[6,53,6,54],[6,55,6,56],[6,93,6,94],[6,95,6,96],[6,97,6,98],[6,99,6,100],[6,101,6,102],[6,103,6,104],[6,105,6,106],[6,107,6,108],[6,109,6,110],[6,75,6,76],[6,77,6,78],[6,79,6,80],[6,81,6,82],[6,83,6,84],[6,85,6,86],[6,87,6,88],[6,89,6,90],[6,91,6,92],[7,27,7,28],[7,29,7,30],[7,31,7,32],[7,33,7,34],[7,35,7,36],[7,37,7,38],[7,39,7,40],[7,41,7,42],[7,43,7,44],[7,9,7,10],[7,11,7,12],[7,13,7,14],[7,15,7,16],[7,17,7,18],[7,19,7,20],[7,21,7,22],[7,23,7,24],[7,25,7,26],[7,97,7,98],[7,63,7,64],[7,65,7,66],[7,67,7,68],[7,69,7,70],[7,71,7,72],[7,73,7,74],[7,75,7,76],[7,77,7,78],[7,79,7,80],[7,45,7,46],[7,47,7,48],[7,49,7,50],[7,51,7,52],[7,53,7,54],[7,55,7,56],[7,57,7,58],[7,59,7,60],[7,61,7,62],[7,99,7,100],[7,101,7,102],[7,103,7,104],[7,105,7,106],[7,107,7,108],[7,109,7,110],[8,7,8,8],[8,9,8,10],[8,11,8,12],[8,13,8,14],[8,15,8,16],[8,17,8,18],[8,19,8,20],[8,21,8,22],[8,23,8,24],[8,25,8,26],[8,27,8,28],[8,29,8,30],[8,31,8,32],[8,33,8,34],[8,35,8,36],[8,37,8,38],[8,39,8,40],[8,41,8,42],[7,81,7,82],[7,83,7,84],[7,85,7,86],[7,87,7,88],[7,89,7,90],[7,91,7,92],[7,93,7,94],[7,95,7,96],[8,95,8,96],[8,61,8,62],[8,63,8,64],[8,65,8,66],[8,67,8,68],[8,69,8,70],[8,71,8,72],[8,73,8,74],[8,75,8,76],[8,77,8,78],[8,43,8,44],[8,45,8,46],[8,47,8,48],[8,49,8,50],[8,51,8,52],[8,53,8,54],[8,55,8,56],[8,57,8,58],[8,59,8,60],[8,97,8,98],[8,99,8,100],[8,101,8,102],[8,103,8,104],[8,105,8,106],[8,107,8,108],[8,109,8,110],[9,7,9,8],[9,9,9,10],[9,11,9,12],[9,13,9,14],[9,15,9,16],[9,17,9,18],[9,19,9,20],[9,21,9,22],[9,23,9,24],[9,25,9,26],[9,27,9,28],[9,29,9,30],[9,31,9,32],[9,33,9,34],[9,35,9,36],[9,37,9,38],[9,39,9,40],[8,79,8,80],[8,81,8,82],[8,83,8,84],[8,85,8,86],[8,87,8,88],[8,89,8,90],[8,91,8,92],[8,93,8,94],[9,93,9,94],[9,59,9,60],[9,61,9,62],[9,63,9,64],[9,65,9,66],[9,67,9,68],[9,69,9,70],[9,71,9,72],[9,73,9,74],[9,75,9,76],[9,41,9,42],[9,43,9,44],[9,45,9,46],[9,47,9,48],[9,49,9,50],[9,51,9,52],[9,53,9,54],[9,55,9,56],[9,57,9,58],[9,95,9,96],[9,97,9,98],[9,99,9,100],[9,101,9,102],[9,103,9,104],[9,105,9,106],[9,107,9,108],[9,109,9,110],[10,7,10,8],[10,9,10,10],[10,11,10,12],[10,13,10,14],[10,15,10,16],[10,17,10,18],[10,19,10,20],[10,21,10,22],[10,23,10,24],[10,25,10,26],[10,27,10,28],[10,29,10,30],[10,31,10,32],[10,33,10,34],[10,35,10,36],[10,37,10,38],[9,77,9,78],[9,79,9,80],[9,81,9,82],[9,83,9,84],[9,85,9,86],[9,87,9,88],[9,89,9,90],[9,91,9,92],[10,57,10,58],[10,59,10,60],[10,61,10,62],[10,63,10,64],[10,65,10,66],[10,67,10,68],[10,69,10,70],[10,71,10,72],[10,73,10,74],[10,39,10,40],[10,41,10,42],[10,43,10,44],[10,45,10,46],[10,47,10,48],[10,49,10,50],[10,51,10,52],[10,53,10,54],[10,55,10,56],[10,93,10,94],[10,95,10,96],[10,97,10,98],[10,99,10,100],[10,101,10,102],[10,103,10,104],[10,105,10,106],[10,107,10,108],[10,109,10,110],[10,75,10,76],[10,77,10,78],[10,79,10,80],[10,81,10,82],[10,83,10,84],[10,85,10,86],[10,87,10,88],[10,89,10,90],[10,91,10,92],[11,29,11,30],[11,31,11,32],[11,33,11,34],[11,35,11,36],[11,37,11,38],[11,39,11,40],[11,41,11,42],[11,43,11,44],[11,45,11,46],[11,11,11,12],[11,13,11,14],[11,15,11,16],[11,17,11,18],[11,19,11,20],[11,21,11,22],[11,23,11,24],[11,25,11,26],[11,27,11,28],[11,99,11,100],[11,65,11,66],[11,67,11,68],[11,69,11,70],[11,71,11,72],[11,73,11,74],[11,75,11,76],[11,77,11,78],[11,79,11,80],[11,81,11,82],[11,47,11,48],[11,49,11,50],[11,51,11,52],[11,53,11,54],[11,55,11,56],[11,57,11,58],[11,59,11,60],[11,61,11,62],[11,63,11,64],[11,101,11,102],[11,103,11,104],[11,105,11,106],[11,107,11,108],[11,109,11,110],[12,7,12,8],[12,9,12,10],[12,11,12,12],[12,13,12,14],[12,15,12,16],[12,17,12,18],[12,19,12,20],[12,21,12,22],[12,23,12,24],[12,25,12,26],[12,27,12,28],[12,29,12,30],[12,31,12,32],[12,33,12,34],[12,35,12,36],[12,37,12,38],[12,39,12,40],[12,41,12,42],[12,43,12,44],[11,83,11,84],[11,85,11,86],[11,87,11,88],[11,89,11,90],[11,91,11,92],[11,93,11,94],[11,95,11,96],[11,97,11,98],[12,97,12,98],[12,63,12,64],[12,65,12,66],[12,67,12,68],[12,69,12,70],[12,71,12,72],[12,73,12,74],[12,75,12,76],[12,77,12,78],[12,79,12,80],[12,45,12,46],[12,47,12,48],[12,49,12,50],[12,51,12,52],[12,53,12,54],[12,55,12,56],[12,57,12,58],[12,59,12,60],[12,61,12,62],[12,99,12,100],[12,101,12,102],[12,103,12,104],[12,105,12,106],[12,107,12,108],[12,109,12,110],[13,7,13,8],[13,9,13,10],[13,11,13,12],[13,13,13,14],[13,15,13,16],[13,17,13,18],[13,19,13,20],[13,21,13,22],[13,23,13,24],[13,25,13,26],[13,27,13,28],[13,29,13,30],[13,31,13,32],[13,33,13,34],[13,35,13,36],[13,37,13,38],[13,39,13,40],[13,41,13,42],[12,81,12,82],[12,83,12,84],[12,85,12,86],[12,87,12,88],[12,89,12,90],[12,91,12,92],[12,93,12,94],[12,95,12,96],[13,95,13,96],[13,61,13,62],[13,63,13,64],[13,65,13,66],[13,67,13,68],[13,69,13,70],[13,71,13,72],[13,73,13,74],[13,75,13,76],[13,77,13,78],[13,43,13,44],[13,45,13,46],[13,47,13,48],[13,49,13,50],[13,51,13,52],[13,53,13,54],[13,55,13,56],[13,57,13,58],[13,59,13,60],[13,97,13,98],[13,99,13,100],[13,101,13,102],[13,103,13,104],[13,105,13,106],[13,107,13,108],[13,109,13,110],[14,7,14,8],[14,9,14,10],[14,11,14,12],[14,13,14,14],[14,15,14,16],[14,17,14,18],[14,19,14,20],[14,21,14,22],[14,23,14,24],[14,25,14,26],[14,27,14,28],[14,29,14,30],[14,31,14,32],[14,33,14,34],[14,35,14,36],[14,37,14,38],[14,39,14,40],[13,79,13,80],[13,81,13,82],[13,83,13,84],[13,85,13,86],[13,87,13,88],[13,89,13,90],[13,91,13,92],[13,93,13,94],[14,93,14,94],[14,59,14,60],[14,61,14,62],[14,63,14,64],[14,65,14,66],[14,67,14,68],[14,69,14,70],[14,71,14,72],[14,73,14,74],[14,75,14,76],[14,41,14,42],[14,43,14,44],[14,45,14,46],[14,47,14,48],[14,49,14,50],[14,51,14,52],[14,53,14,54],[14,55,14,56],[14,57,14,58],[14,95,14,96],[14,97,14,98],[14,99,14,100],[14,101,14,102],[14,103,14,104],[14,105,14,106],[14,107,14,108],[14,109,14,110],[15,7,15,8],[15,9,15,10],[15,11,15,12],[15,13,15,14],[15,15,15,16],[15,17,15,18],[15,19,15,20],[15,21,15,22],[15,23,15,24],[15,25,15,26],[15,27,15,28],[15,29,15,30],[15,31,15,32],[15,33,15,34],[15,35,15,36],[15,37,15,38],[14,77,14,78],[14,79,14,80],[14,81,14,82],[14,83,14,84],[14,85,14,86],[14,87,14,88],[14,89,14,90],[14,91,14,92],[15,57,15,58],[15,59,15,60],[15,61,15,62],[15,63,15,64],[15,65,15,66],[15,67,15,68],[15,69,15,70],[15,71,15,72],[15,73,15,74],[15,39,15,40],[15,41,15,42],[15,43,15,44],[15,45,15,46],[15,47,15,48],[15,49,15,50],[15,51,15,52],[15,53,15,54],[15,55,15,56],[15,93,15,94],[15,95,15,96],[15,97,15,98],[15,99,15,100],[15,101,15,102],[15,103,15,104],[15,105,15,106],[15,107,15,108],[15,109,15,110],[15,75,15,76],[15,77,15,78],[15,79,15,80],[15,81,15,82],[15,83,15,84],[15,85,15,86],[15,87,15,88],[15,89,15,90],[15,91,15,92],[16,25,16,26],[16,27,16,28],[16,29,16,30],[16,31,16,32],[16,33,16,34],[16,35,16,36],[16,37,16,38],[16,39,16,40],[16,41,16,42],[16,7,16,8],[16,9,16,10],[16,11,16,12],[16,13,16,14],[16,15,16,16],[16,17,16,18],[16,19,16,20],[16,21,16,22],[16,23,16,24],[16,95,16,96],[16,61,16,62],[16,63,16,64],[16,65,16,66],[16,67,16,68],[16,69,16,70],[16,71,16,72],[16,73,16,74],[16,75,16,76],[16,77,16,78],[16,43,16,44],[16,45,16,46],[16,47,16,48],[16,49,16,50],[16,51,16,52],[16,53,16,54],[16,55,16,56],[16,57,16,58],[16,59,16,60],[16,97,16,98],[16,99,16,100],[16,101,16,102],[16,103,16,104],[16,105,16,106],[16,107,16,108],[16,109,16,110],[17,7,17,8],[17,9,17,10],[17,11,17,12],[17,13,17,14],[17,15,17,16],[17,17,17,18],[17,19,17,20],[17,21,17,22],[17,23,17,24],[17,25,17,26],[17,27,17,28],[17,29,17,30],[17,31,17,32],[17,33,17,34],[17,35,17,36],[17,37,17,38],[17,39,17,40],[16,79,16,80],[16,81,16,82],[16,83,16,84],[16,85,16,86],[16,87,16,88],[16,89,16,90],[16,91,16,92],[16,93,16,94],[17,93,17,94],[17,59,17,60],[17,61,17,62],[17,63,17,64],[17,65,17,66],[17,67,17,68],[17,69,17,70],[17,71,17,72],[17,73,17,74],[17,75,17,76],[17,41,17,42],[17,43,17,44],[17,45,17,46],[17,47,17,48],[17,49,17,50],[17,51,17,52],[17,53,17,54],[17,55,17,56],[17,57,17,58],[17,95,17,96],[17,97,17,98],[17,99,17,100],[17,101,17,102],[17,103,17,104],[17,105,17,106],[17,107,17,108],[17,109,17,110],[18,7,18,8],[18,9,18,10],[18,11,18,12],[18,13,18,14],[18,15,18,16],[18,17,18,18],[18,19,18,20],[18,21,18,22],[18,23,18,24],[18,25,18,26],[18,27,18,28],[18,29,18,30],[18,31,18,32],[18,33,18,34],[18,35,18,36],[18,37,18,38],[17,77,17,78],[17,79,17,80],[17,81,17,82],[17,83,17,84],[17,85,17,86],[17,87,17,88],[17,89,17,90],[17,91,17,92],[18,57,18,58],[18,59,18,60],[18,61,18,62],[18,63,18,64],[18,65,18,66],[18,67,18,68],[18,69,18,70],[18,71,18,72],[18,73,18,74],[18,39,18,40],[18,41,18,42],[18,43,18,44],[18,45,18,46],[18,47,18,48],[18,49,18,50],[18,51,18,52],[18,53,18,54],[18,55,18,56],[18,93,18,94],[18,95,18,96],[18,97,18,98],[18,99,18,100],[18,101,18,102],[18,103,18,104],[18,105,18,106],[18,107,18,108],[18,109,18,110],[18,75,18,76],[18,77,18,78],[18,79,18,80],[18,81,18,82],[18,83,18,84],[18,85,18,86],[18,87,18,88],[18,89,18,90],[18,91,18,92],[19,25,19,26],[19,27,19,28],[19,29,19,30],[19,31,19,32],[19,33,19,34],[19,35,19,36],[19,37,19,38],[19,39,19,40],[19,41,19,42],[19,7,19,8],[19,9,19,10],[19,11,19,12],[19,13,19,14],[19,15,19,16],[19,17,19,18],[19,19,19,20],[19,21,19,22],[19,23,19,24],[19,95,19,96],[19,61,19,62],[19,63,19,64],[19,65,19,66],[19,67,19,68],[19,69,19,70],[19,71,19,72],[19,73,19,74],[19,75,19,76],[19,77,19,78],[19,43,19,44],[19,45,19,46],[19,47,19,48],[19,49,19,50],[19,51,19,52],[19,53,19,54],[19,55,19,56],[19,57,19,58],[19,59,19,60],[19,97,19,98],[19,99,19,100],[19,101,19,102],[19,103,19,104],[19,105,19,106],[19,107,19,108],[19,109,19,110],[20,7,20,8],[20,9,20,10],[20,11,20,12],[20,13,20,14],[20,15,20,16],[20,17,20,18],[20,19,20,20],[20,21,20,22],[20,23,20,24],[20,25,20,26],[20,27,20,28],[20,29,20,30],[20,31,20,32],[20,33,20,34],[20,35,20,36],[20,37,20,38],[20,39,20,40],[19,79,19,80],[19,81,19,82],[19,83,19,84],[19,85,19,86],[19,87,19,88],[19,89,19,90],[19,91,19,92],[19,93,19,94],[20,93,20,94],[20,59,20,60],[20,61,20,62],[20,63,20,64],[20,65,20,66],[20,67,20,68],[20,69,20,70],[20,71,20,72],[20,73,20,74],[20,75,20,76],[20,41,20,42],[20,43,20,44],[20,45,20,46],[20,47,20,48],[20,49,20,50],[20,51,20,52],[20,53,20,54],[20,55,20,56],[20,57,20,58],[20,95,20,96],[20,97,20,98],[20,99,20,100],[20,101,20,102],[20,103,20,104],[20,105,20,106],[20,107,20,108],[20,109,20,110],[21,7,21,8],[21,9,21,10],[21,11,21,12],[21,13,21,14],[21,15,21,16],[21,17,21,18],[21,19,21,20],[21,21,21,22],[21,23,21,24],[21,25,21,26],[21,27,21,28],[21,29,21,30],[21,31,21,32],[21,33,21,34],[21,35,21,36],[21,37,21,38],[20,77,20,78],[20,79,20,80],[20,81,20,82],[20,83,20,84],[20,85,20,86],[20,87,20,88],[20,89,20,90],[20,91,20,92],[21,57,21,58],[21,59,21,60],[21,61,21,62]],"merged_total":2396,"flags":["merged_cut"]}
[]
["コンクリート構造物補修工（表面含浸工法）"]
[{"$f":"検索!S4","v":"工法比較表検索結果[50技術53仕様の内、]"}]
[]
["ＮＥＴＩＳ情報","技術名"]
[null,"①","ＮＥＴＩＳ登録番号"]
[null,"②","技術の位置付け（有用な新技術）"]
[null,"③","開発者（本社が存在する都道府県）"]
[null,"④","開発者における九州地方との関連性（九州登録九州本社：◎、九州外登録九州本社：○、九州に共同開発者有り：△、その他：－）"]
[null,"⑤","九州地方への機能性（九州地方に支店等を有する場合：○、その他：－）"]
[null,"⑥","技術概要"]
[null,"⑦","概要図"]
[null,"⑧","施工条件・適用条件等","種類"]
[null,null,null,"主な適用範囲"]
[null,null,null,"下地乾湿状態"]
[null,null,null,"施工中の気温"]
[null,null,null,"施工後の気温（氷点下）"]
[null,null,null,"施工中の水分"]
[null,null,null,"施工後24時間以内の水分"]
[null,null,null,"養生"]
[null,"⑨","比較する従来技術"]
["評価情報 ","⑩","評価基準",null,"項目"]
[null,null,"・A：従来技術より極めて優れる\n・B：従来技術より優れる\n・C：従来技術と同等\n・D：従来技術より劣る",null,"経済性"]
[null,null,null,null,"工程"]
[null,null,null,null,"品質・出来形"]
[null,null,null,null,"安全性"]
[null,null,null,null,"施工性"]
[null,null,null,null,"環境"]
[null,null,null,null,"総合評価"]
["統一した従来技術"]
["補完調査情報"]
[null,"⑪","概算施工費用\n注1）","施工費等"]
[null,null,null,"表面含浸材材料費"]
[null,null,null,"合計"]
[null,"⑫","概算施工日数","合計（塗布完了後の養生時間は含まない）"]
[null,null,null,"内訳","下地処理"]
[null,null,null,null,"含浸材塗布"]
[null,"⑬","施工工程"]
[null,"⑭","塗布回数"]
[null,"⑮","塗布量"]
[null,"⑯","統一した従来技術との比較",null,"経済性"]
[null,null,null,null,"工程"]
[null,null,"判定の凡例 \n  ○：従来技術より優れる\n  △：従来技術と同程度\n  －：上記以外",null,"品質・出来形"]
[null,null,null,null,"安全性"]
[null,null,null,null,"施工性"]
[null,null,null,null,"環境"]
[null,"⑰","試験項目",null,"評価基準　注3）"]
[null,null,"含浸深さ（ｍｍ）",null,"-"]
[null,null,"中性化抑制率（％）",null,"A：30%以上、B：30～10%、C：10%以下"]
[null,null,"Cl-浸透抑制率（％）",null,"A：80%以上、B：80～60%、C：60%以下"]
[null,null,"透水抑制率（％）",null,"A：80%以上、B：80～60%、C：60%以下"]
[null,null,"吸水抑制率（％）",null,"A：80%以上、B：80～60%、C：60%以下"]
[null,null,"透湿比（％）",null,"A：80%以上、B：80～60%、C：60%以下"]
[null,null,"その他の試験"]
[null,"⑱","塗布方法"]
[null,"⑲","表面含浸材の色"]
[null,"⑳","耐用年数"]
[null,"㉑","施工実績\n（過去３年）",null,"国土交通省：活用効果調査表数"]
[null,null,null,null,"地方自治体：開発者ヒアリング"]
[null,null,null,null,"その他：開発者ヒアリング"]
[null,"㉒","特許等",null,"特許"]
[null,null,null,null,"建設技術審査証明"]
[null,"㉓","備考"]
["総括","㉔","コンクリートの耐久性向上の効果\n（材料の性能等）"]
[null,"㉕","施工性\n(留意事項含む）"]
[null,"㉖","その他（留意事項含む）"]
["注1）施工費用：2025年4月福岡県久留米市　　注2）土木学会、ｺﾝｸﾘｰﾄﾗｲﾌﾞﾗﾘｰ119 表面保護工法 設計施工指針（案） 工種別ﾏﾆｭｱﾙ編、2005、p.147、149、151　　注3）同上、p.165-167　　注4）／：補完調査未実施"]

{"sheet":"簡易版","index":3,"n_rows":6,"n_cols":25,"rows_kept":6,"cut":false,"hidden":false,"merged":[[4,18,4,23],[4,24,5,24],[4,3,5,3],[4,4,5,4],[4,5,5,5],[4,6,5,6],[4,7,5,7],[4,8,4,14],[4,17,5,17],[4,15,5,15],[4,16,5,16]]}
[null,null,null,"コンクリート構造物補修工（表面含浸工法）"]
[null,null,null,{"$f":"検索!S4","v":"工法比較表検索結果[50技術53仕様の内、]"}]
[]
[]
[null,null,null,"番号","技術名","NETIS番号","開発者","種類","試験項目",null,null,null,null,null,null,"対象面積当り\n概算施工費用","塗布回数","対象面積当り\n概算施工日数","統一した従来技術との比較",null,null,null,null,null,"概要"]
[null,null,null,null,null,null,null,null,"試験方法","含浸深さ（mm）","中性化抑制率（％）","Cl-浸透抑制率（％）","透水抑制率（％）","吸水抑制率（％）","透湿比（％）",null,null,null,"経済性","工程","品質・出来形","安全性","施工性","環境"]

{"sheet":"DB","index":4,"n_rows":90,"n_cols":111,"rows_kept":90,"cut":false,"hidden":false,"merged":[[47,2,47,3],[65,103,65,104],[65,105,65,106],[65,107,65,108],[65,109,65,110],[62,2,62,4],[63,2,63,4],[64,2,64,4],[65,2,65,4],[65,93,65,94],[65,95,65,96],[65,97,65,98],[65,99,65,100],[65,101,65,102],[65,83,65,84],[65,85,65,86],[65,87,65,88],[65,89,65,90],[65,91,65,92],[65,73,65,74],[65,75,65,76],[65,77,65,78],[65,79,65,80],[65,81,65,82],[65,63,65,64],[65,65,65,66],[65,67,65,68],[65,69,65,70],[65,71,65,72],[65,53,65,54],[65,55,65,56],[65,57,65,58],[65,59,65,60],[65,61,65,62],[65,43,65,44],[65,45,65,46],[65,47,65,48],[65,49,65,50],[65,51,65,52],[65,33,65,34],[65,35,65,36],[65,37,65,38],[65,39,65,40],[65,41,65,42],[64,105,64,106],[64,107,64,108],[64,109,64,110],[65,7,65,8],[65,9,65,10],[65,11,65,12],[65,13,65,14],[65,15,65,16],[65,17,65,18],[65,19,65,20],[65,21,65,22],[65,23,65,24],[65,25,65,26],[65,27,65,28],[65,29,65,30],[65,31,65,32],[64,95,64,96],[64,97,64,98],[64,99,64,100],[64,101,64,102],[64,103,64,104],[64,85,64,86],[64,87,64,88],[64,89,64,90],[64,91,64,92],[64,93,64,94],[64,75,64,76],[64,77,64,78],[64,79,64,80],[64,81,64,82],[64,83,64,84],[64,65,64,66],[64,67,64,68],[64,69,64,70],[64,71,64,72],[64,73,64,74],[64,55,64,56],[64,57,64,58],[64,59,64,60],[64,61,64,62],[64,63,64,64],[64,45,64,46],[64,47,64,48],[64,49,64,50],[64,51,64,52],[64,53,64,54],[64,35,64,36],[64,37,64,38],[64,39,64,40],[64,41,64,42],[64,43,64,44],[63,107,63,108],[63,109,63,110],[64,7,64,8],[64,9,64,10],[64,11,64,12],[64,13,64,14],[64,15,64,16],[64,17,64,18],[64,19,64,20],[64,21,64,22],[64,23,64,24],[64,25,64,26],[64,27,64,28],[64,29,64,30],[64,31,64,32],[64,33,64,34],[63,97,63,98],[63,99,63,100],[63,101,63,102],[63,103,63,104],[63,105,63,106],[63,87,63,88],[63,89,63,90],[63,91,63,92],[63,93,63,94],[63,95,63,96],[63,77,63,78],[63,79,63,80],[63,81,63,82],[63,83,63,84],[63,85,63,86],[63,67,63,68],[63,69,63,70],[63,71,63,72],[63,73,63,74],[63,75,63,76],[63,57,63,58],[63,59,63,60],[63,61,63,62],[63,63,63,64],[63,65,63,66],[63,47,63,48],[63,49,63,50],[63,51,63,52],[63,53,63,54],[63,55,63,56],[63,37,63,38],[63,39,63,40],[63,41,63,42],[63,43,63,44],[63,45,63,46],[63,27,63,28],[63,29,63,30],[63,31,63,32],[63,33,63,34],[63,35,63,36],[63,17,63,18],[63,19,63,20],[63,21,63,22],[63,23,63,24],[63,25,63,26],[63,7,63,8],[63,9,63,10],[63,11,63,12],[63,13,63,14],[63,15,63,16],[62,101,62,102],[62,103,62,104],[62,105,62,106],[62,107,62,108],[62,109,62,110],[62,91,62,92],[62,93,62,94],[62,95,62,96],[62,97,62,98],[62,99,62,100],[62,81,62,82],[62,83,62,84],[62,85,62,86],[62,87,62,88],[62,89,62,90],[62,71,62,72],[62,73,62,74],[62,75,62,76],[62,77,62,78],[62,79,62,80],[62,61,62,62],[62,63,62,64],[62,65,62,66],[62,67,62,68],[62,69,62,70],[62,51,62,52],[62,53,62,54],[62,55,62,56],[62,57,62,58],[62,59,62,60],[62,41,62,42],[62,43,62,44],[62,45,62,46],[62,47,62,48],[62,49,62,50],[62,31,62,32],[62,33,62,34],[62,35,62,36],[62,37,62,38],[62,39,62,40],[61,103,61,104],[61,105,61,106],[61,107,61,108],[61,109,61,110],[61,53,61,54],[61,55,61,56],[61,57,61,58],[61,59,61,60],[61,61,61,62],[61,43,61,44],[61,45,61,46],[61,47,61,48],[61,49,61,50],[61,51,61,52],[61,33,61,34],[61,35,61,36],[61,37,61,38],[61,39,61,40],[61,41,61,42],[62,7,62,8],[62,9,62,10],[62,11,62,12],[62,13,62,14],[62,15,62,16],[62,17,62,18],[62,19,62,20],[62,21,62,22],[62,23,62,24],[62,25,62,26],[62,27,62,28],[62,29,62,30],[61,93,61,94],[61,95,61,96],[61,97,61,98],[61,99,61,100],[61,101,61,102],[61,83,61,84],[61,85,61,86],[61,87,61,88],[61,89,61,90],[61,91,61,92],[61,73,61,74],[61,75,61,76],[61,77,61,78],[61,79,61,80],[61,81,61,82],[61,63,61,64],[61,65,61,66],[61,67,61,68],[61,69,61,70],[61,71,61,72],[60,105,60,106],[60,107,60,108],[60,109,60,110],[61,7,61,8],[61,9,61,10],[61,11,61,12],[61,13,61,14],[61,15,61,16],[61,17,61,18],[61,19,61,20],[61,21,61,22],[61,23,61,24],[61,25,61,26],[61,27,61,28],[61,29,61,30],[61,31,61,32],[60,95,60,96],[60,97,60,98],[60,99,60,100],[60,101,60,102],[60,103,60,104],[60,85,60,86],[60,87,60,88],[60,89,60,90],[60,91,60,92],[60,93,60,94],[60,75,60,76],[60,77,60,78],[60,79,60,80],[60,81,60,82],[60,83,60,84],[60,65,60,66],[60,67,60,68],[60,69,60,70],[60,71,60,72],[60,73,60,74],[60,55,60,56],[60,57,60,58],[60,59,60,60],[60,61,60,62],[60,63,60,64],[60,45,60,46],[60,47,60,48],[60,49,60,50],[60,51,60,52],[60,53,60,54],[60,35,60,36],[60,37,60,38],[60,39,60,40],[60,41,60,42],[60,43,60,44],[59,107,59,108],[59,109,59,110],[60,7,60,8],[60,9,60,10],[60,11,60,12],[60,13,60,14],[60,15,60,16],[60,17,60,18],[60,19,60,20],[60,21,60,22],[60,23,60,24],[60,25,60,26],[60,27,60,28],[60,29,60,30],[60,31,60,32],[60,33,60,34],[59,97,59,98],[59,99,59,100],[59,101,59,102],[59,103,59,104],[59,105,59,106],[59,87,59,88],[59,89,59,90],[59,91,59,92],[59,93,59,94],[59,95,59,96],[59,77,59,78],[59,79,59,80],[59,81,59,82],[59,83,59,84],[59,85,59,86],[59,67,59,68],[59,69,59,70],[59,71,59,72],[59,73,59,74],[59,75,59,76],[59,57,59,58],[59,59,59,60],[59,61,59,62],[59,63,59,64],[59,65,59,66],[59,47,59,48],[59,49,59,50],[59,51,59,52],[59,53,59,54],[59,55,59,56],[59,37,59,38],[59,39,59,40],[59,41,59,42],[59,43,59,44],[59,45,59,46],[59,27,59,28],[59,29,59,30],[59,31,59,32],[59,33,59,34],[59,35,59,36],[59,17,59,18],[59,19,59,20],[59,21,59,22],[59,23,59,24],[59,25,59,26],[59,7,59,8],[59,9,59,10],[59,11,59,12],[59,13,59,14],[59,15,59,16],[58,101,58,102],[58,103,58,104],[58,61,58,62],[58,63,58,64],[58,65,58,66],[58,67,58,68],[58,69,58,70],[58,51,58,52],[58,53,58,54],[58,55,58,56],[58,57,58,58],[58,59,58,60],[58,41,58,42],[58,43,58,44],[58,45,58,46],[58,47,58,48],[58,49,58,50],[58,105,58,106],[58,107,58,108],[58,109,58,110],[58,91,58,92],[58,93,58,94],[58,95,58,96],[58,97,58,98],[58,99,58,100],[58,81,58,82],[58,83,58,84],[58,85,58,86],[58,87,58,88],[58,89,58,90],[58,71,58,72],[58,73,58,74],[58,75,58,76],[58,77,58,78],[58,79,58,80],[58,31,58,32],[58,33,58,34],[58,35,58,36],[58,37,58,38],[58,39,58,40],[57,103,57,104],[57,105,57,106],[57,107,57,108],[57,109,57,110],[58,7,58,8],[58,9,58,10],[58,11,58,12],[58,13,58,14],[58,15,58,16],[58,17,58,18],[58,19,58,20],[58,21,58,22],[58,23,58,24],[58,25,58,26],[58,27,58,28],[58,29,58,30],[57,93,57,94],[57,95,57,96],[57,97,57,98],[57,99,57,100],[57,101,57,102],[57,83,57,84],[57,85,57,86],[57,87,57,88],[57,89,57,90],[57,91,57,92],[57,73,57,74],[57,75,57,76],[57,77,57,78],[57,79,57,80],[57,81,57,82],[57,63,57,64],[57,65,57,66],[57,67,57,68],[57,69,57,70],[57,71,57,72],[57,53,57,54],[57,55,57,56],[57,57,57,58],[57,59,57,60],[57,61,57,62],[57,43,57,44],[57,45,57,46],[57,47,57,48],[57,49,57,50],[57,51,57,52],[57,33,57,34],[57,35,57,36],[57,37,57,38],[57,39,57,40],[57,41,57,42],[56,105,56,106],[56,107,56,108],[56,109,56,110],[57,7,57,8],[57,9,57,10],[57,11,57,12],[57,13,57,14],[57,15,57,16],[57,17,57,18],[57,19,57,20],[57,21,57,22],[57,23,57,24],[57,25,57,26],[57,27,57,28],[57,29,57,30],[57,31,57,32],[56,95,56,96],[56,97,56,98],[56,99,56,100],[56,101,56,102],[56,103,56,104],[56,85,56,86],[56,87,56,88],[56,89,56,90],[56,91,56,92],[56,93,56,94],[56,75,56,76],[56,77,56,78],[56,79,56,80],[56,81,56,82],[56,83,56,84],[56,65,56,66],[56,67,56,68],[56,69,56,70],[56,71,56,72],[56,73,56,74],[56,55,56,56],[56,57,56,58],[56,59,56,60],[56,61,56,62],[56,63,56,64],[56,45,56,46],[56,47,56,48],[56,49,56,50],[56,51,56,52],[56,53,56,54],[56,35,56,36],[56,37,56,38],[56,39,56,40],[56,41,56,42],[56,43,56,44],[53,107,53,108],[53,109,53,110],[56,7,56,8],[56,9,56,10],[56,11,56,12],[56,13,56,14],[56,15,56,16],[56,17,56,18],[56,19,56,20],[56,21,56,22],[56,23,56,24],[56,25,56,26],[56,27,56,28],[56,29,56,30],[56,31,56,32],[56,33,56,34],[53,97,53,98],[53,99,53,100],[53,101,53,102],[53,103,53,104],[53,105,53,106],[53,87,53,88],[53,89,53,90],[53,91,53,92],[53,93,53,94],[53,95,53,96],[53,77,53,78],[53,79,53,80],[53,81,53,82],[53,83,53,84],[53,85,53,86],[53,67,53,68],[53,69,53,70],[53,71,53,72],[53,73,53,74],[53,75,53,76],[53,57,53,58],[53,59,53,60],[53,61,53,62],[53,63,53,64],[53,65,53,66],[53,47,53,48],[53,49,53,50],[53,51,53,52],[53,53,53,54],[53,55,53,56],[53,37,53,38],[53,39,53,40],[53,41,53,42],[53,43,53,44],[53,45,53,46],[53,27,53,28],[53,29,53,30],[53,31,53,32],[53,33,53,34],[53,35,53,36],[53,17,53,18],[53,19,53,20],[53,21,53,22],[53,23,53,24],[53,25,53,26],[53,7,53,8],[53,9,53,10],[53,11,53,12],[53,13,53,14],[53,15,53,16],[45,101,45,102],[45,103,45,104],[45,105,45,106],[45,107,45,108],[45,109,45,110],[45,91,45,92],[45,93,45,94],[45,95,45,96],[45,97,45,98],[45,99,45,100],[45,81,45,82],[45,83,45,84],[45,85,45,86],[45,87,45,88],[45,89,45,90],[45,71,45,72],[45,73,45,74],[45,75,45,76],[45,77,45,78],[45,79,45,80],[45,61,45,62],[45,63,45,64],[45,65,45,66],[45,67,45,68],[45,69,45,70],[45,51,45,52],[45,53,45,54],[45,55,45,56],[45,57,45,58],[45,59,45,60],[45,41,45,42],[45,43,45,44],[45,45,45,46],[45,47,45,48],[45,49,45,50],[45,31,45,32],[45,33,45,34],[45,35,45,36],[45,37,45,38],[45,39,45,40],[44,103,44,104],[44,105,44,106],[44,107,44,108],[44,109,44,110],[45,7,45,8],[45,9,45,10],[45,11,45,12],[45,13,45,14],[45,15,45,16],[45,17,45,18],[45,19,45,20],[45,21,45,22],[45,23,45,24],[45,25,45,26],[45,27,45,28],[45,29,45,30],[44,93,44,94],[44,95,44,96],[44,97,44,98],[44,99,44,100],[44,101,44,102],[44,83,44,84],[44,85,44,86],[44,87,44,88],[44,89,44,90],[44,91,44,92],[44,73,44,74],[44,75,44,76],[44,77,44,78],[44,79,44,80],[44,81,44,82],[44,63,44,64],[44,69,44,70],[44,71,44,72],[44,53,44,54],[44,55,44,56],[44,57,44,58],[44,59,44,60],[44,61,44,62],[44,43,44,44],[44,45,44,46],[44,47,44,48],[44,49,44,50],[44,51,44,52],[44,33,44,34],[44,35,44,36],[44,37,44,38],[44,39,44,40],[44,41,44,42],[43,109,43,110],[44,7,44,8],[44,9,44,10],[44,11,44,12],[44,13,44,14],[44,15,44,16],[44,17,44,18],[44,19,44,20],[44,21,44,22],[44,23,44,24],[44,25,44,26],[44,27,44,28],[44,29,44,30],[44,31,44,32],[43,95,43,96],[43,97,43,98],[43,99,43,100],[43,101,43,102],[43,103,43,104],[43,85,43,86],[43,87,43,88],[43,89,43,90],[43,91,43,92],[43,93,43,94],[43,75,43,76],[43,77,43,78],[43,79,43,80],[43,81,43,82],[43,83,43,84],[43,65,43,66],[44,65,44,66],[44,67,44,68],[43,55,43,56],[43,57,43,58],[43,59,43,60],[43,61,43,62],[43,63,43,64],[43,45,43,46],[43,47,43,48],[43,49,43,50],[43,51,43,52],[43,53,43,54],[43,35,43,36],[43,37,43,38],[43,39,43,40],[43,41,43,42],[43,43,43,44],[43,105,43,106],[43,107,43,108],[43,7,43,8],[43,9,43,10],[43,11,43,12],[43,13,43,14],[43,15,43,16],[43,17,43,18],[43,19,43,20],[43,21,43,22],[43,23,43,24],[43,25,43,26],[43,27,43,28],[43,29,43,30],[43,31,43,32],[43,33,43,34],[42,97,42,98],[42,99,42,100],[42,101,42,102],[42,87,42,88],[42,89,42,90],[42,91,42,92],[42,93,42,94],[42,95,42,96],[42,77,42,78],[42,79,42,80],[42,81,42,82],[42,83,42,84],[42,85,42,86],[42,67,42,68],[43,67,43,68],[43,69,43,70],[43,71,43,72],[43,73,43,74],[42,17,42,18],[42,19,42,20],[42,21,42,22],[42,23,42,24],[42,25,42,26],[42,7,42,8],[42,9,42,10],[42,11,42,12],[42,13,42,14],[42,15,42,16],[42,69,42,70],[42,71,42,72],[42,73,42,74],[42,75,42,76],[42,57,42,58],[42,59,42,60],[42,61,42,62],[42,63,42,64],[42,65,42,66],[42,47,42,48],[42,49,42,50],[42,51,42,52],[42,53,42,54],[42,55,42,56],[42,37,42,38],[42,39,42,40],[42,41,42,42],[42,43,42,44],[42,45,42,46],[29,105,29,106],[29,107,29,108],[29,109,29,110],[29,95,29,96],[29,97,29,98],[29,99,29,100],[29,101,29,102],[29,103,29,104],[29,85,29,86],[29,87,29,88],[29,89,29,90],[29,91,29,92],[29,93,29,94],[29,75,29,76],[42,27,42,28],[42,29,42,30],[42,31,42,32],[42,33,42,34],[42,35,42,36],[42,107,42,108],[42,109,42,110],[42,103,42,104],[42,105,42,106],[29,77,29,78],[29,79,29,80],[29,81,29,82],[29,83,29,84],[29,65,29,66],[29,67,29,68],[29,69,29,70],[29,71,29,72],[29,73,29,74],[29,55,29,56],[29,57,29,58],[29,59,29,60],[29,61,29,62],[29,63,29,64],[29,45,29,46],[29,47,29,48],[29,49,29,50],[29,51,29,52],[29,53,29,54],[29,35,29,36],[29,37,29,38],[29,39,29,40],[29,41,29,42],[29,43,29,44],[28,107,28,108],[28,109,28,110],[28,103,28,104],[28,105,28,106],[28,57,28,58],[28,59,28,60],[28,61,28,62],[28,63,28,64],[28,65,28,66],[28,47,28,48],[28,49,28,50],[28,51,28,52],[28,53,28,54],[28,55,28,56],[28,37,28,38],[28,39,28,40],[28,41,28,42],[28,97,28,98],[28,99,28,100],[28,101,28,102],[28,87,28,88],[28,89,28,90],[28,91,28,92],[28,93,28,94],[28,95,28,96],[28,77,28,78],[28,79,28,80],[28,81,28,82],[28,83,28,84],[28,85,28,86],[28,67,28,68],[28,69,28,70],[28,71,28,72],[28,73,28,74],[28,75,28,76],[28,43,28,44],[28,45,28,46],[28,27,28,28],[28,29,28,30],[28,31,28,32],[29,7,29,8],[29,9,29,10],[29,11,29,12],[29,13,29,14],[29,15,29,16],[29,17,29,18],[29,19,29,20],[29,21,29,22],[29,23,29,24],[29,25,29,26],[29,27,29,28],[29,29,29,30],[29,31,29,32],[29,33,29,34],[28,25,28,26],[28,7,28,8],[27,103,27,104],[27,105,27,106],[27,107,27,108],[27,109,27,110],[27,91,27,92],[28,9,28,10],[28,11,28,12],[28,13,28,14],[28,15,28,16],[27,101,27,102],[27,63,27,64],[27,65,27,66],[27,67,27,68],[27,69,27,70],[27,51,27,52],[27,53,27,54],[27,55,27,56],[27,57,27,58],[27,59,27,60],[27,41,27,42],[27,43,27,44],[27,45,27,46],[27,47,27,48],[27,49,27,50],[27,31,27,32],[27,97,27,98],[27,99,27,100],[27,81,27,82],[27,83,27,84],[27,85,27,86],[27,33,27,34],[27,35,27,36],[27,37,27,38],[27,39,27,40],[26,65,26,66],[26,79,26,80],[26,81,26,82],[28,33,28,34],[28,35,28,36],[26,109,26,110],[27,7,27,8],[27,9,27,10],[27,11,27,12],[27,13,27,14],[27,15,27,16],[27,17,27,18],[27,19,27,20],[27,21,27,22],[27,25,27,26],[27,27,27,28],[27,29,27,30],[26,93,26,94],[26,95,26,96],[26,97,26,98],[26,99,26,100],[26,101,26,102],[26,83,26,84],[26,85,26,86],[26,87,26,88],[28,17,28,18],[28,19,28,20],[28,21,28,22],[26,33,26,34],[26,35,26,36],[27,93,27,94],[27,95,27,96],[27,61,27,62],[26,67,26,68],[26,69,26,70],[26,71,26,72],[26,53,26,54],[26,55,26,56],[26,57,26,58],[26,59,26,60],[26,61,26,62],[27,71,27,72],[27,73,27,74],[27,75,27,76],[27,77,27,78],[27,79,27,80],[27,87,27,88],[27,89,27,90],[26,7,26,8],[26,9,26,10],[26,11,26,12],[26,13,26,14],[26,15,26,16],[26,17,26,18],[26,19,26,20],[26,21,26,22],[26,25,26,26],[26,27,26,28],[26,29,26,30],[26,31,26,32],[25,95,25,96],[25,97,25,98],[25,99,25,100],[25,101,25,102],[25,103,25,104],[25,85,25,86],[25,87,25,88],[25,89,25,90],[25,91,25,92],[26,89,26,90],[26,91,26,92],[26,73,26,74],[26,75,26,76],[26,77,26,78],[26,63,26,64],[26,103,26,104],[26,43,26,44],[26,45,26,46],[26,47,26,48],[26,49,26,50],[26,51,26,52],[24,81,24,82],[26,37,26,38],[26,39,26,40],[26,41,26,42],[25,35,25,36],[25,37,25,38]],"merged_total":3524,"flags":["merged_cut"]}
[null,null,null,null,null,"2-1",null,"3-1",null,"4-1",null,"5-1",null,"6-1",null,"10-1",null,"11-1",null,"14-1",null,"17-1",null,"22-1",null,"23-1",null,"25-1",null,"25-2",null,"26-1",null,"27-1",null,"28-1",null,"29-1",null,"31-1",null,"33-1",null,"34-1",null,"35-1",null,"35-2",null,"36-1",null,"37-1",null,"38-1",null,"39-1",null,"40-1",null,"41-1",null,"42-1",null,"43-1",null,"46-1",null,"47-1",null,"48-1",null,"48-2",null,"49-1",null,"50-1",null,"51-1",null,"52-1",null,"53-1",null,"54-1",null,"55-1",null,"56-1",null,"57-1",null,"58-1",null,"59-1",null,"60-1",null,"61-1",null,"62-1",null,"63-1",null,"64-1",null,"65-1",null,"66-1",null,"67-1"]
["表面含浸工",null,null,null,null,{"$f":"IF(LEN(VLOOKUP(F1,仕様の整理!$C:$E,3,0))-LEN(SUBSTITUTE(VLOOKUP(F1,仕様の整理!$C:$E,3,0),\"-\",\"\"))>=2,LEFT(VLOOKUP(F1,仕様の整理!$C:$E,3,0),FIND(\"-\",VLOOKUP(F1,仕様の整理!$C:$E,3,0),FIND(\"-\",VLOOKUP(F1,仕様の整理!$C:$E,3,0))+1)-1),VLOOKUP(F1,仕様の整理!$C:$E,3,0))","v":"CB-090033"},null,{"$f":"IF(LEN(VLOOKUP(H1,仕様の整理!$C:$E,3,0))-LEN(SUBSTITUTE(VLOOKUP(H1,仕様の整理!$C:$E,3,0),\"-\",\"\"))>=2,LEFT(VLOOKUP(H1,仕様の整理!$C:$E,3,0),FIND(\"-\",VLOOKUP(H1,仕様の整理!$C:$E,3,0),FIND(\"-\",VLOOKUP(H1,仕様の整理!$C:$E,3,0))+1)-1),VLOOKUP(H1,仕様の整理!$C:$E,3,0))","v":"KT-090067"},null,{"$f":"IF(LEN(VLOOKUP(J1,仕様の整理!$C:$E,3,0))-LEN(SUBSTITUTE(VLOOKUP(J1,仕様の整理!$C:$E,3,0),\"-\",\"\"))>=2,LEFT(VLOOKUP(J1,仕様の整理!$C:$E,3,0),FIND(\"-\",VLOOKUP(J1,仕様の整理!$C:$E,3,0),FIND(\"-\",VLOOKUP(J1,仕様の整理!$C:$E,3,0))+1)-1),VLOOKUP(J1,仕様の整理!$C:$E,3,0))","v":"QS-100008"},null,{"$f":"IF(LEN(VLOOKUP(L1,仕様の整理!$C:$E,3,0))-LEN(SUBSTITUTE(VLOOKUP(L1,仕様の整理!$C:$E,3,0),\"-\",\"\"))>=2,LEFT(VLOOKUP(L1,仕様の整理!$C:$E,3,0),FIND(\"-\",VLOOKUP(L1,仕様の整理!$C:$E,3,0),FIND(\"-\",VLOOKUP(L1,仕様の整理!$C:$E,3,0))+1)-1),VLOOKUP(L1,仕様の整理!$C:$E,3,0))","v":"KK-100013"},null,{"$f":"IF(LEN(VLOOKUP(N1,仕様の整理!$C:$E,3,0))-LEN(SUBSTITUTE(VLOOKUP(N1,仕様の整理!$C:$E,3,0),\"-\",\"\"))>=2,LEFT(VLOOKUP(N1,仕様の整理!$C:$E,3,0),FIND(\"-\",VLOOKUP(N1,仕様の整理!$C:$E,3,0),FIND(\"-\",VLOOKUP(N1,仕様の整理!$C:$E,3,0))+1)-1),VLOOKUP(N1,仕様の整理!$C:$E,3,0))","v":"KK-100025"},null,{"$f":"IF(LEN(VLOOKUP(P1,仕様の整理!$C:$E,3,0))-LEN(SUBSTITUTE(VLOOKUP(P1,仕様の整理!$C:$E,3,0),\"-\",\"\"))>=2,LEFT(VLOOKUP(P1,仕様の整理!$C:$E,3,0),FIND(\"-\",VLOOKUP(P1,仕様の整理!$C:$E,3,0),FIND(\"-\",VLOOKUP(P1,仕様の整理!$C:$E,3,0))+1)-1),VLOOKUP(P1,仕様の整理!$C:$E,3,0))","v":"CG-120004"},null,{"$f":"IF(LEN(VLOOKUP(R1,仕様の整理!$C:$E,3,0))-LEN(SUBSTITUTE(VLOOKUP(R1,仕様の整理!$C:$E,3,0),\"-\",\"\"))>=2,LEFT(VLOOKUP(R1,仕様の整理!$C:$E,3,0),FIND(\"-\",VLOOKUP(R1,仕様の整理!$C:$E,3,0),FIND(\"-\",VLOOKUP(R1,仕様の整理!$C:$E,3,0))+1)-1),VLOOKUP(R1,仕様の整理!$C:$E,3,0))","v":"KK-120047"},null,{"$f":"IF(LEN(VLOOKUP(T1,仕様の整理!$C:$E,3,0))-LEN(SUBSTITUTE(VLOOKUP(T1,仕様の整理!$C:$E,3,0),\"-\",\"\"))>=2,LEFT(VLOOKUP(T1,仕様の整理!$C:$E,3,0),FIND(\"-\",VLOOKUP(T1,仕様の整理!$C:$E,3,0),FIND(\"-\",VLOOKUP(T1,仕様の整理!$C:$E,3,0))+1)-1),VLOOKUP(T1,仕様の整理!$C:$E,3,0))","v":"KT-130009"},null,{"$f":"IF(LEN(VLOOKUP(V1,仕様の整理!$C:$E,3,0))-LEN(SUBSTITUTE(VLOOKUP(V1,仕様の整理!$C:$E,3,0),\"-\",\"\"))>=2,LEFT(VLOOKUP(V1,仕様の整理!$C:$E,3,0),FIND(\"-\",VLOOKUP(V1,仕様の整理!$C:$E,3,0),FIND(\"-\",VLOOKUP(V1,仕様の整理!$C:$E,3,0))+1)-1),VLOOKUP(V1,仕様の整理!$C:$E,3,0))","v":"KT-130065"},null,{"$f":"IF(LEN(VLOOKUP(X1,仕様の整理!$C:$E,3,0))-LEN(SUBSTITUTE(VLOOKUP(X1,仕様の整理!$C:$E,3,0),\"-\",\"\"))>=2,LEFT(VLOOKUP(X1,仕様の整理!$C:$E,3,0),FIND(\"-\",VLOOKUP(X1,仕様の整理!$C:$E,3,0),FIND(\"-\",VLOOKUP(X1,仕様の整理!$C:$E,3,0))+1)-1),VLOOKUP(X1,仕様の整理!$C:$E,3,0))","v":"CB-150008"},null,{"$f":"IF(LEN(VLOOKUP(Z1,仕様の整理!$C:$E,3,0))-LEN(SUBSTITUTE(VLOOKUP(Z1,仕様の整理!$C:$E,3,0),\"-\",\"\"))>=2,LEFT(VLOOKUP(Z1,仕様の整理!$C:$E,3,0),FIND(\"-\",VLOOKUP(Z1,仕様の整理!$C:$E,3,0),FIND(\"-\",VLOOKUP(Z1,仕様の整理!$C:$E,3,0))+1)-1),VLOOKUP(Z1,仕様の整理!$C:$E,3,0))","v":"QS-150019"},null,{"$f":"IF(LEN(VLOOKUP(AB1,仕様の整理!$C:$E,3,0))-LEN(SUBSTITUTE(VLOOKUP(AB1,仕様の整理!$C:$E,3,0),\"-\",\"\"))>=2,LEFT(VLOOKUP(AB1,仕様の整理!$C:$E,3,0),FIND(\"-\",VLOOKUP(AB1,仕様の整理!$C:$E,3,0),FIND(\"-\",VLOOKUP(AB1,仕様の整理!$C:$E,3,0))+1)-1),VLOOKUP(AB1,仕様の整理!$C:$E,3,0))","v":"SK-160004"},null,{"$f":"IF(LEN(VLOOKUP(AD1,仕様の整理!$C:$E,3,0))-LEN(SUBSTITUTE(VLOOKUP(AD1,仕様の整理!$C:$E,3,0),\"-\",\"\"))>=2,LEFT(VLOOKUP(AD1,仕様の整理!$C:$E,3,0),FIND(\"-\",VLOOKUP(AD1,仕様の整理!$C:$E,3,0),FIND(\"-\",VLOOKUP(AD1,仕様の整理!$C:$E,3,0))+1)-1),VLOOKUP(AD1,仕様の整理!$C:$E,3,0))","v":"SK-160004"},null,{"$f":"IF(LEN(VLOOKUP(AF1,仕様の整理!$C:$E,3,0))-LEN(SUBSTITUTE(VLOOKUP(AF1,仕様の整理!$C:$E,3,0),\"-\",\"\"))>=2,LEFT(VLOOKUP(AF1,仕様の整理!$C:$E,3,0),FIND(\"-\",VLOOKUP(AF1,仕様の整理!$C:$E,3,0),FIND(\"-\",VLOOKUP(AF1,仕様の整理!$C:$E,3,0))+1)-1),VLOOKUP(AF1,仕様の整理!$C:$E,3,0))","v":"CG-160013"},null,{"$f":"IF(LEN(VLOOKUP(AH1,仕様の整理!$C:$E,3,0))-LEN(SUBSTITUTE(VLOOKUP(AH1,仕様の整理!$C:$E,3,0),\"-\",\"\"))>=2,LEFT(VLOOKUP(AH1,仕様の整理!$C:$E,3,0),FIND(\"-\",VLOOKUP(AH1,仕様の整理!$C:$E,3,0),FIND(\"-\",VLOOKUP(AH1,仕様の整理!$C:$E,3,0))+1)-1),VLOOKUP(AH1,仕様の整理!$C:$E,3,0))","v":"QS-160027"},null,{"$f":"IF(LEN(VLOOKUP(AJ1,仕様の整理!$C:$E,3,0))-LEN(SUBSTITUTE(VLOOKUP(AJ1,仕様の整理!$C:$E,3,0),\"-\",\"\"))>=2,LEFT(VLOOKUP(AJ1,仕様の整理!$C:$E,3,0),FIND(\"-\",VLOOKUP(AJ1,仕様の整理!$C:$E,3,0),FIND(\"-\",VLOOKUP(AJ1,仕様の整理!$C:$E,3,0))+1)-1),VLOOKUP(AJ1,仕様の整理!$C:$E,3,0))","v":"KT-160039"},null,{"$f":"IF(LEN(VLOOKUP(AL1,仕様の整理!$C:$E,3,0))-LEN(SUBSTITUTE(VLOOKUP(AL1,仕様の整理!$C:$E,3,0),\"-\",\"\"))>=2,LEFT(VLOOKUP(AL1,仕様の整理!$C:$E,3,0),FIND(\"-\",VLOOKUP(AL1,仕様の整理!$C:$E,3,0),FIND(\"-\",VLOOKUP(AL1,仕様の整理!$C:$E,3,0))+1)-1),VLOOKUP(AL1,仕様の整理!$C:$E,3,0))","v":"KT-160122"},null,{"$f":"IF(LEN(VLOOKUP(AN1,仕様の整理!$C:$E,3,0))-LEN(SUBSTITUTE(VLOOKUP(AN1,仕様の整理!$C:$E,3,0),\"-\",\"\"))>=2,LEFT(VLOOKUP(AN1,仕様の整理!$C:$E,3,0),FIND(\"-\",VLOOKUP(AN1,仕様の整理!$C:$E,3,0),FIND(\"-\",VLOOKUP(AN1,仕様の整理!$C:$E,3,0))+1)-1),VLOOKUP(AN1,仕様の整理!$C:$E,3,0))","v":"CG-170009"},null,{"$f":"IF(LEN(VLOOKUP(AP1,仕様の整理!$C:$E,3,0))-LEN(SUBSTITUTE(VLOOKUP(AP1,仕様の整理!$C:$E,3,0),\"-\",\"\"))>=2,LEFT(VLOOKUP(AP1,仕様の整理!$C:$E,3,0),FIND(\"-\",VLOOKUP(AP1,仕様の整理!$C:$E,3,0),FIND(\"-\",VLOOKUP(AP1,仕様の整理!$C:$E,3,0))+1)-1),VLOOKUP(AP1,仕様の整理!$C:$E,3,0))","v":"TS-030006"},null,{"$f":"IF(LEN(VLOOKUP(AR1,仕様の整理!$C:$E,3,0))-LEN(SUBSTITUTE(VLOOKUP(AR1,仕様の整理!$C:$E,3,0),\"-\",\"\"))>=2,LEFT(VLOOKUP(AR1,仕様の整理!$C:$E,3,0),FIND(\"-\",VLOOKUP(AR1,仕様の整理!$C:$E,3,0),FIND(\"-\",VLOOKUP(AR1,仕様の整理!$C:$E,3,0))+1)-1),VLOOKUP(AR1,仕様の整理!$C:$E,3,0))","v":"CB-020055"},null,{"$f":"IF(LEN(VLOOKUP(AT1,仕様の整理!$C:$E,3,0))-LEN(SUBSTITUTE(VLOOKUP(AT1,仕様の整理!$C:$E,3,0),\"-\",\"\"))>=2,LEFT(VLOOKUP(AT1,仕様の整理!$C:$E,3,0),FIND(\"-\",VLOOKUP(AT1,仕様の整理!$C:$E,3,0),FIND(\"-\",VLOOKUP(AT1,仕様の整理!$C:$E,3,0))+1)-1),VLOOKUP(AT1,仕様の整理!$C:$E,3,0))","v":"KT-060075"},null,{"$f":"IF(LEN(VLOOKUP(AV1,仕様の整理!$C:$E,3,0))-LEN(SUBSTITUTE(VLOOKUP(AV1,仕様の整理!$C:$E,3,0),\"-\",\"\"))>=2,LEFT(VLOOKUP(AV1,仕様の整理!$C:$E,3,0),FIND(\"-\",VLOOKUP(AV1,仕様の整理!$C:$E,3,0),FIND(\"-\",VLOOKUP(AV1,仕様の整理!$C:$E,3,0))+1)-1),VLOOKUP(AV1,仕様の整理!$C:$E,3,0))","v":"KT-060075"},null,{"$f":"IF(LEN(VLOOKUP(AX1,仕様の整理!$C:$E,3,0))-LEN(SUBSTITUTE(VLOOKUP(AX1,仕様の整理!$C:$E,3,0),\"-\",\"\"))>=2,LEFT(VLOOKUP(AX1,仕様の整理!$C:$E,3,0),FIND(\"-\",VLOOKUP(AX1,仕様の整理!$C:$E,3,0),FIND(\"-\",VLOOKUP(AX1,仕様の整理!$C:$E,3,0))+1)-1),VLOOKUP(AX1,仕様の整理!$C:$E,3,0))","v":"HR-060004"},null,{"$f":"IF(LEN(VLOOKUP(AZ1,仕様の整理!$C:$E,3,0))-LEN(SUBSTITUTE(VLOOKUP(AZ1,仕様の整理!$C:$E,3,0),\"-\",\"\"))>=2,LEFT(VLOOKUP(AZ1,仕様の整理!$C:$E,3,0),FIND(\"-\",VLOOKUP(AZ1,仕様の整理!$C:$E,3,0),FIND(\"-\",VLOOKUP(AZ1,仕様の整理!$C:$E,3,0))+1)-1),VLOOKUP(AZ1,仕様の整理!$C:$E,3,0))","v":"QS-000011"},null,{"$f":"IF(LEN(VLOOKUP(BB1,仕様の整理!$C:$E,3,0))-LEN(SUBSTITUTE(VLOOKUP(BB1,仕様の整理!$C:$E,3,0),\"-\",\"\"))>=2,LEFT(VLOOKUP(BB1,仕様の整理!$C:$E,3,0),FIND(\"-\",VLOOKUP(BB1,仕様の整理!$C:$E,3,0),FIND(\"-\",VLOOKUP(BB1,仕様の整理!$C:$E,3,0))+1)-1),VLOOKUP(BB1,仕様の整理!$C:$E,3,0))","v":"QS-040013"},null,{"$f":"IF(LEN(VLOOKUP(BD1,仕様の整理!$C:$E,3,0))-LEN(SUBSTITUTE(VLOOKUP(BD1,仕様の整理!$C:$E,3,0),\"-\",\"\"))>=2,LEFT(VLOOKUP(BD1,仕様の整理!$C:$E,3,0),FIND(\"-\",VLOOKUP(BD1,仕様の整理!$C:$E,3,0),FIND(\"-\",VLOOKUP(BD1,仕様の整理!$C:$E,3,0))+1)-1),VLOOKUP(BD1,仕様の整理!$C:$E,3,0))","v":"KT-060094"},null,{"$f":"IF(LEN(VLOOKUP(BF1,仕様の整理!$C:$E,3,0))-LEN(SUBSTITUTE(VLOOKUP(BF1,仕様の整理!$C:$E,3,0),\"-\",\"\"))>=2,LEFT(VLOOKUP(BF1,仕様の整理!$C:$E,3,0),FIND(\"-\",VLOOKUP(BF1,仕様の整理!$C:$E,3,0),FIND(\"-\",VLOOKUP(BF1,仕様の整理!$C:$E,3,0))+1)-1),VLOOKUP(BF1,仕様の整理!$C:$E,3,0))","v":"HK-070015"},null,{"$f":"IF(LEN(VLOOKUP(BH1,仕様の整理!$C:$E,3,0))-LEN(SUBSTITUTE(VLOOKUP(BH1,仕様の整理!$C:$E,3,0),\"-\",\"\"))>=2,LEFT(VLOOKUP(BH1,仕様の整理!$C:$E,3,0),FIND(\"-\",VLOOKUP(BH1,仕様の整理!$C:$E,3,0),FIND(\"-\",VLOOKUP(BH1,仕様の整理!$C:$E,3,0))+1)-1),VLOOKUP(BH1,仕様の整理!$C:$E,3,0))","v":"KT-070047"},null,{"$f":"IF(LEN(VLOOKUP(BJ1,仕様の整理!$C:$E,3,0))-LEN(SUBSTITUTE(VLOOKUP(BJ1,仕様の整理!$C:$E,3,0),\"-\",\"\"))>=2,LEFT(VLOOKUP(BJ1,仕様の整理!$C:$E,3,0),FIND(\"-\",VLOOKUP(BJ1,仕様の整理!$C:$E,3,0),FIND(\"-\",VLOOKUP(BJ1,仕様の整理!$C:$E,3,0))+1)-1),VLOOKUP(BJ1,仕様の整理!$C:$E,3,0))","v":"KT-080005"},null,{"$f":"IF(LEN(VLOOKUP(BL1,仕様の整理!$C:$E,3,0))-LEN(SUBSTITUTE(VLOOKUP(BL1,仕様の整理!$C:$E,3,0),\"-\",\"\"))>=2,LEFT(VLOOKUP(BL1,仕様の整理!$C:$E,3,0),FIND(\"-\",VLOOKUP(BL1,仕様の整理!$C:$E,3,0),FIND(\"-\",VLOOKUP(BL1,仕様の整理!$C:$E,3,0))+1)-1),VLOOKUP(BL1,仕様の整理!$C:$E,3,0))","v":"KT-080018"},null,{"$f":"IF(LEN(VLOOKUP(BN1,仕様の整理!$C:$E,3,0))-LEN(SUBSTITUTE(VLOOKUP(BN1,仕様の整理!$C:$E,3,0),\"-\",\"\"))>=2,LEFT(VLOOKUP(BN1,仕様の整理!$C:$E,3,0),FIND(\"-\",VLOOKUP(BN1,仕様の整理!$C:$E,3,0),FIND(\"-\",VLOOKUP(BN1,仕様の整理!$C:$E,3,0))+1)-1),VLOOKUP(BN1,仕様の整理!$C:$E,3,0))","v":"KT-180004"},null,{"$f":"IF(LEN(VLOOKUP(BP1,仕様の整理!$C:$E,3,0))-LEN(SUBSTITUTE(VLOOKUP(BP1,仕様の整理!$C:$E,3,0),\"-\",\"\"))>=2,LEFT(VLOOKUP(BP1,仕様の整理!$C:$E,3,0),FIND(\"-\",VLOOKUP(BP1,仕様の整理!$C:$E,3,0),FIND(\"-\",VLOOKUP(BP1,仕様の整理!$C:$E,3,0))+1)-1),VLOOKUP(BP1,仕様の整理!$C:$E,3,0))","v":"KT-180024"},null,{"$f":"IF(LEN(VLOOKUP(BR1,仕様の整理!$C:$E,3,0))-LEN(SUBSTITUTE(VLOOKUP(BR1,仕様の整理!$C:$E,3,0),\"-\",\"\"))>=2,LEFT(VLOOKUP(BR1,仕様の整理!$C:$E,3,0),FIND(\"-\",VLOOKUP(BR1,仕様の整理!$C:$E,3,0),FIND(\"-\",VLOOKUP(BR1,仕様の整理!$C:$E,3,0))+1)-1),VLOOKUP(BR1,仕様の整理!$C:$E,3,0))","v":"QS-180010"},null,{"$f":"IF(LEN(VLOOKUP(BT1,仕様の整理!$C:$E,3,0))-LEN(SUBSTITUTE(VLOOKUP(BT1,仕様の整理!$C:$E,3,0),\"-\",\"\"))>=2,LEFT(VLOOKUP(BT1,仕様の整理!$C:$E,3,0),FIND(\"-\",VLOOKUP(BT1,仕様の整理!$C:$E,3,0),FIND(\"-\",VLOOKUP(BT1,仕様の整理!$C:$E,3,0))+1)-1),VLOOKUP(BT1,仕様の整理!$C:$E,3,0))","v":"QS-180010"},null,{"$f":"IF(LEN(VLOOKUP(BV1,仕様の整理!$C:$E,3,0))-LEN(SUBSTITUTE(VLOOKUP(BV1,仕様の整理!$C:$E,3,0),\"-\",\"\"))>=2,LEFT(VLOOKUP(BV1,仕様の整理!$C:$E,3,0),FIND(\"-\",VLOOKUP(BV1,仕様の整理!$C:$E,3,0),FIND(\"-\",VLOOKUP(BV1,仕様の整理!$C:$E,3,0))+1)-1),VLOOKUP(BV1,仕様の整理!$C:$E,3,0))","v":"CB-180026"},null,{"$f":"IF(LEN(VLOOKUP(BX1,仕様の整理!$C:$E,3,0))-LEN(SUBSTITUTE(VLOOKUP(BX1,仕様の整理!$C:$E,3,0),\"-\",\"\"))>=2,LEFT(VLOOKUP(BX1,仕様の整理!$C:$E,3,0),FIND(\"-\",VLOOKUP(BX1,仕様の整理!$C:$E,3,0),FIND(\"-\",VLOOKUP(BX1,仕様の整理!$C:$E,3,0))+1)-1),VLOOKUP(BX1,仕様の整理!$C:$E,3,0))","v":"KT-180083"},null,{"$f":"IF(LEN(VLOOKUP(BZ1,仕様の整理!$C:$E,3,0))-LEN(SUBSTITUTE(VLOOKUP(BZ1,仕様の整理!$C:$E,3,0),\"-\",\"\"))>=2,LEFT(VLOOKUP(BZ1,仕様の整理!$C:$E,3,0),FIND(\"-\",VLOOKUP(BZ1,仕様の整理!$C:$E,3,0),FIND(\"-\",VLOOKUP(BZ1,仕様の整理!$C:$E,3,0))+1)-1),VLOOKUP(BZ1,仕様の整理!$C:$E,3,0))","v":"KT-180101"},null,{"$f":"IF(LEN(VLOOKUP(CB1,仕様の整理!$C:$E,3,0))-LEN(SUBSTITUTE(VLOOKUP(CB1,仕様の整理!$C:$E,3,0),\"-\",\"\"))>=2,LEFT(VLOOKUP(CB1,仕様の整理!$C:$E,3,0),FIND(\"-\",VLOOKUP(CB1,仕様の整理!$C:$E,3,0),FIND(\"-\",VLOOKUP(CB1,仕様の整理!$C:$E,3,0))+1)-1),VLOOKUP(CB1,仕様の整理!$C:$E,3,0))","v":"CB-190016"},null,{"$f":"IF(LEN(VLOOKUP(CD1,仕様の整理!$C:$E,3,0))-LEN(SUBSTITUTE(VLOOKUP(CD1,仕様の整理!$C:$E,3,0),\"-\",\"\"))>=2,LEFT(VLOOKUP(CD1,仕様の整理!$C:$E,3,0),FIND(\"-\",VLOOKUP(CD1,仕様の整理!$C:$E,3,0),FIND(\"-\",VLOOKUP(CD1,仕様の整理!$C:$E,3,0))+1)-1),VLOOKUP(CD1,仕様の整理!$C:$E,3,0))","v":"CB-190021"},null,{"$f":"IF(LEN(VLOOKUP(CF1,仕様の整理!$C:$E,3,0))-LEN(SUBSTITUTE(VLOOKUP(CF1,仕様の整理!$C:$E,3,0),\"-\",\"\"))>=2,LEFT(VLOOKUP(CF1,仕様の整理!$C:$E,3,0),FIND(\"-\",VLOOKUP(CF1,仕様の整理!$C:$E,3,0),FIND(\"-\",VLOOKUP(CF1,仕様の整理!$C:$E,3,0))+1)-1),VLOOKUP(CF1,仕様の整理!$C:$E,3,0))","v":"CG-190024"},null,{"$f":"IF(LEN(VLOOKUP(CH1,仕様の整理!$C:$E,3,0))-LEN(SUBSTITUTE(VLOOKUP(CH1,仕様の整理!$C:$E,3,0),\"-\",\"\"))>=2,LEFT(VLOOKUP(CH1,仕様の整理!$C:$E,3,0),FIND(\"-\",VLOOKUP(CH1,仕様の整理!$C:$E,3,0),FIND(\"-\",VLOOKUP(CH1,仕様の整理!$C:$E,3,0))+1)-1),VLOOKUP(CH1,仕様の整理!$C:$E,3,0))","v":"KT-190081"},null,{"$f":"IF(LEN(VLOOKUP(CJ1,仕様の整理!$C:$E,3,0))-LEN(SUBSTITUTE(VLOOKUP(CJ1,仕様の整理!$C:$E,3,0),\"-\",\"\"))>=2,LEFT(VLOOKUP(CJ1,仕様の整理!$C:$E,3,0),FIND(\"-\",VLOOKUP(CJ1,仕様の整理!$C:$E,3,0),FIND(\"-\",VLOOKUP(CJ1,仕様の整理!$C:$E,3,0))+1)-1),VLOOKUP(CJ1,仕様の整理!$C:$E,3,0))","v":"KT-190107"},null,{"$f":"IF(LEN(VLOOKUP(CL1,仕様の整理!$C:$E,3,0))-LEN(SUBSTITUTE(VLOOKUP(CL1,仕様の整理!$C:$E,3,0),\"-\",\"\"))>=2,LEFT(VLOOKUP(CL1,仕様の整理!$C:$E,3,0),FIND(\"-\",VLOOKUP(CL1,仕様の整理!$C:$E,3,0),FIND(\"-\",VLOOKUP(CL1,仕様の整理!$C:$E,3,0))+1)-1),VLOOKUP(CL1,仕様の整理!$C:$E,3,0))","v":"SK-200001"},null,{"$f":"IF(LEN(VLOOKUP(CN1,仕様の整理!$C:$E,3,0))-LEN(SUBSTITUTE(VLOOKUP(CN1,仕様の整理!$C:$E,3,0),\"-\",\"\"))>=2,LEFT(VLOOKUP(CN1,仕様の整理!$C:$E,3,0),FIND(\"-\",VLOOKUP(CN1,仕様の整理!$C:$E,3,0),FIND(\"-\",VLOOKUP(CN1,仕様の整理!$C:$E,3,0))+1)-1),VLOOKUP(CN1,仕様の整理!$C:$E,3,0))","v":"CB-200002"},null,{"$f":"IF(LEN(VLOOKUP(CP1,仕様の整理!$C:$E,3,0))-LEN(SUBSTITUTE(VLOOKUP(CP1,仕様の整理!$C:$E,3,0),\"-\",\"\"))>=2,LEFT(VLOOKUP(CP1,仕様の整理!$C:$E,3,0),FIND(\"-\",VLOOKUP(CP1,仕様の整理!$C:$E,3,0),FIND(\"-\",VLOOKUP(CP1,仕様の整理!$C:$E,3,0))+1)-1),VLOOKUP(CP1,仕様の整理!$C:$E,3,0))","v":"OK-200001"},null,{"$f":"IF(LEN(VLOOKUP(CR1,仕様の整理!$C:$E,3,0))-LEN(SUBSTITUTE(VLOOKUP(CR1,仕様の整理!$C:$E,3,0),\"-\",\"\"))>=2,LEFT(VLOOKUP(CR1,仕様の整理!$C:$E,3,0),FIND(\"-\",VLOOKUP(CR1,仕様の整理!$C:$E,3,0),FIND(\"-\",VLOOKUP(CR1,仕様の整理!$C:$E,3,0))+1)-1),VLOOKUP(CR1,仕様の整理!$C:$E,3,0))","v":"TH-200005"},null,{"$f":"IF(LEN(VLOOKUP(CT1,仕様の整理!$C:$E,3,0))-LEN(SUBSTITUTE(VLOOKUP(CT1,仕様の整理!$C:$E,3,0),\"-\",\"\"))>=2,LEFT(VLOOKUP(CT1,仕様の整理!$C:$E,3,0),FIND(\"-\",VLOOKUP(CT1,仕様の整理!$C:$E,3,0),FIND(\"-\",VLOOKUP(CT1,仕様の整理!$C:$E,3,0))+1)-1),VLOOKUP(CT1,仕様の整理!$C:$E,3,0))","v":"KK-220004"},null,{"$f":"IF(LEN(VLOOKUP(CV1,仕様の整理!$C:$E,3,0))-LEN(SUBSTITUTE(VLOOKUP(CV1,仕様の整理!$C:$E,3,0),\"-\",\"\"))>=2,LEFT(VLOOKUP(CV1,仕様の整理!$C:$E,3,0),FIND(\"-\",VLOOKUP(CV1,仕様の整理!$C:$E,3,0),FIND(\"-\",VLOOKUP(CV1,仕様の整理!$C:$E,3,0))+1)-1),VLOOKUP(CV1,仕様の整理!$C:$E,3,0))","v":"KT-220204"},null,{"$f":"IF(LEN(VLOOKUP(CX1,仕様の整理!$C:$E,3,0))-LEN(SUBSTITUTE(VLOOKUP(CX1,仕様の整理!$C:$E,3,0),\"-\",\"\"))>=2,LEFT(VLOOKUP(CX1,仕様の整理!$C:$E,3,0),FIND(\"-\",VLOOKUP(CX1,仕様の整理!$C:$E,3,0),FIND(\"-\",VLOOKUP(CX1,仕様の整理!$C:$E,3,0))+1)-1),VLOOKUP(CX1,仕様の整理!$C:$E,3,0))","v":"KT-220245"},null,{"$f":"IF(LEN(VLOOKUP(CZ1,仕様の整理!$C:$E,3,0))-LEN(SUBSTITUTE(VLOOKUP(CZ1,仕様の整理!$C:$E,3,0),\"-\",\"\"))>=2,LEFT(VLOOKUP(CZ1,仕様の整理!$C:$E,3,0),FIND(\"-\",VLOOKUP(CZ1,仕様の整理!$C:$E,3,0),FIND(\"-\",VLOOKUP(CZ1,仕様の整理!$C:$E,3,0))+1)-1),VLOOKUP(CZ1,仕様の整理!$C:$E,3,0))","v":"KK-230014"},null,{"$f":"IF(LEN(VLOOKUP(DB1,仕様の整理!$C:$E,3,0))-LEN(SUBSTITUTE(VLOOKUP(DB1,仕様の整理!$C:$E,3,0),\"-\",\"\"))>=2,LEFT(VLOOKUP(DB1,仕様の整理!$C:$E,3,0),FIND(\"-\",VLOOKUP(DB1,仕様の整理!$C:$E,3,0),FIND(\"-\",VLOOKUP(DB1,仕様の整理!$C:$E,3,0))+1)-1),VLOOKUP(DB1,仕様の整理!$C:$E,3,0))","v":"HK-230010"},null,{"$f":"IF(LEN(VLOOKUP(DD1,仕様の整理!$C:$E,3,0))-LEN(SUBSTITUTE(VLOOKUP(DD1,仕様の整理!$C:$E,3,0),\"-\",\"\"))>=2,LEFT(VLOOKUP(DD1,仕様の整理!$C:$E,3,0),FIND(\"-\",VLOOKUP(DD1,仕様の整理!$C:$E,3,0),FIND(\"-\",VLOOKUP(DD1,仕様の整理!$C:$E,3,0))+1)-1),VLOOKUP(DD1,仕様の整理!$C:$E,3,0))","v":"KT-230139"},null,{"$f":"IF(LEN(VLOOKUP(DF1,仕様の整理!$C:$E,3,0))-LEN(SUBSTITUTE(VLOOKUP(DF1,仕様の整理!$C:$E,3,0),\"-\",\"\"))>=2,LEFT(VLOOKUP(DF1,仕様の整理!$C:$E,3,0),FIND(\"-\",VLOOKUP(DF1,仕様の整理!$C:$E,3,0),FIND(\"-\",VLOOKUP(DF1,仕様の整理!$C:$E,3,0))+1)-1),VLOOKUP(DF1,仕様の整理!$C:$E,3,0))","v":"KT-230268"}]
[null,null,null,null,null,{"$f":"IFERROR(\"作成日：\"&VLOOKUP(F$1,仕様の整理!$C:$P,6,0),\"-\")","v":"作成日：令和7年10月"},null,{"$f":"IFERROR(\"作成日：\"&VLOOKUP(H$1,仕様の整理!$C:$P,6,0),\"-\")","v":"作成日：令和7年10月"},null,{"$f":"IFERROR(\"作成日：\"&VLOOKUP(J$1,仕様の整理!$C:$P,6,0),\"-\")","v":"作成日：令和7年10月"},null,{"$f":"IFERROR(\"作成日：\"&VLOOKUP(L$1,仕様の整理!$C:$P,6,0),\"-\")","v":"作成日：令和7年10月"},null,{"$f":"IFERROR(\"作成日：\"&VLOOKUP(N$1,仕様の整理!$C:$P,6,0),\"-\")","v":"作成日：令和7年10月"},null,{"$f":"IFERROR(\"作成日：\"&VLOOKUP(P$1,仕様の整理!$C:$P,6,0),\"-\")","v":"作成日：令和7年10月"},null,{"$f":"IFERROR(\"作成日：\"&VLOOKUP(R$1,仕様の整理!$C:$P,6,0),\"-\")","v":"作成日：令和7年10月"},null,{"$f":"IFERROR(\"作成日：\"&VLOOKUP(T$1,仕様の整理!$C:$P,6,0),\"-\")","v":"作成日：令和7年10月"},null,{"$f":"IFERROR(\"作成日：\"&VLOOKUP(V$1,仕様の整理!$C:$P,6,0),\"-\")","v":"作成日：令和7年10月"},null,{"$f":"IFERROR(\"作成日：\"&VLOOKUP(X$1,仕様の整理!$C:$P,6,0),\"-\")","v":"作成日：令和7年10月"},null,{"$f":"IFERROR(\"作成日：\"&VLOOKUP(Z$1,仕様の整理!$C:$P,6,0),\"-\")","v":"作成日：令和7年10月"},null,{"$f":"IFERROR(\"作成日：\"&VLOOKUP(AB$1,仕様の整理!$C:$P,6,0),\"-\")","v":"作成日：令和7年10月"},null,{"$f":"IFERROR(\"作成日：\"&VLOOKUP(AD$1,仕様の整理!$C:$P,6,0),\"-\")","v":"作成日：令和7年10月"},null,{"$f":"IFERROR(\"作成日：\"&VLOOKUP(AF$1,仕様の整理!$C:$P,6,0),\"-\")","v":"作成日：令和7年10月"},null,{"$f":"IFERROR(\"作成日：\"&VLOOKUP(AH$1,仕様の整理!$C:$P,6,0),\"-\")","v":"作成日：令和7年10月"},null,{"$f":"IFERROR(\"作成日：\"&VLOOKUP(AJ$1,仕様の整理!$C:$P,6,0),\"-\")","v":"作成日：令和7年10月"},null,{"$f":"IFERROR(\"作成日：\"&VLOOKUP(AL$1,仕様の整理!$C:$P,6,0),\"-\")","v":"作成日：令和7年10月"},null,{"$f":"IFERROR(\"作成日：\"&VLOOKUP(AN$1,仕様の整理!$C:$P,6,0),\"-\")","v":"作成日：令和7年10月"},null,{"$f":"IFERROR(\"作成日：\"&VLOOKUP(AP$1,仕様の整理!$C:$P,6,0),\"-\")","v":"作成日：令和7年10月"},null,{"$f":"IFERROR(\"作成日：\"&VLOOKUP(AR$1,仕様の整理!$C:$P,6,0),\"-\")","v":"作成日：令和7年10月"},null,{"$f":"IFERROR(\"作成日：\"&VLOOKUP(AT$1,仕様の整理!$C:$P,6,0),\"-\")","v":"作成日：令和7年10月"},null,{"$f":"IFERROR(\"作成日：\"&VLOOKUP(AV$1,仕様の整理!$C:$P,6,0),\"-\")","v":"作成日：令和7年10月"},null,{"$f":"IFERROR(\"作成日：\"&VLOOKUP(AX$1,仕様の整理!$C:$P,6,0),\"-\")","v":"作成日：令和7年10月"},null,{"$f":"IFERROR(\"作成日：\"&VLOOKUP(AZ$1,仕様の整理!$C:$P,6,0),\"-\")","v":"作成日：令和7年10月"},null,{"$f":"IFERROR(\"作成日：\"&VLOOKUP(BB$1,仕様の整理!$C:$P,6,0),\"-\")","v":"作成日：令和7年10月"},null,{"$f":"IFERROR(\"作成日：\"&VLOOKUP(BD$1,仕様の整理!$C:$P,6,0),\"-\")","v":"作成日：令和7年10月"},null,{"$f":"IFERROR(\"作成日：\"&VLOOKUP(BF$1,仕様の整理!$C:$P,6,0),\"-\")","v":"作成日：令和7年10月"},null,{"$f":"IFERROR(\"作成日：\"&VLOOKUP(BH$1,仕様の整理!$C:$P,6,0),\"-\")","v":"作成日：令和7年10月"},null,{"$f":"IFERROR(\"作成日：\"&VLOOKUP(BJ$1,仕様の整理!$C:$P,6,0),\"-\")","v":"作成日：令和7年10月"},null,{"$f":"IFERROR(\"作成日：\"&VLOOKUP(BL$1,仕様の整理!$C:$P,6,0),\"-\")","v":"作成日：令和7年10月"},null,{"$f":"IFERROR(\"作成日：\"&VLOOKUP(BN$1,仕様の整理!$C:$P,6,0),\"-\")","v":"作成日：令和7年10月"},null,{"$f":"IFERROR(\"作成日：\"&VLOOKUP(BP$1,仕様の整理!$C:$P,6,0),\"-\")","v":"作成日：令和7年10月"},null,{"$f":"IFERROR(\"作成日：\"&VLOOKUP(BR$1,仕様の整理!$C:$P,6,0),\"-\")","v":"作成日：令和7年10月"},null,{"$f":"IFERROR(\"作成日：\"&VLOOKUP(BT$1,仕様の整理!$C:$P,6,0),\"-\")","v":"作成日：令和7年10月"},null,{"$f":"IFERROR(\"作成日：\"&VLOOKUP(BV$1,仕様の整理!$C:$P,6,0),\"-\")","v":"作成日：令和7年10月"},null,{"$f":"IFERROR(\"作成日：\"&VLOOKUP(BX$1,仕様の整理!$C:$P,6,0),\"-\")","v":"作成日：令和7年10月"},null,{"$f":"IFERROR(\"作成日：\"&VLOOKUP(BZ$1,仕様の整理!$C:$P,6,0),\"-\")","v":"作成日：令和7年10月"},null,{"$f":"IFERROR(\"作成日：\"&VLOOKUP(CB$1,仕様の整理!$C:$P,6,0),\"-\")","v":"作成日：令和7年10月"},null,{"$f":"IFERROR(\"作成日：\"&VLOOKUP(CD$1,仕様の整理!$C:$P,6,0),\"-\")","v":"作成日：令和7年10月"},null,{"$f":"IFERROR(\"作成日：\"&VLOOKUP(CF$1,仕様の整理!$C:$P,6,0),\"-\")","v":"作成日：令和7年10月"},null,{"$f":"IFERROR(\"作成日：\"&VLOOKUP(CH$1,仕様の整理!$C:$P,6,0),\"-\")","v":"作成日：令和7年10月"},null,{"$f":"IFERROR(\"作成日：\"&VLOOKUP(CJ$1,仕様の整理!$C:$P,6,0),\"-\")","v":"作成日：令和7年10月"},null,{"$f":"IFERROR(\"作成日：\"&VLOOKUP(CL$1,仕様の整理!$C:$P,6,0),\"-\")","v":"作成日：令和7年10月"},null,{"$f":"IFERROR(\"作成日：\"&VLOOKUP(CN$1,仕様の整理!$C:$P,6,0),\"-\")","v":"作成日：令和7年10月"},null,{"$f":"IFERROR(\"作成日：\"&VLOOKUP(CP$1,仕様の整理!$C:$P,6,0),\"-\")","v":"作成日：令和7年10月"},null,{"$f":"IFERROR(\"作成日：\"&VLOOKUP(CR$1,仕様の整理!$C:$P,6,0),\"-\")","v":"作成日：令和7年10月"},null,{"$f":"IFERROR(\"作成日：\"&VLOOKUP(CT$1,仕様の整理!$C:$P,6,0),\"-\")","v":"作成日：令和7年10月"},null,{"$f":"IFERROR(\"作成日：\"&VLOOKUP(CV$1,仕様の整理!$C:$P,6,0),\"-\")","v":"作成日：令和7年10月"},null,{"$f":"IFERROR(\"作成日：\"&VLOOKUP(CX$1,仕様の整理!$C:$P,6,0),\"-\")","v":"作成日：令和7年10月"},null,{"$f":"IFERROR(\"作成日：\"&VLOOKUP(CZ$1,仕様の整理!$C:$P,6,0),\"-\")","v":"作成日：令和7年10月"},null,{"$f":"IFERROR(\"作成日：\"&VLOOKUP(DB$1,仕様の整理!$C:$P,6,0),\"-\")","v":"作成日：令和7年10月"},null,{"$f":"IFERROR(\"作成日：\"&VLOOKUP(DD$1,仕様の整理!$C:$P,6,0),\"-\")","v":"作成日：令和7年10月"},null,{"$f":"IFERROR(\"作成日：\"&VLOOKUP(DF$1,仕様の整理!$C:$P,6,0),\"-\")","v":"作成日：令和7年12月"}]
[null,null,null,null,null,{"$f":"IFERROR(VLOOKUP(F$1,仕様の整理!$C:$P,7,0),\"-\")","v":"シラン系"},null,{"$f":"IFERROR(VLOOKUP(H$1,仕様の整理!$C:$P,7,0),\"-\")","v":"その他表面保護材"},null,{"$f":"IFERROR(VLOOKUP(J$1,仕様の整理!$C:$P,7,0),\"-\")","v":"シラン系"},null,{"$f":"IFERROR(VLOOKUP(L$1,仕様の整理!$C:$P,7,0),\"-\")","v":"ケイ酸塩系"},null,{"$f":"IFERROR(VLOOKUP(N$1,仕様の整理!$C:$P,7,0),\"-\")","v":"シラン系"},null,{"$f":"IFERROR(VLOOKUP(P$1,仕様の整理!$C:$P,7,0),\"-\")","v":"シラン系"},null,{"$f":"IFERROR(VLOOKUP(R$1,仕様の整理!$C:$P,7,0),\"-\")","v":"シラン系"},null,{"$f":"IFERROR(VLOOKUP(T$1,仕様の整理!$C:$P,7,0),\"-\")","v":"ケイ酸塩系"},null,{"$f":"IFERROR(VLOOKUP(V$1,仕様の整理!$C:$P,7,0),\"-\")","v":"ケイ酸塩系"},null,{"$f":"IFERROR(VLOOKUP(X$1,仕様の整理!$C:$P,7,0),\"-\")","v":"その他表面保護材"},null,{"$f":"IFERROR(VLOOKUP(Z$1,仕様の整理!$C:$P,7,0),\"-\")","v":"ケイ酸塩系"},null,{"$f":"IFERROR(VLOOKUP(AB$1,仕様の整理!$C:$P,7,0),\"-\")","v":"ケイ酸塩系"},null,{"$f":"IFERROR(VLOOKUP(AD$1,仕様の整理!$C:$P,7,0),\"-\")","v":"ケイ酸塩系"},null,{"$f":"IFERROR(VLOOKUP(AF$1,仕様の整理!$C:$P,7,0),\"-\")","v":"ケイ酸塩系"},null,{"$f":"IFERROR(VLOOKUP(AH$1,仕様の整理!$C:$P,7,0),\"-\")","v":"ケイ酸塩系"},null,{"$f":"IFERROR(VLOOKUP(AJ$1,仕様の整理!$C:$P,7,0),\"-\")","v":"その他表面保護材"},null,{"$f":"IFERROR(VLOOKUP(AL$1,仕様の整理!$C:$P,7,0),\"-\")","v":"その他表面保護材"},null,{"$f":"IFERROR(VLOOKUP(AN$1,仕様の整理!$C:$P,7,0),\"-\")","v":"ケイ酸塩系"},null,{"$f":"IFERROR(VLOOKUP(AP$1,仕様の整理!$C:$P,7,0),\"-\")","v":"シラン系"},null,{"$f":"IFERROR(VLOOKUP(AR$1,仕様の整理!$C:$P,7,0),\"-\")","v":"ケイ酸塩系"},null,{"$f":"IFERROR(VLOOKUP(AT$1,仕様の整理!$C:$P,7,0),\"-\")","v":"ケイ酸塩系"},null,{"$f":"IFERROR(VLOOKUP(AV$1,仕様の整理!$C:$P,7,0),\"-\")","v":"ケイ酸塩系"},null,{"$f":"IFERROR(VLOOKUP(AX$1,仕様の整理!$C:$P,7,0),\"-\")","v":"シラン系"},null,{"$f":"IFERROR(VLOOKUP(AZ$1,仕様の整理!$C:$P,7,0),\"-\")","v":"その他表面保護材"},null,{"$f":"IFERROR(VLOOKUP(BB$1,仕様の整理!$C:$P,7,0),\"-\")","v":"ケイ酸塩系"},null,{"$f":"IFERROR(VLOOKUP(BD$1,仕様の整理!$C:$P,7,0),\"-\")","v":"シラン系"},null,{"$f":"IFERROR(VLOOKUP(BF$1,仕様の整理!$C:$P,7,0),\"-\")","v":"ケイ酸塩系"},null,{"$f":"IFERROR(VLOOKUP(BH$1,仕様の整理!$C:$P,7,0),\"-\")","v":"シラン系"},null,{"$f":"IFERROR(VLOOKUP(BJ$1,仕様の整理!$C:$P,7,0),\"-\")","v":"ケイ酸塩系"},null,{"$f":"IFERROR(VLOOKUP(BL$1,仕様の整理!$C:$P,7,0),\"-\")","v":"ケイ酸塩系"},null,{"$f":"IFERROR(VLOOKUP(BN$1,仕様の整理!$C:$P,7,0),\"-\")","v":"シラン系"},null,{"$f":"IFERROR(VLOOKUP(BP$1,仕様の整理!$C:$P,7,0),\"-\")","v":"ケイ酸塩系"},null,{"$f":"IFERROR(VLOOKUP(BR$1,仕様の整理!$C:$P,7,0),\"-\")","v":"シラン系"},null,{"$f":"IFERROR(VLOOKUP(BT$1,仕様の整理!$C:$P,7,0),\"-\")","v":"シラン系"},null,{"$f":"IFERROR(VLOOKUP(BV$1,仕様の整理!$C:$P,7,0),\"-\")","v":"ケイ酸塩系"},null,{"$f":"IFERROR(VLOOKUP(BX$1,仕様の整理!$C:$P,7,0),\"-\")","v":"ケイ酸塩系"},null,{"$f":"IFERROR(VLOOKUP(BZ$1,仕様の整理!$C:$P,7,0),\"-\")","v":"ケイ酸塩系"},null,{"$f":"IFERROR(VLOOKUP(CB$1,仕様の整理!$C:$P,7,0),\"-\")","v":"ケイ酸塩系"},null,{"$f":"IFERROR(VLOOKUP(CD$1,仕様の整理!$C:$P,7,0),\"-\")","v":"その他表面保護材"},null,{"$f":"IFERROR(VLOOKUP(CF$1,仕様の整理!$C:$P,7,0),\"-\")","v":"シラン系"},null,{"$f":"IFERROR(VLOOKUP(CH$1,仕様の整理!$C:$P,7,0),\"-\")","v":"ケイ酸塩系"},null,{"$f":"IFERROR(VLOOKUP(CJ$1,仕様の整理!$C:$P,7,0),\"-\")","v":"ケイ酸塩系"},null,{"$f":"IFERROR(VLOOKUP(CL$1,仕様の整理!$C:$P,7,0),\"-\")","v":"ケイ酸塩系"},null,{"$f":"IFERROR(VLOOKUP(CN$1,仕様の整理!$C:$P,7,0),\"-\")","v":"シラン系"},null,{"$f":"IFERROR(VLOOKUP(CP$1,仕様の整理!$C:$P,7,0),\"-\")","v":"ケイ酸塩系"},null,{"$f":"IFERROR(VLOOKUP(CR$1,仕様の整理!$C:$P,7,0),\"-\")","v":"ケイ酸塩系"},null,{"$f":"IFERROR(VLOOKUP(CT$1,仕様の整理!$C:$P,7,0),\"-\")","v":"シラン系"},null,{"$f":"IFERROR(VLOOKUP(CV$1,仕様の整理!$C:$P,7,0),\"-\")","v":"シラン系"},null,{"$f":"IFERROR(VLOOKUP(CX$1,仕様の整理!$C:$P,7,0),\"-\")","v":"その他表面保護材"},null,{"$f":"IFERROR(VLOOKUP(CZ$1,仕様の整理!$C:$P,7,0),\"-\")","v":"シラン系"},null,{"$f":"IFERROR(VLOOKUP(DB$1,仕様の整理!$C:$P,7,0),\"-\")","v":"その他表面保護材"},null,{"$f":"IFERROR(VLOOKUP(DD$1,仕様の整理!$C:$P,7,0),\"-\")","v":"その他表面保護材"},null,{"$f":"IFERROR(VLOOKUP(DF$1,仕様の整理!$C:$P,7,0),\"-\")","v":"シラン系"}]
["ＮＥＴＩＳ情報","技術名",null,null,null,{"$f":"IF(VLOOKUP(F$1,仕様の整理!$C:$P,4,0)=\"NETIS掲載期間終了技術\",VLOOKUP(F$1,仕様の整理!$C:$P,2,0),VLOOKUP(F$1,仕様の整理!$C:$P,2,0)&\"（\"&VLOOKUP(F$1,仕様の整理!$C:$P,4,0)&\"）\")&IF(VLOOKUP(F$1,仕様の整理!$C:$P,5,0)=\"○\",\"\",\"《新規登録技術》\")","v":"コンクリート表面保護材「パーミエイトHS-300」"},null,{"$f":"IF(VLOOKUP(H$1,仕様の整理!$C:$P,4,0)=\"NETIS掲載期間終了技術\",VLOOKUP(H$1,仕様の整理!$C:$P,2,0),VLOOKUP(H$1,仕様の整理!$C:$P,2,0)&\"（\"&VLOOKUP(H$1,仕様の整理!$C:$P,4,0)&\"）\")&IF(VLOOKUP(H$1,仕様の整理!$C:$P,5,0)=\"○\",\"\",\"《新規登録技術》\")","v":"高浸透性コンクリート改質剤 【リバコン・リキッド】"},null,{"$f":"IF(VLOOKUP(J$1,仕様の整理!$C:$P,4,0)=\"NETIS掲載期間終了技術\",VLOOKUP(J$1,仕様の整理!$C:$P,2,0),VLOOKUP(J$1,仕様の整理!$C:$P,2,0)&\"（\"&VLOOKUP(J$1,仕様の整理!$C:$P,4,0)&\"）\")&IF(VLOOKUP(J$1,仕様の整理!$C:$P,5,0)=\"○\",\"\",\"《新規登録技術》\")","v":"ニュースパンガード"},null,{"$f":"IF(VLOOKUP(L$1,仕様の整理!$C:$P,4,0)=\"NETIS掲載期間終了技術\",VLOOKUP(L$1,仕様の整理!$C:$P,2,0),VLOOKUP(L$1,仕様の整理!$C:$P,2,0)&\"（\"&VLOOKUP(L$1,仕様の整理!$C:$P,4,0)&\"）\")&IF(VLOOKUP(L$1,仕様の整理!$C:$P,5,0)=\"○\",\"\",\"《新規登録技術》\")","v":"RCGインナーシリカ"},null,{"$f":"IF(VLOOKUP(N$1,仕様の整理!$C:$P,4,0)=\"NETIS掲載期間終了技術\",VLOOKUP(N$1,仕様の整理!$C:$P,2,0),VLOOKUP(N$1,仕様の整理!$C:$P,2,0)&\"（\"&VLOOKUP(N$1,仕様の整理!$C:$P,4,0)&\"）\")&IF(VLOOKUP(N$1,仕様の整理!$C:$P,5,0)=\"○\",\"\",\"《新規登録技術》\")","v":"無機系コンクリート浸透改質材「リフレパセットD70」"},null,{"$f":"IF(VLOOKUP(P$1,仕様の整理!$C:$P,4,0)=\"NETIS掲載期間終了技術\",VLOOKUP(P$1,仕様の整理!$C:$P,2,0),VLOOKUP(P$1,仕様の整理!$C:$P,2,0)&\"（\"&VLOOKUP(P$1,仕様の整理!$C:$P,4,0)&\"）\")&IF(VLOOKUP(P$1,仕様の整理!$C:$P,5,0)=\"○\",\"\",\"《新規登録技術》\")","v":"浸透性吸水防止材「レジソークType1」"},null,{"$f":"IF(VLOOKUP(R$1,仕様の整理!$C:$P,4,0)=\"NETIS掲載期間終了技術\",VLOOKUP(R$1,仕様の整理!$C:$P,2,0),VLOOKUP(R$1,仕様の整理!$C:$P,2,0)&\"（\"&VLOOKUP(R$1,仕様の整理!$C:$P,4,0)&\"）\")&IF(VLOOKUP(R$1,仕様の整理!$C:$P,5,0)=\"○\",\"\",\"《新規登録技術》\")","v":"含浸系表面保護材「プロテクトシルBH N」"},null,{"$f":"IF(VLOOKUP(T$1,仕様の整理!$C:$P,4,0)=\"NETIS掲載期間終了技術\",VLOOKUP(T$1,仕様の整理!$C:$P,2,0),VLOOKUP(T$1,仕様の整理!$C:$P,2,0)&\"（\"&VLOOKUP(T$1,仕様の整理!$C:$P,4,0)&\"）\")&IF(VLOOKUP(T$1,仕様の整理!$C:$P,5,0)=\"○\",\"\",\"《新規登録技術》\")","v":"シリケートガード"},null,{"$f":"IF(VLOOKUP(V$1,仕様の整理!$C:$P,4,0)=\"NETIS掲載期間終了技術\",VLOOKUP(V$1,仕様の整理!$C:$P,2,0),VLOOKUP(V$1,仕様の整理!$C:$P,2,0)&\"（\"&VLOOKUP(V$1,仕様の整理!$C:$P,4,0)&\"）\")&IF(VLOOKUP(V$1,仕様の整理!$C:$P,5,0)=\"○\",\"\",\"《新規登録技術》\")","v":"無機質ケイ酸塩含浸コンクリート保護材 「ポルトガード・プレクサス」"},null,{"$f":"IF(VLOOKUP(X$1,仕様の整理!$C:$P,4,0)=\"NETIS掲載期間終了技術\",VLOOKUP(X$1,仕様の整理!$C:$P,2,0),VLOOKUP(X$1,仕様の整理!$C:$P,2,0)&\"（\"&VLOOKUP(X$1,仕様の整理!$C:$P,4,0)&\"）\")&IF(VLOOKUP(X$1,仕様の整理!$C:$P,5,0)=\"○\",\"\",\"《新規登録技術》\")","v":"コンクリート劣化防止工法 ファインクリスタルS&TOP（事後評価済技術）"},null,{"$f":"IF(VLOOKUP(Z$1,仕様の整理!$C:$P,4,0)=\"NETIS掲載期間終了技術\",VLOOKUP(Z$1,仕様の整理!$C:$P,2,0),VLOOKUP(Z$1,仕様の整理!$C:$P,2,0)&\"（\"&VLOOKUP(Z$1,仕様の整理!$C:$P,4,0)&\"）\")&IF(VLOOKUP(Z$1,仕様の整理!$C:$P,5,0)=\"○\",\"\",\"《新規登録技術》\")","v":"けい酸塩系コンクリート含浸材「SUPER SHIELD」（有用な新技術）"},null,{"$f":"IF(VLOOKUP(AB$1,仕様の整理!$C:$P,4,0)=\"NETIS掲載期間終了技術\",VLOOKUP(AB$1,仕様の整理!$C:$P,2,0),VLOOKUP(AB$1,仕様の整理!$C:$P,2,0)&\"（\"&VLOOKUP(AB$1,仕様の整理!$C:$P,4,0)&\"）\")&IF(VLOOKUP(AB$1,仕様の整理!$C:$P,5,0)=\"○\",\"\",\"《新規登録技術》\")","v":"コンクリート改質・劣化防止剤 「カルサプリ」、「リアクトライズ」（リアクトライズ単独使用時）（事後評価済技術）"},null,{"$f":"IF(VLOOKUP(AD$1,仕様の整理!$C:$P,4,0)=\"NETIS掲載期間終了技術\",VLOOKUP(AD$1,仕様の整理!$C:$P,2,0),VLOOKUP(AD$1,仕様の整理!$C:$P,2,0)&\"（\"&VLOOKUP(AD$1,仕様の整理!$C:$P,4,0)&\"）\")&IF(VLOOKUP(AD$1,仕様の整理!$C:$P,5,0)=\"○\",\"\",\"《新規登録技術》\")","v":"コンクリート改質・劣化防止剤 「カルサプリ」、「リアクトライズ」（カルサプリ、リアクトライズ併用時）（事後評価済技術）"},null,{"$f":"IF(VLOOKUP(AF$1,仕様の整理!$C:$P,4,0)=\"NETIS掲載期間終了技術\",VLOOKUP(AF$1,仕様の整理!$C:$P,2,0),VLOOKUP(AF$1,仕様の整理!$C:$P,2,0)&\"（\"&VLOOKUP(AF$1,仕様の整理!$C:$P,4,0)&\"）\")&IF(VLOOKUP(AF$1,仕様の整理!$C:$P,5,0)=\"○\",\"\",\"《新規登録技術》\")","v":"けい酸塩系表面含浸材CS-21ネオ（有用な新技術）"},null,{"$f":"IF(VLOOKUP(AH$1,仕様の整理!$C:$P,4,0)=\"NETIS掲載期間終了技術\",VLOOKUP(AH$1,仕様の整理!$C:$P,2,0),VLOOKUP(AH$1,仕様の整理!$C:$P,2,0)&\"（\"&VLOOKUP(AH$1,仕様の整理!$C:$P,4,0)&\"）\")&IF(VLOOKUP(AH$1,仕様の整理!$C:$P,5,0)=\"○\",\"\",\"《新規登録技術》\")","v":"コンクリート劣化抑制表面含浸工 ジルコンパーミエイト　（事後評価済技術）"},null,{"$f":"IF(VLOOKUP(AJ$1,仕様の整理!$C:$P,4,0)=\"NETIS掲載期間終了技術\",VLOOKUP(AJ$1,仕様の整理!$C:$P,2,0),VLOOKUP(AJ$1,仕様の整理!$C:$P,2,0)&\"（\"&VLOOKUP(AJ$1,仕様の整理!$C:$P,4,0)&\"）\")&IF(VLOOKUP(AJ$1,仕様の整理!$C:$P,5,0)=\"○\",\"\",\"《新規登録技術》\")","v":"ザイペックス・液体タイプ 塗布・吹付工法（事後評価済技術）"},null,{"$f":"IF(VLOOKUP(AL$1,仕様の整理!$C:$P,4,0)=\"NETIS掲載期間終了技術\",VLOOKUP(AL$1,仕様の整理!$C:$P,2,0),VLOOKUP(AL$1,仕様の整理!$C:$P,2,0)&\"（\"&VLOOKUP(AL$1,仕様の整理!$C:$P,4,0)&\"）\")&IF(VLOOKUP(AL$1,仕様の整理!$C:$P,5,0)=\"○\",\"\",\"《新規登録技術》\")","v":"Sクリート工法（事後評価済技術）"},null,{"$f":"IF(VLOOKUP(AN$1,仕様の整理!$C:$P,4,0)=\"NETIS掲載期間終了技術\",VLOOKUP(AN$1,仕様の整理!$C:$P,2,0),VLOOKUP(AN$1,仕様の整理!$C:$P,2,0)&\"（\"&VLOOKUP(AN$1,仕様の整理!$C:$P,4,0)&\"）\")&IF(VLOOKUP(AN$1,仕様の整理!$C:$P,5,0)=\"○\",\"\",\"《新規登録技術》\")","v":"2液混合型けい酸塩系表面含浸材CS-21ビルダー（事後評価未実施技術）"},null,{"$f":"IF(VLOOKUP(AP$1,仕様の整理!$C:$P,4,0)=\"NETIS掲載期間終了技術\",VLOOKUP(AP$1,仕様の整理!$C:$P,2,0),VLOOKUP(AP$1,仕様の整理!$C:$P,2,0)&\"（\"&VLOOKUP(AP$1,仕様の整理!$C:$P,4,0)&\"）\")&IF(VLOOKUP(AP$1,仕様の整理!$C:$P,5,0)=\"○\",\"\",\"《新規登録技術》\")","v":"浸透性吸水防止材「マジカルリペラー」「マジカルリペラーHV」　"},null,{"$f":"IF(VLOOKUP(AR$1,仕様の整理!$C:$P,4,0)=\"NETIS掲載期間終了技術\",VLOOKUP(AR$1,仕様の整理!$C:$P,2,0),VLOOKUP(AR$1,仕様の整理!$C:$P,2,0)&\"（\"&VLOOKUP(AR$1,仕様の整理!$C:$P,4,0)&\"）\")&IF(VLOOKUP(AR$1,仕様の整理!$C:$P,5,0)=\"○\",\"\",\"《新規登録技術》\")","v":"コンクリート改質剤CS-21"},null,{"$f":"IF(VLOOKUP(AT$1,仕様の整理!$C:$P,4,0)=\"NETIS掲載期間終了技術\",VLOOKUP(AT$1,仕様の整理!$C:$P,2,0),VLOOKUP(AT$1,仕様の整理!$C:$P,2,0)&\"（\"&VLOOKUP(AT$1,仕様の整理!$C:$P,4,0)&\"）\")&IF(VLOOKUP(AT$1,仕様の整理!$C:$P,5,0)=\"○\",\"\",\"《新規登録技術》\")","v":"コンクリート浸透性改質材[RCガーデックス]（製品仕様：防水用、養生用、塩害用、タイル外壁用、CV（土木構造物向け））"},null,{"$f":"IF(VLOOKUP(AV$1,仕様の整理!$C:$P,4,0)=\"NETIS掲載期間終了技術\",VLOOKUP(AV$1,仕様の整理!$C:$P,2,0),VLOOKUP(AV$1,仕様の整理!$C:$P,2,0)&\"（\"&VLOOKUP(AV$1,仕様の整理!$C:$P,4,0)&\"）\")&IF(VLOOKUP(AV$1,仕様の整理!$C:$P,5,0)=\"○\",\"\",\"《新規登録技術》\")","v":"コンクリート浸透性改質材[RCガーデックス]（製品仕様：高炉用）"},null,{"$f":"IF(VLOOKUP(AX$1,仕様の整理!$C:$P,4,0)=\"NETIS掲載期間終了技術\",VLOOKUP(AX$1,仕様の整理!$C:$P,2,0),VLOOKUP(AX$1,仕様の整理!$C:$P,2,0)&\"（\"&VLOOKUP(AX$1,仕様の整理!$C:$P,4,0)&\"）\")&IF(VLOOKUP(AX$1,仕様の整理!$C:$P,5,0)=\"○\",\"\",\"《新規登録技術》\")","v":"鉄筋腐食抑制工法 「プロテクトシル CIT」"},null,{"$f":"IF(VLOOKUP(AZ$1,仕様の整理!$C:$P,4,0)=\"NETIS掲載期間終了技術\",VLOOKUP(AZ$1,仕様の整理!$C:$P,2,0),VLOOKUP(AZ$1,仕様の整理!$C:$P,2,0)&\"（\"&VLOOKUP(AZ$1,仕様の整理!$C:$P,4,0)&\"）\")&IF(VLOOKUP(AZ$1,仕様の整理!$C:$P,5,0)=\"○\",\"\",\"《新規登録技術》\")","v":"ザイペックス工法"},null,{"$f":"IF(VLOOKUP(BB$1,仕様の整理!$C:$P,4,0)=\"NETIS掲載期間終了技術\",VLOOKUP(BB$1,仕様の整理!$C:$P,2,0),VLOOKUP(BB$1,仕様の整理!$C:$P,2,0)&\"（\"&VLOOKUP(BB$1,仕様の整理!$C:$P,4,0)&\"）\")&IF(VLOOKUP(BB$1,仕様の整理!$C:$P,5,0)=\"○\",\"\",\"《新規登録技術》\")","v":"マクサム工法"},null,{"$f":"IF(VLOOKUP(BD$1,仕様の整理!$C:$P,4,0)=\"NETIS掲載期間終了技術\",VLOOKUP(BD$1,仕様の整理!$C:$P,2,0),VLOOKUP(BD$1,仕様の整理!$C:$P,2,0)&\"（\"&VLOOKUP(BD$1,仕様の整理!$C:$P,4,0)&\"）\")&IF(VLOOKUP(BD$1,仕様の整理!$C:$P,5,0)=\"○\",\"\",\"《新規登録技術》\")","v":"高粘性浸透性吸水防止材"},null,{"$f":"IF(VLOOKUP(BF$1,仕様の整理!$C:$P,4,0)=\"NETIS掲載期間終了技術\",VLOOKUP(BF$1,仕様の整理!$C:$P,2,0),VLOOKUP(BF$1,仕様の整理!$C:$P,2,0)&\"（\"&VLOOKUP(BF$1,仕様の整理!$C:$P,4,0)&\"）\")&IF(VLOOKUP(BF$1,仕様の整理!$C:$P,5,0)=\"○\",\"\",\"《新規登録技術》\")","v":"ケイ酸質リチウム系コンクリート改質剤「L-OSMO反応型SG」"},null,{"$f":"IF(VLOOKUP(BH$1,仕様の整理!$C:$P,4,0)=\"NETIS掲載期間終了技術\",VLOOKUP(BH$1,仕様の整理!$C:$P,2,0),VLOOKUP(BH$1,仕様の整理!$C:$P,2,0)&\"（\"&VLOOKUP(BH$1,仕様の整理!$C:$P,4,0)&\"）\")&IF(VLOOKUP(BH$1,仕様の整理!$C:$P,5,0)=\"○\",\"\",\"《新規登録技術》\")","v":"無溶剤タイプジェル状シラン系表面含浸材"},null,{"$f":"IF(VLOOKUP(BJ$1,仕様の整理!$C:$P,4,0)=\"NETIS掲載期間終了技術\",VLOOKUP(BJ$1,仕様の整理!$C:$P,2,0),VLOOKUP(BJ$1,仕様の整理!$C:$P,2,0)&\"（\"&VLOOKUP(BJ$1,仕様の整理!$C:$P,4,0)&\"）\")&IF(VLOOKUP(BJ$1,仕様の整理!$C:$P,5,0)=\"○\",\"\",\"《新規登録技術》\")","v":"珪酸塩系含浸コンクリート保護材"},null,{"$f":"IF(VLOOKUP(BL$1,仕様の整理!$C:$P,4,0)=\"NETIS掲載期間終了技術\",VLOOKUP(BL$1,仕様の整理!$C:$P,2,0),VLOOKUP(BL$1,仕様の整理!$C:$P,2,0)&\"（\"&VLOOKUP(BL$1,仕様の整理!$C:$P,4,0)&\"）\")&IF(VLOOKUP(BL$1,仕様の整理!$C:$P,5,0)=\"○\",\"\",\"《新規登録技術》\")","v":"省力施工型コンクリート改質・劣化防止剤「リアル・メンテ」"},null,{"$f":"IF(VLOOKUP(BN$1,仕様の整理!$C:$P,4,0)=\"NETIS掲載期間終了技術\",VLOOKUP(BN$1,仕様の整理!$C:$P,2,0),VLOOKUP(BN$1,仕様の整理!$C:$P,2,0)&\"（\"&VLOOKUP(BN$1,仕様の整理!$C:$P,4,0)&\"）\")&IF(VLOOKUP(BN$1,仕様の整理!$C:$P,5,0)=\"○\",\"\",\"《新規登録技術》\")","v":"シラン系含浸材とシラン・シロキサン系表面塗布材を併用した、コンクリート表面処理材（事後評価未実施技術）"},null,{"$f":"IF(VLOOKUP(BP$1,仕様の整理!$C:$P,4,0)=\"NETIS掲載期間終了技術\",VLOOKUP(BP$1,仕様の整理!$C:$P,2,0),VLOOKUP(BP$1,仕様の整理!$C:$P,2,0)&\"（\"&VLOOKUP(BP$1,仕様の整理!$C:$P,4,0)&\"）\")&IF(VLOOKUP(BP$1,仕様の整理!$C:$P,5,0)=\"○\",\"\",\"《新規登録技術》\")","v":"けい酸リチウム系混合型表面含浸材「RCガードCE TYPE-Li」（事後評価未実施技術）"},null,{"$f":"IF(VLOOKUP(BR$1,仕様の整理!$C:$P,4,0)=\"NETIS掲載期間終了技術\",VLOOKUP(BR$1,仕様の整理!$C:$P,2,0),VLOOKUP(BR$1,仕様の整理!$C:$P,2,0)&\"（\"&VLOOKUP(BR$1,仕様の整理!$C:$P,4,0)&\"）\")&IF(VLOOKUP(BR$1,仕様の整理!$C:$P,5,0)=\"○\",\"\",\"《新規登録技術》\")","v":"高性能シラン系含浸工法 「エルシーセイバー工法(RSⅡ)」 （事後評価未実施技術）"},null,{"$f":"IF(VLOOKUP(BT$1,仕様の整理!$C:$P,4,0)=\"NETIS掲載期間終了技術\",VLOOKUP(BT$1,仕様の整理!$C:$P,2,0),VLOOKUP(BT$1,仕様の整理!$C:$P,2,0)&\"（\"&VLOOKUP(BT$1,仕様の整理!$C:$P,4,0)&\"）\")&IF(VLOOKUP(BT$1,仕様の整理!$C:$P,5,0)=\"○\",\"\",\"《新規登録技術》\")","v":"高性能シラン系含浸工法 「エルシーセイバー工法(SFⅡ)」 （事後評価未実施技術）"},null,{"$f":"IF(VLOOKUP(BV$1,仕様の整理!$C:$P,4,0)=\"NETIS掲載期間終了技術\",VLOOKUP(BV$1,仕様の整理!$C:$P,2,0),VLOOKUP(BV$1,仕様の整理!$C:$P,2,0)&\"（\"&VLOOKUP(BV$1,仕様の整理!$C:$P,4,0)&\"）\")&IF(VLOOKUP(BV$1,仕様の整理!$C:$P,5,0)=\"○\",\"\",\"《新規登録技術》\")","v":"けい酸カリウムを主成分としたけい酸塩系表面含浸材(シリカリ)（事後評価未実施技術）"},null,{"$f":"IF(VLOOKUP(BX$1,仕様の整理!$C:$P,4,0)=\"NETIS掲載期間終了技術\",VLOOKUP(BX$1,仕様の整理!$C:$P,2,0),VLOOKUP(BX$1,仕様の整理!$C:$P,2,0)&\"（\"&VLOOKUP(BX$1,仕様の整理!$C:$P,4,0)&\"）\")&IF(VLOOKUP(BX$1,仕様の整理!$C:$P,5,0)=\"○\",\"\",\"《新規登録技術》\")","v":"けい酸塩系含浸コンクリート防水保護材「エバープロロング」（事後評価未実施技術）"},null,{"$f":"IF(VLOOKUP(BZ$1,仕様の整理!$C:$P,4,0)=\"NETIS掲載期間終了技術\",VLOOKUP(BZ$1,仕様の整理!$C:$P,2,0),VLOOKUP(BZ$1,仕様の整理!$C:$P,2,0)&\"（\"&VLOOKUP(BZ$1,仕様の整理!$C:$P,4,0)&\"）\")&IF(VLOOKUP(BZ$1,仕様の整理!$C:$P,5,0)=\"○\",\"\",\"《新規登録技術》\")","v":"カルシウム付与剤併用型表面含浸工法「プラスCa」（事後評価未実施技術）"},null,{"$f":"IF(VLOOKUP(CB$1,仕様の整理!$C:$P,4,0)=\"NETIS掲載期間終了技術\",VLOOKUP(CB$1,仕様の整理!$C:$P,2,0),VLOOKUP(CB$1,仕様の整理!$C:$P,2,0)&\"（\"&VLOOKUP(CB$1,仕様の整理!$C:$P,4,0)&\"）\")&IF(VLOOKUP(CB$1,仕様の整理!$C:$P,5,0)=\"○\",\"\",\"《新規登録技術》\")","v":"ポルトグラスⅡ工法（有用な新技術）"},null,{"$f":"IF(VLOOKUP(CD$1,仕様の整理!$C:$P,4,0)=\"NETIS掲載期間終了技術\",VLOOKUP(CD$1,仕様の整理!$C:$P,2,0),VLOOKUP(CD$1,仕様の整理!$C:$P,2,0)&\"（\"&VLOOKUP(CD$1,仕様の整理!$C:$P,4,0)&\"）\")&IF(VLOOKUP(CD$1,仕様の整理!$C:$P,5,0)=\"○\",\"\",\"《新規登録技術》\")","v":"シラン系とケイ酸塩系の特長を併せ持つハイブリッド型表面含浸材(サンハイドロックL2)（事後評価済技術）"},null,{"$f":"IF(VLOOKUP(CF$1,仕様の整理!$C:$P,4,0)=\"NETIS掲載期間終了技術\",VLOOKUP(CF$1,仕様の整理!$C:$P,2,0),VLOOKUP(CF$1,仕様の整理!$C:$P,2,0)&\"（\"&VLOOKUP(CF$1,仕様の整理!$C:$P,4,0)&\"）\")&IF(VLOOKUP(CF$1,仕様の整理!$C:$P,5,0)=\"○\",\"\",\"《新規登録技術》\")","v":"亜硝酸リチウム併用型表面含浸工法 「プロコンガードシステムS」（事後評価未実施技術）"},null,{"$f":"IF(VLOOKUP(CH$1,仕様の整理!$C:$P,4,0)=\"NETIS掲載期間終了技術\",VLOOKUP(CH$1,仕様の整理!$C:$P,2,0),VLOOKUP(CH$1,仕様の整理!$C:$P,2,0)&\"（\"&VLOOKUP(CH$1,仕様の整理!$C:$P,4,0)&\"）\")&IF(VLOOKUP(CH$1,仕様の整理!$C:$P,5,0)=\"○\",\"\",\"《新規登録技術》\")","v":"セラグリーンNK（事後評価未実施技術）"},null,{"$f":"IF(VLOOKUP(CJ$1,仕様の整理!$C:$P,4,0)=\"NETIS掲載期間終了技術\",VLOOKUP(CJ$1,仕様の整理!$C:$P,2,0),VLOOKUP(CJ$1,仕様の整理!$C:$P,2,0)&\"（\"&VLOOKUP(CJ$1,仕様の整理!$C:$P,4,0)&\"）\")&IF(VLOOKUP(CJ$1,仕様の整理!$C:$P,5,0)=\"○\",\"\",\"《新規登録技術》\")","v":"施工省力化けい酸塩系表面含浸材RCガーデックス土木用（有用な新技術）"},null,{"$f":"IF(VLOOKUP(CL$1,仕様の整理!$C:$P,4,0)=\"NETIS掲載期間終了技術\",VLOOKUP(CL$1,仕様の整理!$C:$P,2,0),VLOOKUP(CL$1,仕様の整理!$C:$P,2,0)&\"（\"&VLOOKUP(CL$1,仕様の整理!$C:$P,4,0)&\"）\")&IF(VLOOKUP(CL$1,仕様の整理!$C:$P,5,0)=\"○\",\"\",\"《新規登録技術》\")","v":"撥水作用を付与したオールインワンのコンクリート表面含浸剤（事後評価済技術）"},null,{"$f":"IF(VLOOKUP(CN$1,仕様の整理!$C:$P,4,0)=\"NETIS掲載期間終了技術\",VLOOKUP(CN$1,仕様の整理!$C:$P,2,0),VLOOKUP(CN$1,仕様の整理!$C:$P,2,0)&\"（\"&VLOOKUP(CN$1,仕様の整理!$C:$P,4,0)&\"）\")&IF(VLOOKUP(CN$1,仕様の整理!$C:$P,5,0)=\"○\",\"\",\"《新規登録技術》\")","v":"IZW.Shield（塗布後の養生時間が2時間のシラン系表面含浸材）（事後評価未実施技術）"},null,{"$f":"IF(VLOOKUP(CP$1,仕様の整理!$C:$P,4,0)=\"NETIS掲載期間終了技術\",VLOOKUP(CP$1,仕様の整理!$C:$P,2,0),VLOOKUP(CP$1,仕様の整理!$C:$P,2,0)&\"（\"&VLOOKUP(CP$1,仕様の整理!$C:$P,4,0)&\"）\")&IF(VLOOKUP(CP$1,仕様の整理!$C:$P,5,0)=\"○\",\"\",\"《新規登録技術》\")","v":"ケイ酸塩系表面浸透材 エバークリート ベトロフルード（事後評価未実施技術）"},null,{"$f":"IF(VLOOKUP(CR$1,仕様の整理!$C:$P,4,0)=\"NETIS掲載期間終了技術\",VLOOKUP(CR$1,仕様の整理!$C:$P,2,0),VLOOKUP(CR$1,仕様の整理!$C:$P,2,0)&\"（\"&VLOOKUP(CR$1,仕様の整理!$C:$P,4,0)&\"）\")&IF(VLOOKUP(CR$1,仕様の整理!$C:$P,5,0)=\"○\",\"\",\"《新規登録技術》\")","v":"けい酸塩系表面含浸材を塗布した表面被覆材を用いた表面処理工法《インフララップ》（事後評価未実施技術）"},null,{"$f":"IF(VLOOKUP(CT$1,仕様の整理!$C:$P,4,0)=\"NETIS掲載期間終了技術\",VLOOKUP(CT$1,仕様の整理!$C:$P,2,0),VLOOKUP(CT$1,仕様の整理!$C:$P,2,0)&\"（\"&VLOOKUP(CT$1,仕様の整理!$C:$P,4,0)&\"）\")&IF(VLOOKUP(CT$1,仕様の整理!$C:$P,5,0)=\"○\",\"\",\"《新規登録技術》\")","v":"シラン・シロキサン系複合超高濃度含浸材を用いた親水性工法（事後評価未実施技術）"},null,{"$f":"IF(VLOOKUP(CV$1,仕様の整理!$C:$P,4,0)=\"NETIS掲載期間終了技術\",VLOOKUP(CV$1,仕様の整理!$C:$P,2,0),VLOOKUP(CV$1,仕様の整理!$C:$P,2,0)&\"（\"&VLOOKUP(CV$1,仕様の整理!$C:$P,4,0)&\"）\")&IF(VLOOKUP(CV$1,仕様の整理!$C:$P,5,0)=\"○\",\"\",\"《新規登録技術》\")","v":"含浸系吸水防止材「ペネトラントシラン」（事後評価未実施技術）"},null,{"$f":"IF(VLOOKUP(CX$1,仕様の整理!$C:$P,4,0)=\"NETIS掲載期間終了技術\",VLOOKUP(CX$1,仕様の整理!$C:$P,2,0),VLOOKUP(CX$1,仕様の整理!$C:$P,2,0)&\"（\"&VLOOKUP(CX$1,仕様の整理!$C:$P,4,0)&\"）\")&IF(VLOOKUP(CX$1,仕様の整理!$C:$P,5,0)=\"○\",\"\",\"《新規登録技術》\")","v":"ナノシリカ系表面含浸材　コンクリートリバイブ　CPT-2000（事後評価未実施技術）《新規登録技術》"},null,{"$f":"IF(VLOOKUP(CZ$1,仕様の整理!$C:$P,4,0)=\"NETIS掲載期間終了技術\",VLOOKUP(CZ$1,仕様の整理!$C:$P,2,0),VLOOKUP(CZ$1,仕様の整理!$C:$P,2,0)&\"（\"&VLOOKUP(CZ$1,仕様の整理!$C:$P,4,0)&\"）\")&IF(VLOOKUP(CZ$1,仕様の整理!$C:$P,5,0)=\"○\",\"\",\"《新規登録技術》\")","v":"鉄筋腐食抑制型シラン系表面含浸材「アクアシール1400AR」（事後評価未実施技術）"},null,{"$f":"IF(VLOOKUP(DB$1,仕様の整理!$C:$P,4,0)=\"NETIS掲載期間終了技術\",VLOOKUP(DB$1,仕様の整理!$C:$P,2,0),VLOOKUP(DB$1,仕様の整理!$C:$P,2,0)&\"（\"&VLOOKUP(DB$1,仕様の整理!$C:$P,4,0)&\"）\")&IF(VLOOKUP(DB$1,仕様の整理!$C:$P,5,0)=\"○\",\"\",\"《新規登録技術》\")","v":"シラン系けい酸リチウムハイブリット型表面含侵材ドライプロテクト（事後評価未実施技術）"},null,{"$f":"IF(VLOOKUP(DD$1,仕様の整理!$C:$P,4,0)=\"NETIS掲載期間終了技術\",VLOOKUP(DD$1,仕様の整理!$C:$P,2,0),VLOOKUP(DD$1,仕様の整理!$C:$P,2,0)&\"（\"&VLOOKUP(DD$1,仕様の整理!$C:$P,4,0)&\"）\")&IF(VLOOKUP(DD$1,仕様の整理!$C:$P,5,0)=\"○\",\"\",\"《新規登録技術》\")","v":"Protec No.1 高分子系コンクリート劣化防止剤（事後評価未実施技術）"},null,{"$f":"IF(VLOOKUP(DF$1,仕様の整理!$C:$P,4,0)=\"NETIS掲載期間終了技術\",VLOOKUP(DF$1,仕様の整理!$C:$P,2,0),VLOOKUP(DF$1,仕様の整理!$C:$P,2,0)&\"（\"&VLOOKUP(DF$1,仕様の整理!$C:$P,4,0)&\"）\")&IF(VLOOKUP(DF$1,仕様の整理!$C:$P,5,0)=\"○\",\"\",\"《新規登録技術》\")","v":"高機能表面含浸材　Jシールド（事後評価未実施技術）"}]
[null,"①","ＮＥＴＩＳ登録番号",null,null,"NETIS掲載期間終了技術",null,"NETIS掲載期間終了技術",null,"NETIS掲載期間終了技術",null,"NETIS掲載期間終了技術",null,"NETIS掲載期間終了技術",null,"NETIS掲載期間終了技術",null,"NETIS掲載期間終了技術",null,"NETIS掲載期間終了技術",null,"NETIS掲載期間終了技術",null,"CB-150008-VR",null,"QS-150019-VE",null,"SK-160004-VR",null,"SK-160004-VR",null,"CG-160013-VE",null,"QS-160027-VR",null,"KT-160039-VR",null,"KT-160122-VR",null,"CG-170009-A",null,"NETIS掲載期間終了技術",null,"NETIS掲載期間終了技術",null,"NETIS掲載期間終了技術",null,"NETIS掲載期間終了技術",null,"NETIS掲載期間終了技術",null,"NETIS掲載期間終了技術",null,"NETIS掲載期間終了技術",null,"NETIS掲載期間終了技術",null,"NETIS掲載期間終了技術",null,"NETIS掲載期間終了技術",null,"NETIS掲載期間終了技術",null,"NETIS掲載期間終了技術",null,"KT-180004-A",null,"KT-180024-A",null,"QS-180010-A",null,"QS-180010-A",null,"CB-180026-A",null,"KT-180083-A",null,"KT-180101-A",null,"CB-190016-VE",null,"CB-190021-VE",null,"CG-190024-A",null,"KT-190081-A",null,"KT-190107-VE",null,"SK-200001-VR",null,"CB-200002-A",null,"OK-200001-A",null,"TH-200005-A",null,"KK-220004-A",null,"KT-220204-A",null,"KT-220245-A",null,"KK-230014-A",null,"HK-230010-A",null,"KT-230139-A",null,"KT-230268-A"]
[null,"②","技術の位置付け（有用な新技術）",null,null,{"$f":"VLOOKUP(F2,条件!$I:$J,2,0)","v":0},null,{"$f":"VLOOKUP(H2,条件!$I:$J,2,0)","v":0},null,{"$f":"VLOOKUP(J2,条件!$I:$J,2,0)","v":0},null,{"$f":"VLOOKUP(L2,条件!$I:$J,2,0)","v":0},null,{"$f":"VLOOKUP(N2,条件!$I:$J,2,0)","v":0},null,{"$f":"VLOOKUP(P2,条件!$I:$J,2,0)","v":0},null,{"$f":"VLOOKUP(R2,条件!$I:$J,2,0)","v":0},null,{"$f":"VLOOKUP(T2,条件!$I:$J,2,0)","v":0},null,{"$f":"VLOOKUP(V2,条件!$I:$J,2,0)","v":0},null,{"$f":"VLOOKUP(X2,条件!$I:$J,2,0)","v":0},null,{"$f":"VLOOKUP(Z2,条件!$I:$J,2,0)","v":0},null,{"$f":"VLOOKUP(AB2,条件!$I:$J,2,0)","v":0},null,{"$f":"VLOOKUP(AD2,条件!$I:$J,2,0)","v":0},null,{"$f":"VLOOKUP(AF2,条件!$I:$J,2,0)","v":0},null,{"$f":"VLOOKUP(AH2,条件!$I:$J,2,0)","v":0},null,{"$f":"VLOOKUP(AJ2,条件!$I:$J,2,0)","v":0},null,{"$f":"VLOOKUP(AL2,条件!$I:$J,2,0)","v":0},null,{"$f":"VLOOKUP(AN2,条件!$I:$J,2,0)","v":0},null,{"$f":"VLOOKUP(AP2,条件!$I:$J,2,0)","v":0},null,{"$f":"VLOOKUP(AR2,条件!$I:$J,2,0)","v":0},null,{"$f":"VLOOKUP(AT2,条件!$I:$J,2,0)","v":0},null,{"$f":"VLOOKUP(AV2,条件!$I:$J,2,0)","v":0},null,{"$f":"VLOOKUP(AX2,条件!$I:$J,2,0)","v":0},null,{"$f":"VLOOKUP(AZ2,条件!$I:$J,2,0)","v":0},null,{"$f":"VLOOKUP(BB2,条件!$I:$J,2,0)","v":0},null,{"$f":"VLOOKUP(BD2,条件!$I:$J,2,0)","v":0},null,{"$f":"VLOOKUP(BF2,条件!$I:$J,2,0)","v":0},null,{"$f":"VLOOKUP(BH2,条件!$I:$J,2,0)","v":0},null,{"$f":"VLOOKUP(BJ2,条件!$I:$J,2,0)","v":0},null,{"$f":"VLOOKUP(BL2,条件!$I:$J,2,0)","v":0},null,{"$f":"VLOOKUP(BN2,条件!$I:$J,2,0)","v":0},null,{"$f":"VLOOKUP(BP2,条件!$I:$J,2,0)","v":0},null,{"$f":"VLOOKUP(BR2,条件!$I:$J,2,0)","v":0},null,{"$f":"VLOOKUP(BT2,条件!$I:$J,2,0)","v":0},null,{"$f":"VLOOKUP(BV2,条件!$I:$J,2,0)","v":0},null,{"$f":"VLOOKUP(BX2,条件!$I:$J,2,0)","v":0},null,{"$f":"VLOOKUP(BZ2,条件!$I:$J,2,0)","v":0},null,{"$f":"VLOOKUP(CB2,条件!$I:$J,2,0)","v":0},null,{"$f":"VLOOKUP(CD2,条件!$I:$J,2,0)","v":0},null,{"$f":"VLOOKUP(CF2,条件!$I:$J,2,0)","v":0},null,{"$f":"VLOOKUP(CH2,条件!$I:$J,2,0)","v":0},null,{"$f":"VLOOKUP(CJ2,条件!$I:$J,2,0)","v":0},null,{"$f":"VLOOKUP(CL2,条件!$I:$J,2,0)","v":0},null,{"$f":"VLOOKUP(CN2,条件!$I:$J,2,0)","v":0},null,{"$f":"VLOOKUP(CP2,条件!$I:$J,2,0)","v":0},null,{"$f":"VLOOKUP(CR2,条件!$I:$J,2,0)","v":0},null,{"$f":"VLOOKUP(CT2,条件!$I:$J,2,0)","v":0},null,{"$f":"VLOOKUP(CV2,条件!$I:$J,2,0)","v":0},null,{"$f":"VLOOKUP(CX2,条件!$I:$J,2,0)","v":0},null,{"$f":"VLOOKUP(CZ2,条件!$I:$J,2,0)","v":0},null,{"$f":"VLOOKUP(DB2,条件!$I:$J,2,0)","v":0},null,{"$f":"VLOOKUP(DD2,条件!$I:$J,2,0)","v":0},null,{"$f":"VLOOKUP(DF2,条件!$I:$J,2,0)","v":0}]
[null,"③","開発者（本社が存在する都道府県）",null,null,"(株)ディ・アンド・ディほか（三重県)",null,"株式会社リバコンテック(東京都)",null,"ショーボンド建設株式会社(東京都)",null,"株式会社アールシージージャパン（大阪府）",null,"住友大阪セメント株式会社(東京都)",null,"大日本塗料株式会社(大阪府)",null,"エボニック・デグサ・ジャパン株式会社(東京都)",null,"ショーボンド建設株式会社（東京都）",null,"株式会社セントラルコンクリート(東京都)",null,"有限会社タートル（千葉県）",null,"株式会社 スーパーシールド（鹿児島県）",null,"馬居化成工業株式会社（徳島県）",null,"馬居化成工業株式会社（徳島県）",null,"株式会社アストン（岡山県）",null,"株式会社フォーシェル（東京都）",null,"株式会社日本ザイペックス（東京都）",null,"株式会社バークス環境（東京都）",null,"株式会社アストン（岡山県）",null,"カジマ・リノベイト 株式会社ほか(東京都)",null,"株式会社アストン（岡山県）",null,"日本躯体処理株式会社（埼玉県）",null,"日本躯体処理株式会社（埼玉県）",null,"エボニック・デグサ・ジャパン株式会社(東京都)",null,"ジャパン・ザイペックス株式会社（東京都）",null,"株式会社アイレックス( 東京都 )",null,"株式会社 クリテック・ジャパン(東京都)",null,"株式会社リナックオズモ（東京都）※令和5年8月社名変更",null,"大同塗料株式会社(大阪府)",null,"株式会社エバープロテクト（東京都）",null,"丸和バイオケミカル株式会社（東京都）",null,"株式会社エム&エムトレーディング（東京都）",null,"株式会社エービーシー商会（東京都）",null,"宇部興産建材株式会社（東京都、山口県）",null,"宇部興産建材株式会社（東京都、山口県）",null,"住環境創建株式会社（静岡県）",null,"日本プロロング株式会社（東京都）",null,"株式会社エービーシー商会（東京都）",null,"富士化学株式会社（大阪府）",null,"三商株式会社（愛知県）",null,"福徳技研株式会社（広島県）",null,"株式会社グリーンドゥ（東京都）",null,"日本躯体処理株式会社（埼玉県）",null,"馬居化成工業株式会社（徳島県）",null,"泉左官住設株式会社（岐阜県）",null,"Ecobeton Europe S.r.l. (エコベトンヨーロッパ有限会社)(国内：エコベトン・ジャパン株式会社）(東京都）",null,"株式会社ｔｓｃ（岩手県）、株式会社スガワラ（宮城県）",null,"株式会社OSHIROX（大阪府）",null,"株式会社クラタテクノシステム(東京都）",null,"AQURON CORPORATION、株式会社エフ・エス・エル（千葉県）",null,"大同塗料株式会社(大阪府）、中日本ハイウェイ・エンジニアリング東京株式会社(東京都）",null,"株式会社エイムス（北海道）",null,"北京華夏先河新材料有限公司（海外メーカー）【国内：株式会社オフィスパルネットクリエート（東京都）】",null,"JFE商事テールワン株式会社（東京都）、旭化成アドバンス株式会社（東京都）"]
[null,"④","開発者における九州地方との関連性（九州登録九州本社：◎、九州外登録九州本社：○、九州に共同開発者有り：△、その他：－）",null,null,"-",null,"-",null,"-",null,"-",null,"-",null,"-",null,"-",null,"-",null,"-",null,"-",null,"◎",null,"-",null,"-",null,"-",null,"△（九州に共同開発者有り）",null,"-",null,"-",null,"-",null,"-",null,"-",null,"-",null,"-",null,"-",null,"-",null,"-",null,"-",null,"-",null,"-",null,"-",null,"-",null,"-",null,"-",null,"-",null,"-",null,"-",null,"-",null,"-",null,"-",null,"-",null,"-",null,"-",null,"-",null,"-",null,"-",null,"-",null,"-",null,"-",null,"-",null,"-",null,"-",null,"-",null,"-",null,"-"]
[null,"⑤","九州地方への機能性（九州地方に支店等を有する場合：○、その他：－）",null,null,"-",null,"-",null,"〇【九州管内に支店】",null,"○【販売総代理店（東京都）が九州管内に支店】",null,"〇【九州管内に支店】",null,"〇【九州管内に営業所】",null,"○【九州管内に事業所】",null,"〇【九州管内に支店】",null,"○【九州管内に営業所】",null,"○（九州管内に施工業者有り）",null,"○",null,"-",null,"-",null,"○（九州地方に工法協会の会員企業）",null,"○（九州管内に営業所有り）",null,"○（九州管内に工法協会の会員企業あり）",null,"-",null,"○（九州地方に工法協会の会員企業）",null,"〇【九州管内に営業所】",null,"○【九州管内に工法協会の会員企業】",null,"-",null,"-",null,"○【九州管内に事業所】",null,"○【九州管内に工法協会の会員企業あり】",null,"-",null,"○【九州管内に代理店】",null,"○【九州管内に販売代理店あり】",null,"〇【九州管内に営業所】",null,"-",null,"○【九州管内に営業所】",null,"-",null,"○（九州地方に営業所を有する）",null,"○（九州地方に支店を有する）",null,"○（九州地方に支店を有する）",null,"-",null,"-",null,"○（九州地方に営業所を有する）",null,"○（九州地方に営業所を有する）",null,"-",null,"-",null,"-",null,"-",null,"-",null,"-",null,"-",null,"-",null,"-",null,"-",null,"-",null,"○（九州地方に支店等を有する）",null,"-",null,"-",null,"○（九州地方に支店等を有する）"]
[null,"⑥","技術概要",null,null,"「パーミエイトHS-300」をコンクリートの表面保護に適用することにより、中性化・塩害・凍害・アルカリ骨材反応などを大きく抑制する。形成される塗膜は無機系であるため紫外線による劣化が無く、有機溶剤を使用しないためVOC発生を抑制し環境負荷を低減できる。",null,"本技術は、高浸透性のコンクリート改質剤で、従来は無機・有機複合コーティング材で対応していた。本技術の活用により、コンクリート内部の緻密化が図れ、外的劣化要因からコンクリート構造物を保護し、耐久性向上が図れます。",null,"本技術は、半透明のシラン系表面含浸材をローラーバケ、又は刷毛で1回塗布するだけで、コンクリート表面に緻密なシリコーンポリマー保護層を形成します。この保護層は、透水・吸水を防ぎ、鉄筋を保護し、コンクリートの劣化を抑制します。",null,"本技術は主成分の粒子コロイド(けい酸ナトリウム・けい酸カリウム)の物理的作用と化学反応(C-S-Hゲルの生成)によりコンクリート躯体を保護する技術です。従来は有機系の塗膜によって保護していた。本技術の活用によりコスト縮減、工期短縮、品質の向上が期待できる。",null,"本技術は、特殊アルコキシシランを使用したコンクリート表面改質工法である。従来は、複層に材料を塗布する事で塩害・アルカリ骨材反応・中性化を抑制していた。本技術の活用により、単層塗布でも硬化後、無機系ポリマーになるため長期に渡り各抑制効果が期待できる。",null,"本技術はコンクリート表層部の組織を改質することで撥水効果が得られる。同時に表面からの水分、塩分等の浸入を防ぐことで、コンクリート構造物の塩害、凍害、中性化などによる劣化進行を抑制する。また、簡便な施工であり維持管理コストの低減が期待できる。",null,"本技術は、塩害・凍害・アルカリ骨材反応等によるコンクリートの劣化を防止する技術であり、従来は有機系表面被覆工法で対応していた。本技術の活用により、工事費の低減及び工期短縮が期待できる。",null,"本技術は、施工時に反応促進剤を混合する2液性のけい酸塩系表面含浸材で、従来は1液性のけい酸塩系表面含浸材で対応していた。本技術の活用により、1回の塗布回数で施工できるため、施工性が良くなり、工期の短縮、経済性の向上が図れる。  ",null,"本技術は コンクリート表面保護に用いる散水養生不要のケイ酸塩系含浸材であり、従来は 散水養生を必要とするケイ酸塩系含浸材で対応していた。本技術の活用により、カリウムの反応促進作用により 散水養生が不要となるため、施工性の向上と 経済性の向上が得られる。",null,"本技術は、①コンクリート表面に浸透性常温安定ガラス生成剤を含浸させ、空げき充填し、表層部を緻密化。②UVカットポリシロキサン撥水剤により撥水層を形成。③この2つの浸透系改質剤により、新設、既設を問わず、長期にわたり劣化因子の侵入を抑制、表層部を緻密化する。",null,"けい酸塩系ナトリウムのコンクリート表面含浸材でコンクリートに無機コロイドゾルが浸透して、毛細孔、ひび割れなどに浸透して緻密化とし、コンクリートの劣化防止、鉄筋の腐食抑制など、耐久性を向上させる。",null,"本技術は表面含浸剤で、従来はエポキシ樹脂等による表面被覆工法で対応していた。本技術の活用により大幅なコストダウン及び工程の削減が図れる。 ",null,"本技術はカルシウム補助剤併用の表面含浸剤で、従来はエポキシ樹脂等による表面被覆工法で対応していた。本技術の活用により大幅なコストダウン及び工程の削減が図れる。 ",null,"新設コンクリート構造物の表面保護に最適で、施工性が良好な反応型けい酸塩系表面含浸材。施工は清掃後の表面に材料を1回塗布のみで散水は不要。継続的な微細空隙の充填効果により、かぶりを健全に保ち鋼材腐食を抑制。更なる品質向上、耐久性向上、長寿命化に寄与する。",null,"本工法は、コンクリート表面に回収水を再利用した改質促進材(特殊Ca水溶液)を塗布し、反応型けい酸塩系表面含浸材を塗布することで、混合セメント(高炉セメント、フライアッシュセメント等)を使用したコンクリート等に対して高い劣化因子抑制効果を発揮できる。",null,"本技術は、躯体コンクリート表面に塗布、あるいは吹付けすることでコンクリートの防水性能を高める防水工法であり、従来はシート防水で対応していた。本技術の活用により、コスト縮減、工期短縮、耐久性と安全性の向上が図れ、景観を損ねずに防水の施工が可能になった。",null,"本技術は、コンクリートの耐久性と長寿命化を向上させる複合含浸工法で、従来は、コンクリートに被膜する有機系被膜工法で対応していた。本技術の活用により、施工手順の削減と、湿潤下でも含浸材が内部に深く浸透するため、工程の短縮、経済性、品質の向上が図られる。",null,"2液混合型の反応型けい酸塩系表面含浸材。混合液塗布のみで、散水を伴う工程不要。水酸化カルシウムを補給した上で、微細空隙の継続的な充填性を保持。中性化したコンクリート表層部を緻密化し、水や劣化因子の侵入を長期間抑制。構造物を長寿命化させる表面保護工法。",null,"本技術はマジカルリペラーやマジカルリペラーHVを塗布することでコンクリートの劣化進行を遅らせる技術で、従来は表面被覆工法で対応していた。本技術の活用により施工費を低減及び耐久性効果を長期化し、初期コスト及びライフサイクルコストの低減が期待できる。",null,"けい酸塩系表面含浸材に分類される無機質で無色透明な水溶液。硬化したコンクリートに含浸させ健全部およびひび割れ内面の表層部を緻密にし、防水・劣化抑制効果を発揮する。躯体防水、表面保護、ひび割れ補修、漏水部の止水、打継ぎ部および木コン部防水処理等に有効。",null,"本技術はコンクリートを改質し、長寿命化を図る技術で、従来は対応する技術はなかった。本技術の活用によりコンクリートを改質し、躯体防水・耐久性向上・塩害防止・凍害防止・強度向上・クラック防止・エフロ防止・漏水部の止水が期待できる。",null,"本技術はコンクリートを改質し、長寿命化を図る技術で、従来は対応する技術はなかった。本技術の活用によりコンクリートを改質し、躯体防水・耐久性向上・塩害防止・凍害防止・強度向上・クラック防止・エフロ防止・漏水部の止水が期待できる。",null,"プロテクトシルCITは、含浸系表面保護材で、コンクリート表面に塗布する事によりコンクリート中の鉄筋の腐食電流を低減し鉄筋の腐食を抑制する。",null,"ザイペックス工法は、コンクリート内部の空隙やひび割れなどの欠陥部にセメント結晶を増殖することでコンクリートを緻密化し、水や有害物質の浸透を遮断し、耐久性を向上させるコンクリート改質工法である。アル骨反応・中性化・塩害抑止、防水などに大きな効果がある。",null,"ケイ酸アルカリ性の複合化合物と高反応触媒を主成分とする無色透明な水溶液。コンクリート、石材等の基材中の遊離アルカリ、シリカ質と反応して基材内部の空隙を硝子質の疎水性結晶で埋めて水の浸入を防ぎ、中性化、塩害、凍害を防止し、耐久性、安定性を大幅に向上させる",null,"本技術はコンクリート構造物等に高粘性浸透性吸水防止材(シラン系表面含浸材)を使用する表面保護工法であり、従来は表面被覆工法で対応していた。本技術の活用によりコスト縮減、塩害に対する耐久性の向上が期待できる。また鉄筋の腐食抑制効果も確認された。",null,"表面被覆工法に比べ工程の短縮、施工性、経済性の向上を可能にした。けい酸塩混合型、けい酸ナトリウム、けい酸リチウムを主成分とした3タイプ(Osmo、Osmo-xp、Osmo-kk)の表面含浸材がある。",null,"本技術はシラン系表面含浸材によるコンクリート保護に関するもので、従来は表面被覆材で対応していた。本技術の活用によりコンクリート構造物を簡便に、低コストで、長期間水や塩分などの劣化因子から保護し、コンクリート構造物の耐久性向上と景観維持が期待できる。",null,"本技術は、珪酸塩コロイド粒子の特性を生かした浸透性コンクリート保護材です。従来は有機系の塗膜によってコンクリート構造物を保護してきましたが、本技術の活用により、ライフサイクルコストの低減とコンクリート構造物の長寿命化を果たすことが出来ます。",null,"本技術は省力施工型コンクリート改質・劣化防止剤「リアル・メンテ」で、従来はケイ酸塩系表面含浸材により対応していた。本技術の活用によりケイ酸塩類浸透量の向上化、散水養生の不要化がなされ、コスト縮減・生産性向上が期待出来る。",null,"本技術は、シラン系含浸材とシラン・シロキサン系表面塗布材の併用(2層構造)によるコンクリート表面保護技術で、従来は含浸工(シラン系含浸材の単層構造処理)であった。本技術の活用により、異なる処理材の併用が可能となり、耐久性が向上し品質の向上が図れる。",null,"本技術は新設、既設コンクリート構造物に塗布することで、表層部を緻密化するけい酸リチウム系混合型表面含浸工法で、従来は表面被覆工法で対応していた。本技術の活用により、塩害、凍害、中性化の抑止効果が得られ、コンクリートの耐久性が向上し、品質の向上が図れます。",null,"本技術は、従来のシラン系含浸材より浸透性が高く、施工時にダレ難くい材料を使用する工法であるため、所定量を1回で塗布できるとともに、施工が容易で工期短縮によりコスト縮減が期待できる。",null,"本技術は、従来のシラン系含浸材より浸透性が高く、施工時にダレ難くい材料を使用する工法であるため、所定量を1回で塗布できるとともに、施工が容易で工期短縮によりコスト縮減が期待できる。",null,"添加剤の配合比率を変更したことで、浸透性が向上し、表面に残らず白化が目立たない工法。塗布後の散水洗浄不要で、工期短縮・コストダウンにつながり、含浸材の溶出もなくなり環境への影響も低減可能。また、よりコンクリート構造物を緻密化し、優れた止水性能を有する。",null,"本技術はナノ粒子最適モル比による高含浸型けい酸塩系コンクリート表面含浸保護材で、従来は一般的なけい酸塩系表面含浸保護材で対応していた。本技術の活用により塗布面の保護層厚が従来より大きくなり、品質が向上し、かつ経済性が向上する。",null,"本技術は、既設構造物や混合セメントなどカルシウムが不足したコンクリートに塗布することで、表層部を緻密化するカルシウム付与剤併用型表面含浸工法で、従来は表面被覆工法で対応していた。本技術の活用により、表面含浸材本来の性能が発揮され、品質の向上が図れます。",null,"本技術は、組成の最適化と高濃度化を実現した新規の反応型けい酸塩系表面含浸材。より緻密なゲルを形成することで、従来よりも高い劣化因子の抑制効果を発揮し、特に遮水性・遮塩性・ひび割れ閉塞性・含浸性に優れる。塗布回数は1回となり、施工工程・コストも低減。",null,"本技術は表面を疎水化しながら空隙の閉塞を同時に行うことで高い長寿命化効果を持つハイブリッド型表面含浸材である。従来のシラン系とケイ酸塩系の特長を併せ持っている。本技術を使用すればどのような現場でも高い保護効果を発揮することが期待できる。",null,"本技術は、亜硝酸リチウムとシラン・シロキサン系含浸材を組み合わせた亜硝酸リチウム併用型表面含浸工法である。シラン・シロキサンによる劣化因子の遮断に加え、亜硝酸リチウムによる鉄筋腐食抑制効果とアルカリシリカゲル膨張抑制効果を付加価値として備えている。",null,"本技術は、コンクリート表面の改質強度を上げる超微粒子シリカを含有するケイ酸質系表面改質材で、従来は超微粒子シリカが非含有のケイ酸質系表面改質材だった。本技術の活用により、コンクリート表面に塗布した際改質強度が上がりの品質の向上が図れます。",null,"本技術はコンクリート構造物の表面含浸工に用いる散水工程を不要とした含浸材で従来は散水工程が必須であるけい酸塩系表面含浸材で対応していた。本技術の活用により散水及び2回目塗布工程を省略して施工ができるため、施工性の向上、経済性の向上及び工程の短縮が図れる。",null,"本技術は、1液の塗布でコンクリート表層部の品質を改善し耐久性の向上を図る1液型のけい酸塩系表面含浸剤である。従来では表面含浸剤と補助剤の2液を別々に塗布する必要があったが、本技術を活用することで材工費の削減による経済性の向上や工程の短縮が図れる。",null,"本技術は塗布後2時間養生で疎水層が形成されるシラン系表面含浸材で、従来のシラン系表面含浸材は塗布後４～２４時間程度の養生が必要だった。本技術の活用により晴日が連続しにくい雨季等の工程管理がしやすくなり、急激な降雨による再塗布の確率も低下する。",null,"コンクリート構造物に塗布することで、コンクリート表層部の空隙を緻密化し、防水、 表面強度向上等の効果を発揮し、 コンクリート構造物の延命化を図るケイ酸塩系技術。",null,"　本技術は、けい酸塩系表面含浸材を塗布した表面被覆材にコンクリート面を張付け、水和反応を促進させる湿潤養生後に表面被覆材を撤去する工法で、従来はけい酸塩系表面含浸工法で対応していた。本技術の活用により、コスト縮減が図られ、品質の均一性が向上する。",null,"本技術は、シラン・シロキサン系複合超高濃度含浸材と親水化剤によるコンクリート表面保護工法の技術であり、従来はシラン系表面含浸材であった。本技術の活用により、耐久性向上による品質向上、経済性向上が期待できる。",null,"本技術は、コンクリート構造物の劣化進行を抑制できる、有機溶剤を含まない無溶剤型のシラン系表面含浸材で、従来は、表面被覆工（コンクリート保護工）で対応していた。本技術の活用により、使用する材料が１種類となり、作業工程を低減できるため、工程の短縮が図れる。",null,"本技術は、ナノシリカ系コンクリート含浸材で、従来はけい酸塩系コンクリート表面含浸材で対応していた。本技術の活用により、含浸剤の塗布前に行う散水作業が不要となるため施工性が向上し工期の短縮が図れる。",null,"本技術は、コンクリート構造物の鉄筋腐食抑制効果を高めたい際に用いるシラン系表面含浸材で、従来は鉄筋腐食抑制効果を付与する亜硝酸リチウム水溶液とシラン系表面含浸材で対応していた。本技術の活用により、材料費や工程数が減少し、経済性の向上が図れる。",null,"本技術は、シラン系・けい酸塩系のハイブリット型含侵材で、従来は表面含浸工（シラン系表面含侵材）で対応していた。本技術の活用により品質、経済性、施工性が向上し、工程が少なく工期の短縮が期待できる。",null,"本技術はシラン系のシリコーンとケイ酸塩系のオルトケイ酸を主成分とするハイブリッド高分子含浸材のコンクリート劣化防止剤で、従来はシラン系含浸剤で対応していた。本技術の活用により材料の使用量が１／３程度となり、1㎥当たりの材料費が低減でき、経済性が向上する。",null,"本技術は、コンクリート表面に塗布または噴霧して防水層を形成するジェル状のシラン・シロキサン系表面含浸材である。従来はシラン系表面含浸材を使用していた。本技術の活用により、1回塗りで施工できる他、中性化対策にも効果があるため、施工性・品質の向上が図れる。"]
[null,"⑦","概要図"]
[null,"⑧","施工条件・適用条件等","種類",null,"シラン系",null,"その他の系（触媒性化合物）",null,"シラン系",null,"反応型けい酸塩系(けい酸塩混合型：けい酸ナトリウム、けい酸カリウム）",null,"シラン系（特殊アルコキシシラン）",null,"シラン系（シラン、シロキサン）",null,"シラン系（アルキルアルコキシシラン単体）",null,"反応型けい酸塩系【けい酸ナトリウム系、硬化剤：アルカリ土類金属系】",null,"反応型けい酸塩系（けい酸塩混合型：けい酸ナトリウム、けい酸カリウム、けい酸リチウム）【副成分：コロイダルシリカ】",null,"その他の系（A液：浸透性常温安定ガラス生成剤、B液：UVカットポリシロキサン撥水剤）",null,"反応型けい酸塩系(けい酸ナトリウム＋けい酸カリウム）",null,"反応型けい酸塩系【ケイ酸ナトリウム＋けい酸カリウム＋けい酸リチウム】",null,"反応型けい酸塩系【ケイ酸ナトリウム＋けい酸カリウム＋けい酸リチウム】、カルシウム補助剤",null,"反応型けい酸塩系【けい酸ナトリウム】",null,"反応型けい酸塩系（改質促進材FS-＃50【水酸化カルシウム化合物】+反応型けい酸塩系表面含浸材FS-＃55（けい酸ナトリウム））",null,"【その他の系（酸化カルシウム、酸化ナトリウム等）】",null,"その他の系（Ｓクリートアップ：けい酸塩系【けい酸ナトリウム】+Ｓクリートガード：シラン系（シラン・シロキサン））",null,"反応型けい酸塩系（けい酸ナトリウム、助剤：水酸化カルシウム）",null,"シラン系(副成分：シロキサン)",null,"反応型けい酸塩系【けい酸ナトリウム系、反応活性剤：クエン酸系ほか】",null,"反応型けい酸塩系【けい酸塩混合型：けい酸ナトリウム、けい酸カリウム】",null,"反応型けい酸塩系【けい酸ナトリウム系】",null,"シラン系（アミノ基を化学的に結合したアルキルトリアルコキシシラン（浸透性の向上））",null,"その他の系（主材：触媒性化合物を含んだ無機質粉体、補助剤：結晶化反応を補助する無機液体材料） ",null,"反応型けい酸塩系【けい酸塩混合型：けい酸ナトリウム、ケイ酸カリウム】",null,"シラン系(増粘剤混合）",null,"反応型けい酸塩系(けい酸塩混合型：けい酸ナトリウム、けい酸リチウム）",null,"シラン系　【副成分：シロキサン】",null,"反応型けい酸塩系【けい酸塩混合型：けい酸ナトリウム、けい酸カリウム】",null,"固化型・反応型けい酸塩系【けい酸塩混合型：けい酸ナトリウム、けい酸カリウム、けい酸リチウム、副成分：アルミ、ジルコニア】",null,"シラン系（シラン系含浸材+シラン・シロキサン系表面塗布材）",null,"固化型けい酸塩系（けい酸リチウム）",null,"シラン系　（RSⅡ：低臭溶剤タイプ、SFⅡ：非溶剤タイプ）",null,"シラン系　（RSⅡ：低臭溶剤タイプ、SFⅡ：非溶剤タイプ）",null,"反応型けい酸塩系（けい酸カリウム）",null,"反応型けい酸塩系（けい酸ナトリウム、けい酸カリウム）",null,"カルシウム付与剤+けい酸塩系表面含浸材",null,"けい酸塩系表面含浸材",null,"シラン系表面含浸材+けい酸塩系表面含浸材",null,"シラン系",null,"反応型けい酸塩系【（けい酸ナトリウム(主成分)、けい酸カリウム（主成分）、けい酸リチウム）】",null,"【反応型けい酸塩系（けい酸ナトリウム）】",null,"反応型けい酸塩系【けい酸ナトリウム(主成分)、けい酸カリウム、けい酸リチウム】",null,"シラン系",null,"反応型けい酸塩系",null,"反応型けい酸塩系（主成分：けい酸ナトリウム、けい酸カリウム）",null,"シラン系（シラン・シロキサン、親水化剤）",null,"シラン系【副成分：シロキサン成分】",null,"その他の系（ナノシリカ系）",null,"シラン系表面含浸材",null,"その他の系（シラン系表面含浸材+けい酸塩系表面含浸材(けい酸リチウム)）",null,"その他の系（主成分：シラン系のシリコーンとケイ酸塩系のオルトケイ酸、副成分：水酸化リチウム、水酸化カリウム）",null,"シラン・シロキサン系表面含浸材"]
[null,null,null,"主な適用範囲",null,"中性化抑制、塩害抑制、アルカリシリカ反応抑制",null,"中性化抑制、アルカリシリカ反応抑制",null,"中性化抑制、塩害抑制、その他（凍害抑制）　【アルカリシリカ反応抑制】",null,"中性化抑制、塩害抑制、その他（凍害抑制）、アルカリシリカ反応抑制（他工法併用）",null,"中性化抑制、塩害抑制、アルカリシリカ反応抑制",null,"中性化抑制、塩害抑制、アルカリシリカ反応抑制、その他（凍害抑制）",null,"塩害抑制、アルカリシリカ反応抑制、その他（凍害抑制）　【中性化抑制】",null,"【中性化抑制、塩害抑制、その他（凍害抑制）】",null,"中性化抑制、塩害抑制 【その他（凍害抑制）】",null,"中性化抑制、塩害抑制、化学的浸食抑制【アルカリシリカ反応抑制、その他（凍害抑制）】",null,"中性化抑制、塩害抑制",null,"中性化抑制、塩害抑制",null,"中性化抑制、塩害抑制",null,"中性化抑制、塩害抑制、その他（凍害抑制）",null,"中性化抑制　【塩害抑制】",null,"防水性　【中性化抑制、塩害抑制、その他（化学的浸食抑制）】",null,"中性化抑制、塩害抑制、アルカリシリカ反応抑制、その他（凍害抑制）",null,"中性化抑制【塩害抑制、その他（凍害抑制）】",null,"中性化抑制、塩害抑制、アルカリシリカ反応抑制、その他（凍害抑制）",null,"中性化抑制、塩害抑制、その他（凍害抑制）",null,"中性化抑制、塩害抑制（塩害用）、その他（凍害抑制（CV）、ヘアークラック抑制（養生用）、付着強度の向上（タイル外壁用）等）",null,"その他（高炉セメント向け、ヘアークラック抑制）　【中性化、塩害抑制、その他（凍害抑制）】",null,"塩害抑制　【中性化抑制、アルカリシリカ反応抑制】",null," 中性化抑制、塩害抑制、アルカリシリカ反応抑制、その他（凍害抑制）",null,"中性化抑制、塩害抑制、アルカリシリカ反応抑制、その他（凍害抑制）",null,"中性化抑制、塩害抑制、アルカリシリカ反応抑制、その他（凍害抑制）",null,"中性化抑制、塩害抑制、その他（凍害抑制）",null,"塩害抑制、アルカリシリカ反応抑制、その他（凍害抑制）　【中性化抑制】",null,"中性化抑制、塩害抑制、アルカリシリカ反応抑制、その他（凍害抑制）",null,"中性化抑制　【塩害抑制、その他（凍害抑制）】",null,"中性化抑制、塩害抑制、アルカリシリカ反応抑制、その他（凍害抑制）",null,"中性化抑制、塩害抑制、その他（凍害抑制）",null,"中性化抑制、塩害抑制、アルカリシリカ反応抑制、その他（凍害抑制）",null,"中性化抑制、塩害抑制、アルカリシリカ反応抑制、その他（凍害抑制）",null,"中性化抑制、塩害抑制【その他（凍害抑制）】",null,"【中性化抑制、塩害抑制、凍害抑制、アルカリシリカ反応抑制、化学的反応抑制】",null,"中性化抑制【塩害抑制、凍害抑制】",null,"【中性化抑制】防水性、塩害抑制",null,"塩害抑制、その他（凍害抑制）、ASR抑制、中性化抑制",null,"中性化抑制、塩害抑制、アルカリシリカ反応抑制",null,"【中性化抑制、塩害抑制、凍害抑制、アルカリシリカ反応抑制、化学的侵食抑制】",null,"【中性化抑制、塩害抑制、凍害抑制、防水性】",null,"【中性化抑制、塩害抑制、アルカリシリカ反応抑制、その他（凍害抑制）】",null,"【中性化抑制、塩害抑制、その他（凍害抑制）】",null,"中性化抑制、塩害抑制、その他（凍害抑制）",null,"中性化抑制、その他（凍害抑制）",null,"中性化抑制、塩害抑制、アルカリシリカ反応抑制、その他（凍害抑制）",null,"塩害抑制、中性化抑制、アルカリシリカ反応抑制",null,"中性化抑制、塩害抑制",null,"中性化抑制、塩害抑制、アルカリ骨材反応抑制",null,"塩害抑制、中性化抑制、アルカリシリカ反応抑制、その他（凍害抑制）",null,"防水性、塩害抑制、その他（化学的侵食抑制）",null,"中性化抑制、塩害抑制、アルカリシリカ反応抑制、その他（凍害抑制）"]
[null,null,null,"下地乾湿状態",null,"【表面乾燥：含水率5％以下】",null,"表面乾燥（指触乾燥【表面が湿っている程度】）",null,"表面乾燥：含水率8％以下",null,"表面湿潤",null,"表面乾燥：含水率10％以下",null,"表面乾燥：含水率8％以下　 【表面乾燥：含水率5％以下】",null,"表面乾燥：含水率8％以下",null,"表面乾燥・表面湿潤（散水不要）",null,"表面乾燥・表面湿潤（散水養生不要）【特に制限なし】",null,"A液塗布時は散水不要【表面乾燥～表面湿潤】、B液施工時は要乾燥（48時間以上）",null,"表面湿潤",null,"【表面乾燥】",null,"【表面乾燥】",null,"表面乾燥・表面湿潤（散水不要）【含水率7%以下】",null,"FS-#50塗布時は表面乾燥【濡れ色がない程度】、FS-#55塗布時は表面乾燥【水分量4～6％程度】",null,"表面湿潤（躯体表面が完全にドライな状態の場合は適宜散水）",null,"表面乾燥・表面湿潤（散水不要）【含水率40％以下】",null,"表面乾燥・表面湿潤（散水不要）【含水率7%以下】",null,"表面乾燥：含水率6％以下",null,"表面湿潤　【表面が乾燥の場合散水】",null,"表面湿潤",null,"表面湿潤",null,"表面乾燥:含水率8％以下",null," 表面湿潤（コンクリートの乾燥が必要ない、反応に水分が必要） ",null,"表面乾燥【表面乾燥：含水率10%以下、湿っている程度】",null,"【表面乾燥：含水率5％以下】",null,"表面湿潤",null,"表面乾燥：含水率5％以下　【表面乾燥：含水率6％以下】",null,"表面乾燥・表面湿潤（湿り気を帯びた状態）",null,"【表面乾燥・表面湿潤（散水不要、濡色で手に水分が着かない状態で施工可能、夏場40℃以上の場合は軽く散水）】",null,"表面乾燥",null,"表面湿潤",null,"表面乾燥（含水率6％以下）",null,"表面乾燥（含水率6％以下）",null,"【表面乾燥（高圧洗浄後30分程度】",null,"湿潤状態",null,"表面湿潤",null,"塗布面の含水率が6～7%の乾燥状態",null,"乾燥状態",null,"乾燥状態",null,"乾燥状態",null,"乾燥状態",null,"・乾燥状態（湿潤状態は薬剤成分が希釈しなければ適用可能）",null,"表面乾燥",null,"・乾燥状態（濡れたコンクリートにも適用可能であるが、漏水箇所は補修が必要）",null,"湿潤状態(表面が指触で指が濡れる状態まで散水する。）",null,"表面乾燥",null,"表面乾燥（表面含水率8％以下）",null,"乾燥、湿潤状態でも施工可能",null,"表面乾燥：含水率6％以下",null,"表面乾燥【（含水率6％以下）】",null,"表面乾燥（降雨後2時間以内は施工不可）",null,"表面乾燥（表面水分率6％以下）"]
[null,null,null,"施工中の気温",null,"5℃～35℃",null,"5℃～40℃",null,"0℃以上",null,"【5℃～30℃（5℃以下は90分以内に氷点下にならないこと、30℃以上は散水を行うことにより施工可能）】",null,"5℃～35℃　 【5℃～30℃】",null,"0℃～40℃ 　【-10℃～40℃】",null,"5℃～40℃",null,"0℃以上",null,"【5℃～40℃】",null,"【5～35℃】",null,"5℃～40℃",null,"0～35℃",null,"0～35℃",null,"5℃以上30℃未満（30℃以上では散水により表面温度をさげることを推奨）【5～80℃（5℃未満では保温等要対策）】",null,"5～40℃",null,"４℃以上",null,"5℃以上40℃以内【Ｓクリートガードは－5度以下でも施工可能】",null,"5℃以上30℃未満（30℃以上では散水により表面温度をさげることを推奨）【5～80℃（5℃未満では保温等要対策）】",null,"0℃以上",null,"5℃～30℃【5℃未満は凍結防止対策が必要、30℃以上は散水が必要】",null,"5℃～40℃",null,"5℃～40℃",null,"5℃～45℃ 【5℃～40℃】",null,"日平均気温が4℃以下になることが予想されるときは、寒中コンクリート施工に準じるものとする",null,"外気温度0℃以下は作業中止　【0℃～40℃】",null,"5℃～30℃",null,"5℃以上　【5℃～40℃、5℃以下の場合、採暖養生下での施工により可能】",null,"0℃～60℃",null,"1℃～50℃　【1℃～40℃、　1℃未満の場合は暖房仮設　30℃以上の場合は散水を増やす】",null,"5℃～40℃　【0℃～30℃、躯体表面温度が40℃以上の場合は、軽く散水して表面温度を下げれば施工可能】",null,"5℃～60℃（コンクリートの表面温度）",null,"5℃以上(採暖養生下での適用可)【5～35℃】",null,"0℃～35℃",null,"0℃～35℃",null,"気温が5℃ 以上40℃以下",null,"【0～40℃】",null,"【5℃～40℃】（施工時気温5℃以下、施工面温度露点以下の場合は、採暖養生が必要）",null,"【5℃～40℃】",null,"-20℃～60℃",null,"施工時の外気温が0℃～40℃の範囲内",null,"【5～35℃】",null,"5℃～40℃【湿潤・乾燥状態のコンクリート躯体】",null,"0～35℃（好ましくは5～30℃）",null,"-40℃～40℃",null,"・5℃～40℃",null,"5℃以上",null,"5～40℃",null,"【0～35℃（コンクリート表面が降雨、降雪で濡れている場合、あるいは氷結時は施工中止。）】",null,"5～40℃",null,"0℃以上【コンクリート表面温度：0℃以上～60℃以下、相対湿度８５％以下】",null,"5℃～40℃",null,"5℃以上",null,"気温0℃以上、湿度85％以下"]
[null,null,null,"施工後の気温（氷点下）",null,"可能（24時間以内で氷点下まで下がる場合は、防寒対策を実施【凍結融解試験では無処理との差異が見られない】）",null,"【不可】",null,"【可能（施工後48時間以内に対象構造物が氷点下にならないこと）】",null,"【可能（湿潤養生90分経過後であれば可能）】",null,"可能（塗装完了後6時間以内の気温が氷点下まで下がる場合は、防寒養生を実施）",null,"【不可（降雨や積雪、結露等により表面の凍結の可能性がある場合は不可）】",null,"【可能（4時間以上乾燥後）】",null,"【可能（施工後24時間以内に対象構造物が氷点下にならないように養生）】",null,"【可能（表面乾燥後）】",null,"【不可】",null,"【不可（施工箇所をジェットヒーターなどで吸熱養生し、散水の凍結を防ぐことにより施工可能）】",null,"【不可（0℃以下での施工は避けること）】",null,"【不可（0℃以下での施工は避けること）】",null,"可（施工面の指触乾燥確認後）",null,"【不可（氷点下となる場合は適用不可）】",null,"【不可】",null,"【可（コンクリート躯体が1℃以上であること）】",null,"可（施工面の指触乾燥確認後）",null,"【可能（凍結融解に対する抵抗性を試験で確認）】",null,"【可能（材料塗布後に散水した水が乾いた後であれば問題ない）】",null,"【可能（施工完了直後に氷点下にならなければ可）】",null,"【可能（施工完了直後に氷点下にならなければ可）】",null,"【可能（4時間以上乾燥後）】",null,"【可能（養生温度4℃以上を確保すること）】",null,"可能（凍結融解抵抗性試験では軽微な崩れ、ヘアクラックが発生する程度）",null,"【可（凍結融解に対する抵抗性を試験で確認）】",null,"【可能（採暖養生を行うこと）】",null,"【可能（塗布後、材料が含浸するまでは0℃以上を保持）】",null,"【可能（散水養生時間（1～2時間程度）を確保する）】",null,"【不可】",null,"【可】",null,"【可】",null,"【不可（24時間以内に氷点下となる場合は不可）】",null,"【不可（24時間以内に氷点下となる場合は不可）】",null,"【可】",null,"【不可（散水、養生中は凍らない程度の気温】",null,"【不可】",null,"【不可】",null,"【可】",null,"【可】",null,"【不可（コンクリート表面温度が0℃以上）】",null,"不可（温度が低い場合には適切な採暖処置を施せば可能。）",null,"【不可】",null,"可能",null,"不可",null,"不可【インフララップは、保温性能を有するが、氷点下への適用は確認が必要】",null,"【不可（約7日間は氷点下にならないことが望ましい）】",null,"【可能（施工後コンクリート表面が降雨降雪で濡れている場合は施工中止。）】",null,"-",null,"【不可】",null,"【施工可能（施工後、氷点下になる場合約24時間は5℃以上になるように採暖養生すること。）】",null,"施工不可",null,"制約なし"]
[null,null,null,"施工中の水分",null,"【不可】",null,"【不可】",null,"【不可】",null,"【可能（湿り気を帯びている程度は施工可能）】",null,"不可（雨天時及び施工6時間後に降雨が予想される場合の施工は避けること）",null,"【不可】",null,"不可（強風あるいは雨天の影響がある場合は、施工を避ける　【短時間で接触の場合は再施工可】）",null,"不可（コンクリート表面に付着水がないこと）",null,"【可能】",null,"【A液は可（流出の恐れがない程度）、B液は不可】",null,"可能（溶液が洗い流されない程度であれば施工可能）",null,"不可（薬剤成分が希釈されるために避ける）",null,"不可（薬剤成分が希釈されるために避ける）",null,"可（施工面に水が溜まらない程度）",null,"不可（施工時雨天の場合は、施工不可）",null,"不可（リキッド成分が流出する恐れのある雨天時の施工は不可）",null,"【可（流出の恐れが無い雨水程度。但し工期に支障がなければ避けること。）】",null,"可（施工面に水が溜まらない程度）",null,"不可",null,"可能（材料が流れない程度であれば施工可能、流れる程度であれば養生が必要)",null,"可能（大雨時の施工は避ける(濡れている程度は施工可））",null,"可能（大雨時の施工は避ける(濡れている程度は施工可））",null,"不可（雨天及び、強風の時は施工しない、短時間で接触の場合は再施工可）",null,"不可（ 降雨時は施工不可 ）",null,"不可（降雨時は作業中止）",null,"不可（降雨、降雪時及び強風時には施工不可）",null,"【可能（作業が可能な程度の降雨時）】",null,"不可（施工中に降雨などで施工面がぬれることが予想される場合、施工を中止）",null,"【可能（材料の塗布が完了していること）】",null,"不可（降雨中の散布は、薬剤成分が希釈するため避ける）",null,"不可",null,"可（施工時は塗布面コンクリートを湿潤状態に保ち施工すること。降雨・降雪時不可。）",null,"不可",null,"不可",null,"【可（流出の恐れが無い雨水程度】",null,"可（少量の雨天時なら施工可能）",null,"可（施工時は塗布面コンクリートを湿潤状態に保ち施工すること。降雨・降雪時不可。）",null,"不可（表面乾燥。降雨・降雪時不可。【小雨程度は可】）",null,"不可（コンクリート表面に水や降雨がかからないように留意する。）",null,"不可（・施工面に滞水のないこと　・降雨、降雪での施工不可）",null,"【可（流出の恐れが無い雨水程度）】",null,"【可（流出の恐れが無い雨水程度）】",null,"【可（流出の恐れが無い雨水程度、薬剤が流れない少雨であれば可能）】",null,"【不可】（塗布開始から完了後2時間迄は降雨の影響を受けないよう作業日を選定）",null,"不可",null,"-",null,"不可（降雨、降雪時の施工は避ける）",null,"不可（雨時、降雪時には作業を中止すること。）",null,"不可（降雨、降雪時の施工不可）",null,"不可（降雨、降雪不可、コンクリート表面にアクアシール1400ARが残っている間は水がかからないようにする。）",null,"不可（雨天、積雪の場合は施工不可）",null,"不可（降雨、降雪時の施工は避ける）",null,"不可（降雨、降雪などの場合は施工不可）"]
[null,null,null,"施工後24時間以内の水分",null,"不可（塗装完了後24時間以内は雨水に当てないこと）",null,"【可能】",null,"不可（塗装完了後48時間は塗布面が直接雨等に晒されないようにすること）",null,"【可能（90分間は、過度な水分は避ける）】",null,"可能（塗装完了後6時間以内は雨水に当てないこと）",null,"不可（施工後短時間に雨が当たると塗膜が白変する恐れがあるため、濡れないように養生する、【24時間乾燥】）",null,"可能（塗布後4時間以内に降雨により施工面が濡れないようする）",null,"不可（塗布後24時間は、塗布面を直接雨にさらさないように養生などを行うこと）",null,"【可能】",null,"【不可（24時間以上の乾燥養生）】",null,"【可能（塗布施工面が湿る程度）】",null,"【不可（約24時間の乾燥状態を保つこと）】",null,"【不可（約24時間の乾燥状態を保つこと）】",null,"【可（流出の恐れが無い雨水程度）】",null,"可（散水養生）",null,"可（散水養生）",null,"不可（施工後24時間程度は、雨水等がかからないように適切な養生をすること）",null,"【可（流出の恐れが無い雨水程度）】",null,"不可（施工後の材料浸透が完了するまで、塗布面が濡れないこと(1日程度)）",null,"【可能（降雨などは問題ない　施工面が流水に曝されるまたは湛水する場合は、 養生期間[２週間～]経過後に実施）】",null,"【可能（材料塗布から0.5～1時間以上開けば可）】",null,"【可能（材料塗布から0.5～1時間以上開けば可）】",null,"可能（施工後4時間以内に雨が予測される場合は施工しない）",null,"可能",null,"不可（水掛試験は塗布後2～3日後）　【不可（24時間以上乾燥後に水かけ試験）】",null,"不可（施工後24時間経過するまで、水しぶきや降雨から保護する）",null,"【可能（養生（30～45分）後の洗浄が終了後の降雨は影響がない）】",null,"不可（水掛けでの効果の確認は、気温 20℃以上の乾燥状態で、48時間以降を目安として行う）",null,"【可能（塗布後30分後、材料の塗布が完了していれば可）】",null,"【可能（塗布後18時間程度経過後可）】",null,"不可（施工後3日間は水分（雨、雪、霜等）に触れさせないこと）",null,"可",null,"【不可（24時間以内に降雨、水没が予測される場合は不可）】",null,"【不可（24時間以内に降雨、水没が予測される場合は不可）】",null,"【可（流出の恐れが無い雨水程度】",null,"可（塗布前後は必ず湿潤状態にする）",null,"【可（流出の恐れが無い雨水程度）】",null,"【可（流出の恐れが無い雨水程度】",null,"不可（24時間以上、水等がかからない様に養生する。）",null,"不可",null,"【可（流出の恐れが無い雨水程度）】",null,"【可（流出の恐れが無い雨水程度）】",null,"【可（流出の恐れが無い雨水程度、薬剤が流れない少雨であれば可能）】",null,"【不可】塗布完了後2時間は降雨の影響を避ける",null,"不可（24時間以内に降水が予想される場合は施工不可）",null,"-",null,"不可（施工後、約24時間は雨水等がかからないよう養生）",null,"【可能（施工後表面が乾燥状態（施工前の素地と同じ表情）になるまで水分に触れないようにする）】",null,"-",null,"【不可（24時間以内に降雪雨がないこと）】",null,"施工不可（施工後、約24時間は雨水等がかかる可能性がある場合は、シート等で養生すること。）",null,"【可能（施工後30分で完全乾燥し、撥水効果を発現する。施工後3時間で完全乾燥するため、それ以降の降雨や降雪による影響はない）】",null,"不可（降雨、降雪などがかからないようにシート等で養生）"]
[null,null,null,"養生",null,"1回目塗布後2時間【2時間以上24時間以内】、2回目塗布後24時間乾燥養生【気温20度で相対湿度20％相当以上は必要】",null,"表面乾燥（指触乾燥【小雨程度の水分は許容】）",null,"48時間乾燥養生",null,"1.5時間湿潤養生",null,"【6時間以上乾燥養生】",null,"24時間乾燥養生",null,"【4時間以上乾燥養生】",null,"24時間乾燥養生",null,"【1回塗布の12時間以上乾燥】",null,"【A液塗布後は48時間以上1月間以内の乾燥養生、B液塗布後は24時間以上の乾燥養生】",null,"【湿潤養生】",null,"【散水不要（2週間程度は薬剤の流出の恐れのあるような大雨、洪水、暴風雪下は避ける）】",null,"【散水不要（2週間程度は薬剤の流出の恐れのあるような大雨、洪水、暴風雪下は避ける）】",null,"乾燥養生【30～90分程度で乾燥】（曝露状態を2週間以上保持）",null,"FS-#50塗布後は1日乾燥養生、FS-#55塗布後は散水養生",null,"散水養生",null,"乾燥養生（Sクリートアップ塗布後24時間以上、Sクリートガード塗布後24時間以上）",null,"乾燥養生【30～90分程度で乾燥】（曝露状態を2週間以上保持）",null,"24時間以上乾燥養生",null,"【水分供給が無い屋内等では3日以上、降雨などの水分供給のある屋外では不要】",null,"【湿潤養生（0.5～1時間）または養生不要(時間は問わないが、湿潤状態を設けた方が効果は高まる）】",null,"【湿潤養生（0.5～1時間）または養生不要(時間は問わないが、湿潤状態を設けた方が効果は高まる）】",null,"塗布間隔20分以上（指触乾燥）　【4時間以上乾燥養生】",null," 気乾養生後、3日間清水を散布する。結晶生成による緻密化を開始までに概ね3ヶ月程度要するため、補助工法の併用が必要となる場合がある。 ",null,"24時間以上乾燥養生　【12時間以上乾燥養生】",null,"24時間乾燥養生",null,"1回目塗布後30分程度湿潤養生、2回目塗布後30～45分程度湿潤養生",null,"24時間乾燥養生",null,"【1～2時間程度湿潤養生】",null,"散水養生不要",null,"乾燥養生（3日以上）",null,"湿潤養生（30～45分）",null,"乾燥養生（24時間）",null,"乾燥養生（24時間）",null,"【乾燥養生（0.5時間以上）】",null,"湿潤養生【1時間以上】",null,"湿潤養生（一回目塗布後15～30分、二回目塗布後15～35分）",null,"湿潤養生（塗布後 30～60分程度）",null,"【乾燥養生】24時間以上、水等がかからない様に養生する。",null,"乾燥養生：12時間以上。雨水が直接かからないよう、必要に応じてシート養生等を行う。",null,"【乾燥（養生時間2時間以上）】",null,"【不要】",null,"【不要】",null,"乾燥養生（2時間）",null,"24時間乾燥養生",null,"3日間湿潤養生（表面含浸材が浸透する時間）",null,"24時間以上乾燥養生",null,"8時間以上乾燥養生【（水分に触れないようにし、施工面が乾燥状態になるまで養生）】",null,"約72時間乾燥養生",null,"24時間以上乾燥養生",null,"約24時間以上乾燥養生",null,"乾燥養生【（日陰養生で良く、施工後３時間前後で養生終了）】",null,"乾燥養生（おおよそ24時間程度、水が掛からないように養生）"]
[null,"⑨","比較する従来技術",null,null,"有機系被覆工法",null,"無機・有機複合コーティング材",null,"シラン系表面含浸材(3回塗り)",null,"有機系表面被覆材(ウレタン)",null,"無機系表面被覆工法",null,"表面被覆工法(有機系)",null,"有機系表面被覆工法",null,"1液性のけい酸塩系表面含浸材",null,"散水養生を必要とするケイ酸塩系含浸材",null,"けい酸塩系表面含浸材",null,"表面保護工法(有機系塗膜材)",null,"表面被覆工法で使用するエポキシ樹脂材料",null,"表面被覆工法で使用するエポキシ樹脂材料",null,"表面含浸工法(反応型けい酸塩系表面含浸工法)",null,"表面被覆工法(有機系塗膜材)",null,"シート防水",null,"有機系被覆工法",null,"表面含浸工法(補助剤を併用した反応型けい酸塩系表面含浸⼯法)",null,"表面被覆工法",null,"表面被覆工法",null,"コンクリートの打放し",null,"コンクリートの打放し",null,"電流陽極(犠牲陽極)方式による電気防食工法",null," 張りコンクリート工法 ",null,"溶剤系・塗膜型撥水材塗布工法",null,"表面被覆工法(有機系)",null,"表面被覆工法",null,"表面被覆工法(溶剤型コンクリート長期耐久性塗装システム)",null,"ウレタン樹脂",null,"ケイ酸塩系表面含浸材",null,"含浸工(シラン系含侵材の単層構造処理材)",null,"表面被覆工法",null,"シラン系表面含浸材",null,"シラン系表面含浸材",null,"けい酸塩系表面含浸工法",null,"けい酸塩系表面含浸保護材",null,"表面被覆工法",null,"けい酸塩系表面含浸材",null,"シラン系表面含浸材",null,"シラン系表面含浸工法",null,"超微粒子シリカが非含有ケイ酸質系表面改質材",null,"散水工程が必須であるけい酸塩系表面含浸材",null,"けい酸塩系表面含浸剤(補助剤併用)",null,"シラン系表面含浸材",null,"表面含浸工法(反応型ケイ酸塩系表面含浸工法)",null,"けい酸塩系表面含浸工法",null,"シラン系表面含浸材",null,"表面被覆工（コンクリート保護工）",null,"けい酸塩系コンクリート表面含浸材",null,"亜硝酸リチウム水溶液とシラン系表面含浸材の組み合わせ",null,"表面含浸工（シラン系表面含侵材）",null,"シラン系表面含浸材",null,"シラン系表面含浸工法（3回塗り）"]
["評価情報 ","⑩","評価基準",null,"項目","最新の活用効果評価結果,所見",null,"最新の活用効果評価結果,所見",null,"最新の活用効果評価結果,所見",null,"最新の活用効果評価結果,所見",null,"最新の活用効果評価結果,所見",null,"最新の活用効果評価結果,所見",null,"最新の活用効果評価結果,所見",null,"最新の活用効果評価結果,所見",null,"最新の活用効果評価結果,所見",null,"最新の活用効果評価結果,所見",null,"最新の活用効果評価結果,所見",null,"最新の活用効果評価結果,所見",null,"最新の活用効果評価結果,所見",null,"最新の活用効果評価結果,所見",null,"最新の活用効果評価結果,所見",null,"最新の活用効果評価結果,所見",null,"最新の活用効果評価結果,所見",null,"最新の活用効果評価結果,所見",null,"最新の活用効果評価結果,所見",null,"最新の活用効果評価結果,所見",null,"最新の活用効果評価結果,所見",null,"最新の活用効果評価結果,所見",null,"最新の活用効果評価結果,所見",null,"最新の活用効果評価結果,所見",null,"最新の活用効果評価結果,所見",null,"最新の活用効果評価結果,所見",null,"最新の活用効果評価結果,所見",null,"最新の活用効果評価結果,所見",null,"最新の活用効果評価結果,所見",null,"最新の活用効果評価結果,所見",null,"最新の活用効果評価結果,所見",null,"最新の活用効果評価結果,所見",null,"最新の活用効果評価結果,所見",null,"最新の活用効果評価結果,所見",null,"最新の活用効果評価結果,所見",null,"最新の活用効果評価結果,所見",null,"最新の活用効果評価結果,所見",null,"最新の活用効果評価結果,所見",null,"最新の活用効果評価結果,所見",null,"最新の活用効果評価結果,所見",null,"最新の活用効果評価結果,所見",null,"最新の活用効果評価結果,所見",null,"最新の活用効果評価結果,所見",null,"最新の活用効果評価結果,所見",null,"最新の活用効果評価結果,所見",null,"最新の活用効果評価結果,所見",null,"最新の活用効果評価結果,所見",null,"最新の活用効果評価結果,所見",null,"最新の活用効果評価結果,所見",null,"最新の活用効果評価結果,所見",null,"最新の活用効果評価結果,所見",null,"最新の活用効果評価結果,所見",null,"最新の活用効果評価結果,所見"]
[null,null,"・A：従来技術より極めて優れる\n・B：従来技術より優れる\n・C：従来技術と同等\n・D：従来技術より劣る",null,"経済性","C：-",null,"B：-",null,"B：-",null,"B：-",null,"C：-",null,"B：-",null,"B：従来よりも塗布回数が減少し簡便な方法で施工できるため、施工日数が減少し工程の短縮が図れるとともに、施工費が低減されるため、経済性の向上も図られている。",null,"B：1回の塗布回数で施工できるため、経済性の向上が図れる。",null,"B：-",null,"-",null,"B：-",null,"-",null,"-",null,"B：-",null,"-",null,"-",null,"B：従来工法の有機系被覆工法より安価となるため、経済性が有利。",null,"-",null,"B：-",null,"B：-",null,"D：-",null,"D：-",null,"A：留意事項：無色透明な液体を塗布するため、使用量の管理を適切に行わなければならない。",null,"B：-",null,"C：-",null,"B：-",null,"B：-",null,"A：材料費が安く、1回塗りが可能であるため、塗装工数が少なく安価であった。",null,"-",null,"B：-",null,"-",null,"-",null,"-",null,"-",null,"-",null,"-",null,"-",null,"B：含浸性を向上させたことにより、塗布工程が1回となるため、コスト低減が図られる。",null,"C：-",null,"-",null,"-",null,"B：散水及び2回目塗布工程を省略できるため、経済性の向上が図られる。",null,"B：-",null,"-",null,"-",null,"-",null,"-",null,"-",null,"-",null,"-",null,"-",null,"-",null,"-"]
[null,null,null,null,"工程","B：塗層数を減らすことにより、工程短縮となった。",null,"B：塗装回数の減少及び散布後の養生が不要となり工程短縮が図られている。",null,"B：-",null,"B：従来は複数回塗りの工程であったが本技術は1回塗り工程のため、施工日数が少なくなり工程が短縮される。",null,"C：-",null,"B：塗布は1工程1回であるため、工期が短縮できた。",null,"B：従来よりも塗布回数が減少し簡便な方法で施工できるため、施工日数が減少し工程の短縮が図れるとともに、施工費が低減されるため、経済性の向上も図られている。",null,"B：1回の塗布回数で施工できるため、工期の短縮が図れる。",null,"B：-",null,"-",null,"B：塗布回数が減少したため、工程短縮となった。",null,"-",null,"-",null,"B：散水を伴う工程の省略により、工程が短縮できる。",null,"-",null,"-",null,"B：塗布回数が減っているため、現場作業は減少し工程の短縮が図れる。",null,"-",null,"A：塗り重ね回数が少なくて済むため、工程の短縮が図られている。",null,"B：従来技術と比較して塗布工程が少なく、降雨時の施工も可能であることから、工程の短縮が図られている。",null,"B：-",null,"B：-",null,"B：-",null,"B：留意事項：程を省略したり(反応水)散布(養生)を怠ると、剥がれたり所定の性能が発揮できないことがある。",null,"B：-",null,"A：-",null,"B：表面に塗布するだけであり、降雨時の施工も可能であることから、工程の短縮が図られている。",null,"A：従来の工法に比べて1工程・1回で規定量を塗布できるため、工期短縮につながった。",null,"-",null,"B：散水養生が不要となることで、工程の短縮が図られている。",null,"-",null,"-",null,"-",null,"-",null,"-",null,"-",null,"-",null,"B：含浸性を向上させたことにより、塗布工程が1回となるため、工程の短縮が図られる。",null,"C：-",null,"-",null,"-",null,"B：散水及び2回目塗布工程を省略できるため、工程の短縮が図られる。",null,"B：-",null,"-",null,"-",null,"-",null,"-",null,"-",null,"-",null,"-",null,"-",null,"-",null,"-"]
[null,null,null,null,"品質・出来形","C：紫外線劣化を起こさない為、長期の耐久性、耐候性が期待できる。",null,"B：-",null,"B：コンクリート表面に緻密なシリコーンポリマー保護層を形成し、劣化因子の浸透を抑制し、劣化防止が期待できる。",null,"B：-",null,"C：-",null,"B：塗りムラが減少するため、出来形精度が向上した。",null,"C：-",null,"B：-",null,"C：-",null,"-",null,"B：含浸させることにより、コンクリートが緻密化するため、耐久性の向上が期待できる。",null,"-",null,"-",null,"C：-",null,"-",null,"-",null,"B：-",null,"-",null,"B：-",null,"C：留意事項：材料が無色透明であるため、出来高の確認に留意する必要がある。",null,"B：従来のコロイド状けい酸ナトリウムと比べてナノサイズと小さく、浸透速度、浸透深さ、反応速度等が改善されるため、品質・出来形の向上が図られている。",null,"B：従来のコロイド状けい酸ナトリウムと比べてナノサイズと小さく、浸透速度、浸透深さ、反応速度等が改善されるため、品質・出来形の向上が図られている。",null,"B：留意事項：耐久性（鉄筋腐食の抑制効果）について、短期間では評価ができないため、長期間における効果の検証が必要である。",null,"B：表面の仕上がりが不均一でザラザラしており、美観を損ねるおそれがある。",null,"C：-",null,"B：-",null,"B：留意事項：塗布後の洗浄が不十分の場合は塗布材料が表面で結晶化し、美観を損ねる場合がある。",null,"C：留意事項：シール材が均一に含浸するように塗布面の清掃を行い、0.3mm以上のクラックやジャンカ等は、施工前に補修しておく必要がある。留意事項：施工後15年程度で再施工することで、効果の継続性が期待できるが、異常が無いか経過観察を行う必要がある。",null,"-",null,"B：",null,"-",null,"-",null,"-",null,"-",null,"-",null,"-",null,"-",null,"B：-",null,"B：シラン系にケイ酸塩系の性質をもたせることにより、コンクリート構造物が長寿命化し、品質の向上が図られる。",null,"-",null,"-",null,"C：-",null,"A：撥水作用により塩化物イオン等の劣化因子 の侵入抑制が図れる。",null,"-",null,"-",null,"-",null,"-",null,"-",null,"-",null,"-",null,"-",null,"-",null,"-"]
[null,null,null,null,"安全性","C：-",null,"C：-",null,"C：-",null,"C：-",null,"C：-",null,"C：-",null,"C：-",null,"C：-",null,"C：-",null,"-",null,"B：-",null,"-",null,"-",null,"C：-",null,"-",null,"-",null,"B：-",null,"-",null,"C：-",null,"C：-",null,"C：-",null,"C：-",null,"C：留意事項：塗布作業のみでコンクリート表面の切断及びはつり作業がなく、切断工具の使用や、はつりコンクリートの飛来落下等の危険性がなかったため、安全であった。",null,"C：-",null,"C：-",null,"C：-",null,"C：-",null,"C：留意事項：材料の保管は直射日光をさけて密閉状態で行い、一度開封した物は使い切るか廃棄処分をする。引火性があるので火気に気をつける必要がある",null,"-",null,"C：-",null,"-",null,"-",null,"-",null,"-",null,"-",null,"-",null,"-",null,"C：-",null,"C：-",null,"-",null,"-",null,"C：-",null,"B：-",null,"-",null,"-",null,"-",null,"-",null,"-",null,"-",null,"-",null,"-",null,"-",null,"-"]
[null,null,null,null,"施工性","C：材料が一種類で塗布する作業のため、作業が容易になった。",null,"B：留意事項：施工は、リバコン技能士の資格が必要となる。",null,"B：現場での塗布回数が減少したため、施工性が向上した。",null,"B：退色性着色材により施工済み箇所が目視確認でき塗り忘れを防止できるため、施工性の向上が図られている。",null,"C：-",null,"B：-",null,"B：-",null,"B：1回の塗布回数で施工できるため、施工性の向上が図れる。",null,"B：散水養生を要しないため、散水設備および作業員の手間が削減でき、施工性の向上が図られている。",null,"-",null,"B：-",null,"-",null,"-",null,"B：散水を伴う工程の省略により、施工性が向上する。",null,"-",null,"-",null,"B：塗布回数が減っているため、現場作業は減少し施工性が向上する。",null,"-",null,"B：留意事項：外気温が0℃を下回ると材料が凍結する恐れがあり、冬季における施工には留意が必要である。",null,"C：-",null,"C：-",null,"C：-",null,"B：留意事項：現場での施工、仮設工、熟練度に依存した工程は減少し、作業が容易になった。\n留意事項：火気厳禁",null,"C：留意事項：セメントと同じ成分組織であるため、コンクリートと同様の扱い方が必要である。\n留意事項：ザイペックス・トレーナー有資格者による施工となる。",null,"C：-",null,"C：-",null,"C：-",null,"B：少ない工程数により、施工性が大幅に向上した\n留意事項：コンクリート構造物がぬれているときや、マイナスの気温では施工できない。",null,"-",null,"B：-",null,"-",null,"-",null,"-",null,"-",null,"-",null,"-",null,"-",null,"B：含浸性を向上させたことにより、塗布工程が1回となるため、施工性の向上が図られる。",null,"C：-",null,"-",null,"-",null,"B：散水及び2回目塗布工程を省略できるため、施工性の向上が図られる。",null,"B：1液の塗布施工のみであり、施工に特殊技術は必要ないので施工性はよい。",null,"-",null,"-",null,"-",null,"-",null,"-",null,"-",null,"-",null,"-",null,"-",null,"-"]
[null,null,null,null,"環境","C：-",null,"C：-",null,"C：-",null,"C：-",null,"C：-",null,"C：-",null,"C：-",null,"C：-",null,"C：-",null,"-",null,"C：-",null,"-",null,"-",null,"C：-",null,"-",null,"-",null,"B：-",null,"-",null,"C：-",null,"C：-",null,"C：-",null,"C：-",null,"C：留意事項：コンクリートの切断及びはつり作業がなく、騒音・振動・粉塵やコンクリート塊の発生がなかった。",null,"C：-",null,"C：-",null,"C：-",null,"C：-",null,"C：ジェル状のため飛散しにくく、溶剤の大気放出がないため、環境面での評価向上につながった。",null,"-",null,"C：-",null,"-",null,"-",null,"-",null,"-",null,"-",null,"-",null,"-",null,"C：-",null,"C：-",null,"-",null,"-",null,"C：-",null,"C：-",null,"-",null,"-",null,"-",null,"-",null,"-",null,"-",null,"-",null,"-",null,"-",null,"-"]
[null,null,null,null,"総合評価","C：-",null,"B：全般的に申請情報の「活用の効果」と同様の評価となった。特に「工程」について高い評価が得られた。また、現場にて高い安定性を有するとの評価が得られた。",null,"B：-",null,"B：-",null,"C：-",null,"B：-",null,"C：-",null,"B：-",null,"B：-",null,"-",null,"B：-",null,"-",null,"-",null,"B：-",null,"-",null,"-",null,"B：-",null,"-",null,"B：全般的に申請情報の「活用の効果」と同様の評価となった。特に「工程」について高い評価が得られた。また、現場にて高い安定性を有するとの評価が得られた。",null,"B：全般的に申請情報の「活用の効果」と同様の評価となった。特に「工程」について高い評価が得られた。また、現場にて高い安定性を有するとの評価が得られた。",null,"C：-",null,"C：-",null,"B：-",null,"B：-",null,"C：-",null,"B：-",null,"B：全般的に申請情報の「活用の効果」と同様の評価となった。特に「工程」について高い評価が得られた。",null,"B：-",null,"-",null,"B：",null,"-",null,"-",null,"-",null,"-",null,"-",null,"-",null,"-",null,"B：-",null,"C：-",null,"-",null,"-",null,"B：-",null,"B：-",null,"-",null,"-",null,"-",null,"-",null,"-",null,"-",null,"-",null,"-",null,"-",null,"-"]
["統一した従来技術",null,null,null,null,"表面含浸工法（シラン系）",null,"表面含浸工法（その他表面保護材）",null,"表面含浸工法（シラン系）",null,"表面含浸工法（ケイ酸塩系）",null,"表面含浸工法（シラン系）",null,"表面含浸工法（シラン系）",null,"表面含浸工法（シラン系）",null,"表面含浸工法（ケイ酸塩系）",null,"表面含浸工法（ケイ酸塩系）",null,"表面含浸工法（その他表面保護材）",null,"表面含浸工法（ケイ酸塩系）",null,"表面含浸工法（ケイ酸塩系）",null,"表面含浸工法（ケイ酸塩系）",null,"表面含浸工法（ケイ酸塩系）",null,"表面含浸工法（ケイ酸塩系）",null,"表面含浸工法（その他表面保護材）",null,"表面含浸工法（その他表面保護材）",null,"表面含浸工法（ケイ酸塩系）",null,"表面含浸工法（シラン系）",null,"表面含浸工法（ケイ酸塩系）",null,"表面含浸工法（ケイ酸塩系）",null,"表面含浸工法（ケイ酸塩系）",null,"表面含浸工法（シラン系）",null,"表面含浸工法（その他表面保護材）",null,"表面含浸工法（ケイ酸塩系）",null,"表面含浸工法（シラン系）",null,"表面含浸工法（ケイ酸塩系）",null,"表面含浸工法（シラン系）",null,"表面含浸工法（ケイ酸塩系）",null,"表面含浸工法（ケイ酸塩系）",null,"表面含浸工法（シラン系）",null,"表面含浸工法（ケイ酸塩系）",null,"表面含浸工法（シラン系）",null,"表面含浸工法（シラン系）",null,"表面含浸工法（ケイ酸塩系）",null,"表面含浸工法（ケイ酸塩系）",null,"表面含浸工法（ケイ酸塩系）",null,"表面含浸工法（ケイ酸塩系）",null,"表面含浸工法（その他表面保護材）",null,"表面含浸工法（シラン系）",null,"表面含浸工法（ケイ酸塩系）",null,"表面含浸工法（ケイ酸塩系）",null,"表面含浸工法（ケイ酸塩系）",null,"表面含浸工法（シラン系）",null,"表面含浸工法（ケイ酸塩系）",null,"表面含浸工法（ケイ酸塩系）",null,"表面含浸工法（シラン系）",null,"表面含浸工法（シラン系）",null,"表面含浸工法（その他表面保護材）",null,"表面含浸工法（シラン系）",null,"表面含浸工法（その他表面保護材）",null,"表面含浸工法（その他表面保護材）",null,"表面含浸工法（シラン系）"]
["補完調査情報",null,null,null,null,"従来技術","新技術","従来技術","新技術","従来技術","新技術","従来技術","新技術","従来技術","新技術","従来技術","新技術","従来技術","新技術","従来技術","新技術","従来技術","新技術","従来技術","新技術","従来技術","新技術","従来技術","新技術","従来技術","新技術","従来技術","新技術","従来技術","新技術","従来技術","新技術","従来技術","新技術","従来技術","新技術","従来技術","新技術","従来技術","新技術","従来技術","新技術","従来技術","新技術","従来技術","新技術","従来技術","新技術","従来技術","新技術","従来技術","新技術","従来技術","新技術","従来技術","新技術","従来技術","新技術","従来技術","新技術","従来技術","新技術","従来技術","新技術","従来技術","新技術","従来技術","新技術","従来技術","新技術","従来技術","新技術","従来技術","新技術","従来技術","新技術","従来技術","新技術","従来技術","新技術","従来技術","新技術","従来技術","新技術","従来技術","新技術","従来技術","新技術","従来技術","新技術","従来技術","新技術","従来技術","新技術","従来技術","新技術","従来技術","新技術","従来技術","新技術","従来技術","新技術","従来技術","新技術","従来技術","新技術"]
[null,"⑪","施工費用\n注1）","施工費等",null,266400,259908,266400,140666,266400,266000,266400,277100,266400,229100,266400,338200,266400,433100,266400,266000,266400,308759,266400,"未回答",266400,180700,266400,233733,266400,265967,266400,94000,266400,"未回答",266400,186870.66666666666,266400,263160,266400,386000,266400,288100,266400,388000,266400,410780,266400,410780,266400,587000,266400,239374,266400,266400,266400,232765,266400,315100,266400,326000,266400,"未回答",266400,266400,266400,"未回答",266400,266400,266400,236336,266400,236336,266400,165000,266400,198600,266400,266400,266400,267200,266400,263300,266400,519000,266400,340000,266400,215200,266400,238683,266400,210900,266400,266400,266400,"未回答",266400,108360,266400,253240,"／","／",266400,326000,266400,100000,266400,200000,266400,266400]
[null,null,null,"表面含浸材材料費",null,185649,264000,57519,374533,185649,170000,166147,268400,185649,193100,185649,212800,185649,178500,166147,110000,166147,130900,57519,"未回答",166147,319200,166147,186667,166147,280000,166147,126000,166147,"未回答",57519,231000,57519,216840,166147,264000,185649,175000,166147,252000,166147,161700,166147,161700,185649,661500,57519,347382,166147,79000,185649,393335,166147,200000,185649,188100,166147,"未回答",166147,202500,185649,"未回答",166147,328400,185649,157080,185649,192133,166147,225000,166147,247600,166147,452040,166147,198000,57519,144000,185649,425700,166147,220000,166147,215600,166147,210667,185649,304200,166147,100000,166147,"未回答",185649,212630,185649,165000,"／","／",185649,255000,57519,165000,57519,120000,185649,153500]
[null,null,null,"合計",null,{"$f":"SUM(F32:F33)","v":452049},{"$f":"SUM(G32:G33)","v":523908},{"$f":"SUM(H32:H33)","v":323919},515199,452049,436000,432547,545500,452049,422200,452049,551000,452049,611600,432547,376000,432547,439659,323919,"未回答",432547,499900,432547,420400,432547,545967,432547,220000,432547,"未回答",323919,417870.66666666663,323919,480000,432547,650000,452049,463100,432547,640000,432547,572480,432547,572480,452049,1248500,323919,586756,432547,345400,452049,626100,432547,515100,452049,514100,432547,"未回答",432547,468900,452049,"未回答",432547,594800,452049,393416,{"$f":"SUM(BT32:BT33)","v":452049},428469,432547,390000,432547,446200,432547,718440,432547,465200,323919,407300,452049,944700,432547,560000,432547,430800,432547,449350,452049,515100,432547,366400,432547,"未回答",452049,320990,452049,418240,"／","／",{"$f":"SUM(CZ32:CZ33)","v":452049},{"$f":"SUM(DA32:DA33)","v":581000},{"$f":"SUM(DB32:DB33)","v":323919},{"$f":"SUM(DC32:DC33)","v":265000},{"$f":"SUM(DD32:DD33)","v":323919},{"$f":"SUM(DE32:DE33)","v":320000},{"$f":"SUM(DF32:DF33)","v":452049},{"$f":"SUM(DG32:DG33)","v":419900}]
[null,"⑫","施工日数","合計（塗布完了後の養生時間は含まない）",null,{"$f":"SUM(F36:F37)","v":1.8699999999999999},{"$f":"SUM(G36:G37)","v":2},{"$f":"SUM(H36:H37)","v":1.8699999999999999},1.17,1.8699999999999999,1.8699999999999999,1.8699999999999999,1.71,1.8699999999999999,1.8699999999999999,1.8699999999999999,1,1.8699999999999999,2.1799999999999997,1.8699999999999999,1.8699999999999999,1.8699999999999999,1.8699999999999999,1.8699999999999999,"未回答",1.8699999999999999,2.0499999999999998,1.8699999999999999,1.51,1.8699999999999999,1.85,1.8699999999999999,0.87,1.8699999999999999,"未回答",1.8699999999999999,1.34,1.8699999999999999,3,1.8699999999999999,2.4699999999999998,1.8699999999999999,1.89,1.8699999999999999,2.4699999999999998,1.8699999999999999,2.1799999999999997,1.8699999999999999,2.1799999999999997,1.8699999999999999,2.5099999999999998,1.8699999999999999,1.6800000000000002,1.8699999999999999,2.1799999999999997,1.8699999999999999,2,1.8699999999999999,1.51,1.8699999999999999,1.74,1.8699999999999999,"未回答",1.8699999999999999,1.51,1.8699999999999999,"未回答",1.8699999999999999,1.1000000000000001,1.8699999999999999,1.67,{"$f":"SUM(BT36:BT37)","v":1.8699999999999999},1.67,1.8699999999999999,0.66,1.8699999999999999,1,1.8699999999999999,1.1000000000000001,1.8699999999999999,2.1799999999999997,1.8699999999999999,1.5,1.8699999999999999,4.2,1.8699999999999999,3,1.8699999999999999,1.51,1.8699999999999999,1.68,1.8699999999999999,1.51,1.8699999999999999,1.8699999999999999,1.8699999999999999,"未回答",1.8699999999999999,3,1.8699999999999999,1.8699999999999999,"／","／",{"$f":"SUM(CZ36:CZ37)","v":1.8699999999999999},{"$f":"SUM(DA36:DA37)","v":1.74},{"$f":"SUM(DB36:DB37)","v":1.8699999999999999},{"$f":"SUM(DC36:DC37)","v":0.68},{"$f":"SUM(DD36:DD37)","v":1.8699999999999999},1,{"$f":"SUM(DF36:DF37)","v":1.8699999999999999},1.93]
[null,null,null,"内訳","下地処理",1.18,1,1.18,0.17,1.18,1.18,1.18,1.38,1.18,1.18,1.18,0.5,1.18,1.18,1.18,1.18,1.18,1.18,1.18,"-",1.18,1.38,1.18,1.18,1.18,1.18,1.18,0.5,1.18,"-",1.18,0.34,1.18,"-",1.18,1,1.18,1.18,1.18,1,1.18,1.18,1.18,1.18,1.18,1.18,1.18,0.34,1.18,1.18,1.18,1.36,1.18,1.18,1.18,1.18,1.18,"-",1.18,1.18,1.18,"-",1.18,1,1.18,1,1.18,1,1.18,0.33,1.18,"-",1.18,1,1.18,1.18,1.18,1,1.18,2.2000000000000002,1.18,1,1.18,1.18,1.18,1.18,1.18,1.18,1.18,1.18,1.18,"-",1.18,1,1.18,1.18,"／","／",1.18,1.18,1.18,0.34,1.18,"-",1.18,1.18]
[null,null,null,null,"含浸材塗布",0.69,1,0.69,1,0.69,0.69,0.69,0.33,0.69,0.69,0.69,0.5,0.69,1,0.69,0.69,0.69,0.69,0.69,"-",0.69,0.67,0.69,0.33,0.69,0.67,0.69,0.37,0.69,"-",0.69,1,0.69,"-",0.69,1.47,0.69,0.71,0.69,1.47,0.69,1,0.69,1,0.69,1.33,0.69,1.34,0.69,1,0.69,0.64,0.69,0.33,0.69,0.56000000000000005,0.69,"-",0.69,0.33,0.69,"-",0.69,0.1,0.69,0.67,0.69,0.67,0.69,0.33,0.69,"-",0.69,0.1,0.69,1,0.69,0.5,0.69,2,0.69,2,0.69,0.33,0.69,0.5,0.69,0.33,0.69,0.69,0.69,"-",0.69,2,0.69,0.69,"／","／",0.69,0.56000000000000005,0.69,0.34,0.69,"-",0.69,0.78]
[null,"⑬","施工工程",null,null,"下地処理→含浸材塗布（2回）→養生","下地処理・乾燥→含浸材塗布→乾燥養生（2時間）→含浸材塗布→乾燥養生（24時間）","下地処理→含浸材塗布（2回）→養生","下地処理・指触乾燥→塗布[4回]→指触乾燥","下地処理→含浸材塗布（2回）→養生","下地処理・乾燥→含浸材塗布→乾燥養生（48時間）","下地処理→含浸材塗布（2回）→養生","下地処理・散水→含浸剤塗布→湿潤養生（1.5時間）","下地処理→含浸材塗布（2回）→養生","下地処理・乾燥→含浸材塗布→乾燥養生（6時間）","下地処理→含浸材塗布（2回）→養生","下地処理・乾燥→含浸材塗布→乾燥養生（24時間）","下地処理→含浸材塗布（2回）→養生","下地処理・乾燥→含浸材塗布→指触乾燥→含浸材塗布→乾燥養生（4時間）","下地処理→含浸材塗布（2回）→養生","下地処理→2液の混合攪拌→含浸剤塗布→乾燥養生（24時間）","下地処理→含浸材塗布（2回）→養生","下地処理→含浸材塗布（2回）→乾燥養生（12時間）","下地処理→含浸材塗布（2回）→養生","下地処理→A液塗布→養生→B液塗布（2回）→養生","下地処理→含浸材塗布（2回）→養生","下地処理→塗布面乾燥→含浸剤塗布→浸透散水→含浸剤塗布→浸透散水→養生","下地処理→含浸材塗布（2回）→養生","下地処理→含浸材塗布（2回）→養生","下地処理→含浸材塗布（2回）→養生","下地処理→補助剤塗布→養生→含浸材塗布（2回）→養生","下地処理→含浸材塗布（2回）→養生","下地処理→含浸材塗布（1回）→養生","下地処理→含浸材塗布（2回）→養生","下地処理→FS-#50塗布→乾燥養生→FS-#55塗布→散水養生","下地処理→含浸材塗布（2回）→養生","下地処理→含浸材塗布→表面乾燥→含浸材塗布→養生","下地処理→含浸材塗布（2回）→養生","下地処理→Sクリートアップ塗布（1回）→養生→Sクリートガード塗布（2回）→養生","下地処理→含浸材塗布（2回）→養生","下地処理→含浸材塗布（2回）→養生","下地処理→含浸材塗布（2回）→養生","下地処理・乾燥→含浸剤塗布→乾燥養生（24時間）","下地処理→含浸材塗布（2回）→養生","下地処理・散水→含浸剤塗布→表面乾燥→散水→含浸剤塗布→表面乾燥→湿潤養生","下地処理→含浸材塗布（2回）→養生","下地処理・散水→含浸剤塗布→湿潤養生（0.5～1時間）→含浸剤塗布→湿潤養生（0.5～1時間）","下地処理→含浸材塗布（2回）→養生","下地処理・散水→含浸剤塗布→湿潤養生（0.5～1時間）→含浸剤塗布→湿潤養生（0.5～1時間）","下地処理→含浸材塗布（2回）→養生","下地処理・乾燥→含浸材塗布（3回程度、間隔20分）→乾燥養生（4時間）","下地処理→含浸材塗布（2回）→養生","下地処理・散水→ 補助剤塗布→主剤塗付→表乾→主剤塗付→補助剤塗布→気乾後、3日間湿潤養生","下地処理→含浸材塗布（2回）→養生","下地処理・乾燥→含浸材塗布→乾燥養生（24時間）","下地処理→含浸材塗布（2回）→養生","下地処理・乾燥→含浸材塗布→乾燥養生（24時間）","下地処理→含浸材塗布（2回）→養生","下地処理・散水→含浸剤塗布→湿潤養生（30分）→含浸剤塗布→湿潤養生（30分～45分）","下地処理→含浸材塗布（2回）→養生","下地処理・乾燥→含浸材塗布→乾燥養生（24時間）","下地処理→含浸材塗布（2回）→養生","下地処理→含浸剤塗布→湿潤養生（自然乾燥)→含浸剤塗布→湿潤養生（1～2時間）","下地処理→含浸材塗布（2回）→養生","下地処理→含浸材塗布（2回塗布の場合、塗布間隔30分）→18時間乾燥","下地処理→含浸材塗布（2回）→養生","下地処理→含浸材塗布（1回）→表面乾燥→表面塗布材塗布（1回）→乾燥養生","下地処理→含浸材塗布（2回）→養生","下地処理・散水→含浸剤塗布→湿潤養生（30～40分）→含浸剤塗布→湿潤養生（30～45分）","下地処理→含浸材塗布（2回）→養生","下地処理→含浸材塗布（1回）→乾燥養生","下地処理→含浸材塗布（2回）→養生","下地処理→含浸材塗布（1回）→乾燥養生","下地処理→含浸材塗布（2回）→養生","下地処理→含浸材塗布（1回）→養生","下地処理→含浸材塗布（2回）→養生","下地処理→含浸材塗布（1回）→養生","下地処理→含浸材塗布（2回）→養生","下地処理→プラスCa、含浸材塗布（2回）→養生","下地処理→含浸材塗布（2回）→養生","下地処理→含浸材塗布（1回）→養生","下地処理→含浸材塗布（2回）→養生","注）開発者の回答は、「下地処理工、表面含浸材塗布工」の合計である。","下地処理→含浸材塗布（2回）→養生","下地処理→プライマー塗布（2回～3回）→含浸材塗布（1回）→養生","下地処理→含浸材塗布（2回）→養生","下地処理→清掃→含浸材塗布（2回）→養生","下地処理→含浸材塗布（2回）→養生","下地処理→含浸材塗布（1回）","下地処理→含浸材塗布（2回）→養生","下地処理→含浸材塗布（1回）","下地処理→含浸材塗布（2回）→養生","下地処理→養生→含浸材塗布（1回）→乾燥養生（2時間）","下地処理→含浸材塗布（2回）→養生","下地処理→含浸材塗布（2回）→乾燥養生","下地処理→含浸材塗布（2回）→養生","事前散水→表面被覆材の張付け→養生（含浸材浸透）→表面被覆材の撤去","下地処理→含浸材塗布（2回）→養生","下地処理→清掃・洗浄→養生→含浸材塗布→養生(24時間)→親水化剤塗布→養生（24時間）","下地処理→含浸材塗布（2回）→養生","下地処理→乾燥→含侵材塗布（1回）→乾燥養生（8時間以上）","／","／","下地処理→含浸材塗布（2回）→養生","素地調整→含浸材塗布（1回）→養生（24時間以上）","下地処理→含浸材塗布（2回）→養生","下地処理→含浸材塗布→乾燥養生（24時間）","下地処理→含浸材塗布（2回）→養生","下地処理→含浸材塗布→養生","下地処理→含浸材塗布（2回）→養生","下地処理→乾燥→含浸材塗布（1回）→養生（8時間以上）"]
[null,"⑭","塗布回数",null,null,"　2回程度（シラン系1～3回、けい酸塩系1～2回） 注2)","2回","　2回程度（シラン系1～3回、けい酸塩系1～2回） 注2)","4回（浸透促進剤1回、主剤2回、結晶促進剤1回）","　2回程度（シラン系1～3回、けい酸塩系1～2回） 注2)","1回","2回程度（シラン系1～3回、けい酸塩系1～2回） 注2)","1回","　2回程度（シラン系1～3回、けい酸塩系1～2回） 注2)","1回","　2回程度（シラン系1～3回、けい酸塩系1～2回） 注2)","1回","　2回程度（シラン系1～3回、けい酸塩系1～2回） 注2)","２回","2回程度（シラン系1～3回、けい酸塩系1～2回） 注2)","1回（2液は塗布前に混合する）","　2回程度（シラン系1～3回、けい酸塩系1～2回） 注2)","1回","2回程度（シラン系1～3回、けい酸塩系1～2回） 注2)","3回","2回程度（シラン系1～3回、けい酸塩系1～2回） 注2)","2回","2回程度（シラン系1～3回、けい酸塩系1～2回） 注2)","2回","2回程度（シラン系1～3回、けい酸塩系1～2回） 注2)","3回","2回程度（シラン系1～3回、けい酸塩系1～2回） 注2)","1回","2回程度（シラン系1～3回、けい酸塩系1～2回） 注2)","2回","　2回程度（シラン系1～3回、けい酸塩系1～2回） 注2)","2回","2回程度（シラン系1～3回、けい酸塩系1～2回） 注2)","Sクリートアップ1回、Sクリートガード2回","2回程度（シラン系1～3回、けい酸塩系1～2回） 注2)","2回","　2回程度（シラン系1～3回、けい酸塩系1～2回） 注2)","1回","　2回程度（シラン系1～3回、けい酸塩系1～2回） 注2)","2回","　2回程度（シラン系1～3回、けい酸塩系1～2回） 注2)","2回（養生用は1回）","2回程度（シラン系1～3回、けい酸塩系1～2回） 注2)","2回（新設構造物の場合1回）","　2回程度（シラン系1～3回、けい酸塩系1～2回） 注2)","3回（状況によって2～6回）","2回程度（シラン系1～3回、けい酸塩系1～2回） 注2)","4回（主剤2回、補助剤2回）","　2回程度（シラン系1～3回、けい酸塩系1～2回） 注2)","1回（反応性が速いため連続2回塗り）","　2回程度（シラン系1～3回、けい酸塩系1～2回） 注2)","1回","2回程度（シラン系1～3回、けい酸塩系1～2回） 注2)","2回","　2回程度（シラン系1～3回、けい酸塩系1～2回） 注2)","1回","　2回程度（シラン系1～3回、けい酸塩系1～2回） 注2)","2回","2回程度（シラン系1～3回、けい酸塩系1～2回） 注2)","1回（垂直面、天井面は2回塗布）","2回程度（シラン系1～3回、けい酸塩系1～2回） 注2)","2回（含浸材1回、表面塗布材1回）","2回程度（シラン系1～3回、けい酸塩系1～2回） 注2)","連続2回","2回程度（シラン系1～3回、けい酸塩系1～2回） 注2)","1回","2回程度（シラン系1～3回、けい酸塩系1～2回） 注2)","1回","　2回程度（シラン系1～3回、けい酸塩系1～2回） 注2)","1回","　2回程度（シラン系1～3回、けい酸塩系1～2回） 注2)","1回","　2回程度（シラン系1～3回、けい酸塩系1～2回） 注2)","2回","　2回程度（シラン系1～3回、けい酸塩系1～2回） 注2)","1回","　2回程度（シラン系1～3回、けい酸塩系1～2回） 注2)","1回目","　2回程度（シラン系1～3回、けい酸塩系1～2回） 注2)","3回～4回","　2回程度（シラン系1～3回、けい酸塩系1～2回） 注2)","2回","　2回程度（シラン系1～3回、けい酸塩系1～2回） 注2)","1回","　2回程度（シラン系1～3回、けい酸塩系1～2回） 注2)","1回","　2回程度（シラン系1～3回、けい酸塩系1～2回） 注2)","1回","　2回程度（シラン系1～3回、けい酸塩系1～2回） 注2)","2回","　2回程度（シラン系1～3回、けい酸塩系1～2回） 注2)","1回","　2回程度（シラン系1～3回、けい酸塩系1～2回） 注2)","2回（含浸材1回、親水化剤1回）","　2回程度（シラン系1～3回、けい酸塩系1～2回） 注2)","1回","／","／","　2回程度（シラン系1～3回、けい酸塩系1～2回） 注2)","１回","　2回程度（シラン系1～3回、けい酸塩系1～2回） 注2)","1回","　2回程度（シラン系1～3回、けい酸塩系1～2回） 注2)","１回","　2回程度（シラン系1～3回、けい酸塩系1～2回） 注2)","１回"]
[null,"⑮","塗布量",null,null,"　0.1～0.35kg/㎡ (概算条件：0.225kg/㎡）注2)","0.15kg/㎡","　0.1～0.35kg/㎡ (概算条件：0.225kg/㎡）注2)","主剤150ｃｃ/㎡（密度1.00ｇ/cm3）","　0.1～0.35kg/㎡ (概算条件：0.225kg/㎡）注2)","0.20kg/㎡","　0.1～0.35kg/㎡ (概算条件：0.225kg/㎡）注2)","0.22kg/㎡","　0.1～0.35kg/㎡ (概算条件：0.225kg/㎡）注2)","0.13kg/㎡（既設）  (0.10kg/㎡（新設）)","　0.1～0.35kg/㎡ (概算条件：0.225kg/㎡）注2)","0.19kg/㎡","　0.1～0.35kg/㎡ (概算条件：0.225kg/㎡）注2)","0.3L/㎡（0.2～0.3L/㎡）　（密度0.88ｇ/cm3)","　0.1～0.35kg/㎡ (概算条件：0.225kg/㎡）注2)","0.25kg/㎡（2液混合　A液：B液＝100：46）","　0.1～0.35kg/㎡ (概算条件：0.225kg/㎡）注2)","0.20kg/㎡","　0.1～0.35kg/㎡ (概算条件：0.225kg/㎡）注2)","A液：0.25kg/㎡、B液：0.2L/㎡","　0.1～0.35kg/㎡ (概算条件：0.225kg/㎡）注2)","0.25kg/㎡","　0.1～0.35kg/㎡ (概算条件：0.225kg/㎡）注2)","0.3kg/㎡","　0.1～0.35kg/㎡ (概算条件：0.225kg/㎡）注2)","リアクトライズ：0.3kg/㎡、カルサプリ：0.133kg/㎡","　0.1～0.35kg/㎡ (概算条件：0.225kg/㎡）注2)","0.2kg/㎡","　0.1～0.35kg/㎡ (概算条件：0.225kg/㎡）注2)","FS-#50：0.25kg/㎡、FS-#55：0.25kg/㎡","　0.1～0.35kg/㎡ (概算条件：0.225kg/㎡）注2)","0.2kg/㎡（2回合計）","　0.1～0.35kg/㎡ (概算条件：0.225kg/㎡）注2)","0.35kg/㎡","　0.1～0.35kg/㎡ (概算条件：0.225kg/㎡）注2)","0.3kg/㎡","　0.1～0.35kg/㎡ (概算条件：0.225kg/㎡）注2)","0.20kg/㎡","　0.1～0.35kg/㎡ (概算条件：0.225kg/㎡）注2)","0.30kg/㎡（1回塗りの場合0.20kg/㎡）","　0.1～0.35kg/㎡ (概算条件：0.225kg/㎡）注2)","0.25L/㎡（現場で2倍希釈したもの、養生用は0.15L/㎡、ただし防水用・塩害用には希釈済製品がある）","　0.1～0.35kg/㎡ (概算条件：0.225kg/㎡）注2)","0.25L/㎡（現場で2倍希釈したもの、1回塗布は0.15L/㎡）","　0.1～0.35kg/㎡ (概算条件：0.225kg/㎡）注2)","0.6L/㎡（密度0.88ｇ/cm3)","　0.1～0.35kg/㎡ (概算条件：0.225kg/㎡）注2)","主剤1.2kg/㎡（2回合計）","　0.1～0.35kg/㎡ (概算条件：0.225kg/㎡）注2)","0.30L/㎡　(密度1.05ｇ/cm3)","　0.1～0.35kg/㎡ (概算条件：0.225kg/㎡）注2)","0.50kg/㎡","　0.1～0.35kg/㎡ (概算条件：0.225kg/㎡）注2)","0.20kg/㎡","　0.1～0.35kg/㎡ (概算条件：0.225kg/㎡）注2)","0.20kg/㎡（標準）（厳しい条件の場合0.35kg/㎡（1回塗布））","　0.1～0.35kg/㎡ (概算条件：0.225kg/㎡）注2)","0.24kg/㎡","　0.1～0.35kg/㎡ (概算条件：0.225kg/㎡）注2)","0.30kg/㎡（基準処理量0.25～0.30kg/㎡）","　0.1～0.35kg/㎡ (概算条件：0.225kg/㎡）注2)","含浸材0.275kg/㎡、表面塗布材0.275kg/㎡（ロス率10％を含む）","　0.1～0.35kg/㎡ (概算条件：0.225kg/㎡）注2)","0.2kg/㎡","　0.1～0.35kg/㎡ (概算条件：0.225kg/㎡）注2)","0.214kg/㎡（ロス率7％含む）","　0.1～0.35kg/㎡ (概算条件：0.225kg/㎡）注2)","0.214kg/㎡（ロス率7％含む）","　0.1～0.35kg/㎡ (概算条件：0.225kg/㎡）注2)","0.223kg/㎡","　0.1～0.35kg/㎡ (概算条件：0.225kg/㎡）注2)","0.150kg/㎡","　0.1～0.35kg/㎡ (概算条件：0.225kg/㎡）注2)","（プラスCa）0.200kg/㎡+（けい酸塩系含浸材）0.200kg/㎡","　0.1～0.35kg/㎡ (概算条件：0.225kg/㎡）注2)","0.20～0.35kg/m2","　0.1～0.35kg/㎡ (概算条件：0.225kg/㎡）注2)","0.2kg/m2","　0.1～0.35kg/㎡ (概算条件：0.225kg/㎡）注2)","0.300kg/㎡","　0.1～0.35kg/㎡ (概算条件：0.225kg/㎡）注2)","0.2kg/㎡","　0.1～0.35kg/㎡ (概算条件：0.225kg/㎡）注2)","0.2ｋg/㎡","　0.1～0.35kg/㎡ (概算条件：0.225kg/㎡）注2)","0.25kg/㎡（0.2～0.3㎏/㎡）","　0.1～0.35kg/㎡ (概算条件：0.225kg/㎡）注2)","0.21㎏/㎡","　0.1～0.35kg/㎡ (概算条件：0.225kg/㎡）注2)","0.20kg/㎡","　0.1～0.35kg/㎡ (概算条件：0.225kg/㎡）注2)","0.14kg/㎡","　0.1～0.35kg/㎡ (概算条件：0.225kg/㎡）注2)","0.2kg/㎡","　0.1～0.35kg/㎡ (概算条件：0.225kg/㎡）注2)","0.22kg/m2(施工時のロス率10％含む）","／","／","　0.1～0.35kg/㎡ (概算条件：0.225kg/㎡）注2)","0.23kg/㎡（ロス10％含む）","　0.1～0.35kg/㎡ (概算条件：0.225kg/㎡）注2)","0.1kg/㎡（ロス10％含む）","　0.1～0.35kg/㎡ (概算条件：0.225kg/㎡）注2)","標準塗布量が0.4kg/㎡(ロス量込み)","　0.1～0.35kg/㎡ (概算条件：0.225kg/㎡）注2)","0.18kg/m2（加えて5%程度のロス率を要考慮）"]
[null,"⑯","統一した従来技術との比較",null,"経済性",{"$f":"IFERROR(IF(G34=\"-\",\"-\",IF(G34=\"\",\"-\",IF(G34/F34=1,\"△\",IF(G34/F34>1,\"-（\"&ABS(ROUND(100*G34/F34-100,1))&\"％増）\",IF(G34/F34<1,\"○（\"&ABS(ROUND(100*G34/F34-100,1))&\"％減）\",\"\"))))),\"-\")","v":"-（15.9％増）"},{"$f":"IFERROR(IF(F34=\"-\",\"-\",\"（\"&TEXT(G34,\"#,###\")&\"-\"&TEXT(F34,\"#,###\")&\"）/\"&TEXT(F34,\"#,###\")&\"=\"&TEXT((G34-F34)/F34*100,\"0.0\")&\"%\"),\"-\")","v":"（523,908-452,049）/452,049=15.9%"},{"$f":"IFERROR(IF(I34=\"-\",\"-\",IF(I34=\"\",\"-\",IF(I34/H34=1,\"△\",IF(I34/H34>1,\"-（\"&ABS(ROUND(100*I34/H34-100,1))&\"％増）\",IF(I34/H34<1,\"○（\"&ABS(ROUND(100*I34/H34-100,1))&\"％減）\",\"\"))))),\"-\")","v":"-（59.1％増）"},{"$f":"IFERROR(IF(H34=\"-\",\"-\",\"（\"&TEXT(I34,\"#,###\")&\"-\"&TEXT(H34,\"#,###\")&\"）/\"&TEXT(H34,\"#,###\")&\"=\"&TEXT((I34-H34)/H34*100,\"0.0\")&\"%\"),\"-\")","v":"（515,199-323,919）/323,919=59.1%"},{"$f":"IFERROR(IF(K34=\"-\",\"-\",IF(K34=\"\",\"-\",IF(K34/J34=1,\"△\",IF(K34/J34>1,\"-（\"&ABS(ROUND(100*K34/J34-100,1))&\"％増）\",IF(K34/J34<1,\"○（\"&ABS(ROUND(100*K34/J34-100,1))&\"％減）\",\"\"))))),\"-\")","v":"○（3.6％減）"},{"$f":"IFERROR(IF(J34=\"-\",\"-\",\"（\"&TEXT(K34,\"#,###\")&\"-\"&TEXT(J34,\"#,###\")&\"）/\"&TEXT(J34,\"#,###\")&\"=\"&TEXT((K34-J34)/J34*100,\"0.0\")&\"%\"),\"-\")","v":"（436,000-452,049）/452,049=-3.6%"},{"$f":"IFERROR(IF(M34=\"-\",\"-\",IF(M34=\"\",\"-\",IF(M34/L34=1,\"△\",IF(M34/L34>1,\"-（\"&ABS(ROUND(100*M34/L34-100,1))&\"％増）\",IF(M34/L34<1,\"○（\"&ABS(ROUND(100*M34/L34-100,1))&\"％減）\",\"\"))))),\"-\")","v":"-（26.1％増）"},{"$f":"IFERROR(IF(L34=\"-\",\"-\",\"（\"&TEXT(M34,\"#,###\")&\"-\"&TEXT(L34,\"#,###\")&\"）/\"&TEXT(L34,\"#,###\")&\"=\"&TEXT((M34-L34)/L34*100,\"0.0\")&\"%\"),\"-\")","v":"（545,500-432,547）/432,547=26.1%"},{"$f":"IFERROR(IF(O34=\"-\",\"-\",IF(O34=\"\",\"-\",IF(O34/N34=1,\"△\",IF(O34/N34>1,\"-（\"&ABS(ROUND(100*O34/N34-100,1))&\"％増）\",IF(O34/N34<1,\"○（\"&ABS(ROUND(100*O34/N34-100,1))&\"％減）\",\"\"))))),\"-\")","v":"○（6.6％減）"},{"$f":"IFERROR(IF(N34=\"-\",\"-\",\"（\"&TEXT(O34,\"#,###\")&\"-\"&TEXT(N34,\"#,###\")&\"）/\"&TEXT(N34,\"#,###\")&\"=\"&TEXT((O34-N34)/N34*100,\"0.0\")&\"%\"),\"-\")","v":"（422,200-452,049）/452,049=-6.6%"},{"$f":"IFERROR(IF(Q34=\"-\",\"-\",IF(Q34=\"\",\"-\",IF(Q34/P34=1,\"△\",IF(Q34/P34>1,\"-（\"&ABS(ROUND(100*Q34/P34-100,1))&\"％増）\",IF(Q34/P34<1,\"○（\"&ABS(ROUND(100*Q34/P34-100,1))&\"％減）\",\"\"))))),\"-\")","v":"-（21.9％増）"},{"$f":"IFERROR(IF(P34=\"-\",\"-\",\"（\"&TEXT(Q34,\"#,###\")&\"-\"&TEXT(P34,\"#,###\")&\"）/\"&TEXT(P34,\"#,###\")&\"=\"&TEXT((Q34-P34)/P34*100,\"0.0\")&\"%\"),\"-\")","v":"（551,000-452,049）/452,049=21.9%"},{"$f":"IFERROR(IF(S34=\"-\",\"-\",IF(S34=\"\",\"-\",IF(S34/R34=1,\"△\",IF(S34/R34>1,\"-（\"&ABS(ROUND(100*S34/R34-100,1))&\"％増）\",IF(S34/R34<1,\"○（\"&ABS(ROUND(100*S34/R34-100,1))&\"％減）\",\"\"))))),\"-\")","v":"-（35.3％増）"},{"$f":"IFERROR(IF(R34=\"-\",\"-\",\"（\"&TEXT(S34,\"#,###\")&\"-\"&TEXT(R34,\"#,###\")&\"）/\"&TEXT(R34,\"#,###\")&\"=\"&TEXT((S34-R34)/R34*100,\"0.0\")&\"%\"),\"-\")","v":"（611,600-452,049）/452,049=35.3%"},{"$f":"IFERROR(IF(U34=\"-\",\"-\",IF(U34=\"\",\"-\",IF(U34/T34=1,\"△\",IF(U34/T34>1,\"-（\"&ABS(ROUND(100*U34/T34-100,1))&\"％増）\",IF(U34/T34<1,\"○（\"&ABS(ROUND(100*U34/T34-100,1))&\"％減）\",\"\"))))),\"-\")","v":"○（13.1％減）"},{"$f":"IFERROR(IF(T34=\"-\",\"-\",\"（\"&TEXT(U34,\"#,###\")&\"-\"&TEXT(T34,\"#,###\")&\"）/\"&TEXT(T34,\"#,###\")&\"=\"&TEXT((U34-T34)/T34*100,\"0.0\")&\"%\"),\"-\")","v":"（376,000-432,547）/432,547=-13.1%"},{"$f":"IFERROR(IF(W34=\"-\",\"-\",IF(W34=\"\",\"-\",IF(W34/V34=1,\"△\",IF(W34/V34>1,\"-（\"&ABS(ROUND(100*W34/V34-100,1))&\"％増）\",IF(W34/V34<1,\"○（\"&ABS(ROUND(100*W34/V34-100,1))&\"％減）\",\"\"))))),\"-\")","v":"-（1.6％増）"},{"$f":"IFERROR(IF(V34=\"-\",\"-\",\"（\"&TEXT(W34,\"#,###\")&\"-\"&TEXT(V34,\"#,###\")&\"）/\"&TEXT(V34,\"#,###\")&\"=\"&TEXT((W34-V34)/V34*100,\"0.0\")&\"%\"),\"-\")","v":"（439,659-432,547）/432,547=1.6%"},{"$f":"IFERROR(IF(Y34=\"-\",\"-\",IF(Y34=\"\",\"-\",IF(Y34/X34=1,\"△\",IF(Y34/X34>1,\"-（\"&ABS(ROUND(100*Y34/X34-100,1))&\"％増）\",IF(Y34/X34<1,\"○（\"&ABS(ROUND(100*Y34/X34-100,1))&\"％減）\",\"\"))))),\"-\")","v":"-"},{"$f":"IFERROR(IF(X34=\"-\",\"-\",\"（\"&TEXT(Y34,\"#,###\")&\"-\"&TEXT(X34,\"#,###\")&\"）/\"&TEXT(X34,\"#,###\")&\"=\"&TEXT((Y34-X34)/X34*100,\"0.0\")&\"%\"),\"-\")","v":"-"},{"$f":"IFERROR(IF(AA34=\"-\",\"-\",IF(AA34=\"\",\"-\",IF(AA34/Z34=1,\"△\",IF(AA34/Z34>1,\"-（\"&ABS(ROUND(100*AA34/Z34-100,1))&\"％増）\",IF(AA34/Z34<1,\"○（\"&ABS(ROUND(100*AA34/Z34-100,1))&\"％減）\",\"\"))))),\"-\")","v":"-（15.6％増）"},{"$f":"IFERROR(IF(Z34=\"-\",\"-\",\"（\"&TEXT(AA34,\"#,###\")&\"-\"&TEXT(Z34,\"#,###\")&\"）/\"&TEXT(Z34,\"#,###\")&\"=\"&TEXT((AA34-Z34)/Z34*100,\"0.0\")&\"%\"),\"-\")","v":"（499,900-432,547）/432,547=15.6%"},{"$f":"IFERROR(IF(AC34=\"-\",\"-\",IF(AC34=\"\",\"-\",IF(AC34/AB34=1,\"△\",IF(AC34/AB34>1,\"-（\"&ABS(ROUND(100*AC34/AB34-100,1))&\"％増）\",IF(AC34/AB34<1,\"○（\"&ABS(ROUND(100*AC34/AB34-100,1))&\"％減）\",\"\"))))),\"-\")","v":"○（2.8％減）"},{"$f":"IFERROR(IF(AB34=\"-\",\"-\",\"（\"&TEXT(AC34,\"#,###\")&\"-\"&TEXT(AB34,\"#,###\")&\"）/\"&TEXT(AB34,\"#,###\")&\"=\"&TEXT((AC34-AB34)/AB34*100,\"0.0\")&\"%\"),\"-\")","v":"（420,400-432,547）/432,547=-2.8%"},{"$f":"IFERROR(IF(AE34=\"-\",\"-\",IF(AE34=\"\",\"-\",IF(AE34/AD34=1,\"△\",IF(AE34/AD34>1,\"-（\"&ABS(ROUND(100*AE34/AD34-100,1))&\"％増）\",IF(AE34/AD34<1,\"○（\"&ABS(ROUND(100*AE34/AD34-100,1))&\"％減）\",\"\"))))),\"-\")","v":"-（26.2％増）"},{"$f":"IFERROR(IF(AD34=\"-\",\"-\",\"（\"&TEXT(AE34,\"#,###\")&\"-\"&TEXT(AD34,\"#,###\")&\"）/\"&TEXT(AD34,\"#,###\")&\"=\"&TEXT((AE34-AD34)/AD34*100,\"0.0\")&\"%\"),\"-\")","v":"（545,967-432,547）/432,547=26.2%"},{"$f":"IFERROR(IF(AG34=\"-\",\"-\",IF(AG34=\"\",\"-\",IF(AG34/AF34=1,\"△\",IF(AG34/AF34>1,\"-（\"&ABS(ROUND(100*AG34/AF34-100,1))&\"％増）\",IF(AG34/AF34<1,\"○（\"&ABS(ROUND(100*AG34/AF34-100,1))&\"％減）\",\"\"))))),\"-\")","v":"○（49.1％減）"},{"$f":"IFERROR(IF(AF34=\"-\",\"-\",\"（\"&TEXT(AG34,\"#,###\")&\"-\"&TEXT(AF34,\"#,###\")&\"）/\"&TEXT(AF34,\"#,###\")&\"=\"&TEXT((AG34-AF34)/AF34*100,\"0.0\")&\"%\"),\"-\")","v":"（220,000-432,547）/432,547=-49.1%"},{"$f":"IFERROR(IF(AI34=\"-\",\"-\",IF(AI34=\"\",\"-\",IF(AI34/AH34=1,\"△\",IF(AI34/AH34>1,\"-（\"&ABS(ROUND(100*AI34/AH34-100,1))&\"％増）\",IF(AI34/AH34<1,\"○（\"&ABS(ROUND(100*AI34/AH34-100,1))&\"％減）\",\"\"))))),\"-\")","v":"-"},{"$f":"IFERROR(IF(AH34=\"-\",\"-\",\"（\"&TEXT(AI34,\"#,###\")&\"-\"&TEXT(AH34,\"#,###\")&\"）/\"&TEXT(AH34,\"#,###\")&\"=\"&TEXT((AI34-AH34)/AH34*100,\"0.0\")&\"%\"),\"-\")","v":"-"},{"$f":"IFERROR(IF(AK34=\"-\",\"-\",IF(AK34=\"\",\"-\",IF(AK34/AJ34=1,\"△\",IF(AK34/AJ34>1,\"-（\"&ABS(ROUND(100*AK34/AJ34-100,1))&\"％増）\",IF(AK34/AJ34<1,\"○（\"&ABS(ROUND(100*AK34/AJ34-100,1))&\"％減）\",\"\"))))),\"-\")","v":"-（29％増）"},{"$f":"IFERROR(IF(AJ34=\"-\",\"-\",\"（\"&TEXT(AK34,\"#,###\")&\"-\"&TEXT(AJ34,\"#,###\")&\"）/\"&TEXT(AJ34,\"#,###\")&\"=\"&TEXT((AK34-AJ34)/AJ34*100,\"0.0\")&\"%\"),\"-\")","v":"（417,871-323,919）/323,919=29.0%"},{"$f":"IFERROR(IF(AM34=\"-\",\"-\",IF(AM34=\"\",\"-\",IF(AM34/AL34=1,\"△\",IF(AM34/AL34>1,\"-（\"&ABS(ROUND(100*AM34/AL34-100,1))&\"％増）\",IF(AM34/AL34<1,\"○（\"&ABS(ROUND(100*AM34/AL34-100,1))&\"％減）\",\"\"))))),\"-\")","v":"-（48.2％増）"},{"$f":"IFERROR(IF(AL34=\"-\",\"-\",\"（\"&TEXT(AM34,\"#,###\")&\"-\"&TEXT(AL34,\"#,###\")&\"）/\"&TEXT(AL34,\"#,###\")&\"=\"&TEXT((AM34-AL34)/AL34*100,\"0.0\")&\"%\"),\"-\")","v":"（480,000-323,919）/323,919=48.2%"},{"$f":"IFERROR(IF(AO34=\"-\",\"-\",IF(AO34=\"\",\"-\",IF(AO34/AN34=1,\"△\",IF(AO34/AN34>1,\"-（\"&ABS(ROUND(100*AO34/AN34-100,1))&\"％増）\",IF(AO34/AN34<1,\"○（\"&ABS(ROUND(100*AO34/AN34-100,1))&\"％減）\",\"\"))))),\"-\")","v":"-（50.3％増）"},{"$f":"IFERROR(IF(AN34=\"-\",\"-\",\"（\"&TEXT(AO34,\"#,###\")&\"-\"&TEXT(AN34,\"#,###\")&\"）/\"&TEXT(AN34,\"#,###\")&\"=\"&TEXT((AO34-AN34)/AN34*100,\"0.0\")&\"%\"),\"-\")","v":"（650,000-432,547）/432,547=50.3%"},{"$f":"IFERROR(IF(AQ34=\"-\",\"-\",IF(AQ34=\"\",\"-\",IF(AQ34/AP34=1,\"△\",IF(AQ34/AP34>1,\"-（\"&ABS(ROUND(100*AQ34/AP34-100,1))&\"％増）\",IF(AQ34/AP34<1,\"○（\"&ABS(ROUND(100*AQ34/AP34-100,1))&\"％減）\",\"\"))))),\"-\")","v":"-（2.4％増）"},{"$f":"IFERROR(IF(AP34=\"-\",\"-\",\"（\"&TEXT(AQ34,\"#,###\")&\"-\"&TEXT(AP34,\"#,###\")&\"）/\"&TEXT(AP34,\"#,###\")&\"=\"&TEXT((AQ34-AP34)/AP34*100,\"0.0\")&\"%\"),\"-\")","v":"（463,100-452,049）/452,049=2.4%"},{"$f":"IFERROR(IF(AS34=\"-\",\"-\",IF(AS34=\"\",\"-\",IF(AS34/AR34=1,\"△\",IF(AS34/AR34>1,\"-（\"&ABS(ROUND(100*AS34/AR34-100,1))&\"％増）\",IF(AS34/AR34<1,\"○（\"&ABS(ROUND(100*AS34/AR34-100,1))&\"％減）\",\"\"))))),\"-\")","v":"-（48％増）"},{"$f":"IFERROR(IF(AR34=\"-\",\"-\",\"（\"&TEXT(AS34,\"#,###\")&\"-\"&TEXT(AR34,\"#,###\")&\"）/\"&TEXT(AR34,\"#,###\")&\"=\"&TEXT((AS34-AR34)/AR34*100,\"0.0\")&\"%\"),\"-\")","v":"（640,000-432,547）/432,547=48.0%"},{"$f":"IFERROR(IF(AU34=\"-\",\"-\",IF(AU34=\"\",\"-\",IF(AU34/AT34=1,\"△\",IF(AU34/AT34>1,\"-（\"&ABS(ROUND(100*AU34/AT34-100,1))&\"％増）\",IF(AU34/AT34<1,\"○（\"&ABS(ROUND(100*AU34/AT34-100,1))&\"％減）\",\"\"))))),\"-\")","v":"-（32.4％増）"},{"$f":"IFERROR(IF(AT34=\"-\",\"-\",\"（\"&TEXT(AU34,\"#,###\")&\"-\"&TEXT(AT34,\"#,###\")&\"）/\"&TEXT(AT34,\"#,###\")&\"=\"&TEXT((AU34-AT34)/AT34*100,\"0.0\")&\"%\"),\"-\")","v":"（572,480-432,547）/432,547=32.4%"},{"$f":"IFERROR(IF(AW34=\"-\",\"-\",IF(AW34=\"\",\"-\",IF(AW34/AV34=1,\"△\",IF(AW34/AV34>1,\"-（\"&ABS(ROUND(100*AW34/AV34-100,1))&\"％増）\",IF(AW34/AV34<1,\"○（\"&ABS(ROUND(100*AW34/AV34-100,1))&\"％減）\",\"\"))))),\"-\")","v":"-（32.4％増）"},{"$f":"IFERROR(IF(AV34=\"-\",\"-\",\"（\"&TEXT(AW34,\"#,###\")&\"-\"&TEXT(AV34,\"#,###\")&\"）/\"&TEXT(AV34,\"#,###\")&\"=\"&TEXT((AW34-AV34)/AV34*100,\"0.0\")&\"%\"),\"-\")","v":"（572,480-432,547）/432,547=32.4%"},{"$f":"IFERROR(IF(AY34=\"-\",\"-\",IF(AY34=\"\",\"-\",IF(AY34/AX34=1,\"△\",IF(AY34/AX34>1,\"-（\"&ABS(ROUND(100*AY34/AX34-100,1))&\"％増）\",IF(AY34/AX34<1,\"○（\"&ABS(ROUND(100*AY34/AX34-100,1))&\"％減）\",\"\"))))),\"-\")","v":"-（176.2％増）"},{"$f":"IFERROR(IF(AX34=\"-\",\"-\",\"（\"&TEXT(AY34,\"#,###\")&\"-\"&TEXT(AX34,\"#,###\")&\"）/\"&TEXT(AX34,\"#,###\")&\"=\"&TEXT((AY34-AX34)/AX34*100,\"0.0\")&\"%\"),\"-\")","v":"（1,248,500-452,049）/452,049=176.2%"},{"$f":"IFERROR(IF(BA34=\"-\",\"-\",IF(BA34=\"\",\"-\",IF(BA34/AZ34=1,\"△\",IF(BA34/AZ34>1,\"-（\"&ABS(ROUND(100*BA34/AZ34-100,1))&\"％増）\",IF(BA34/AZ34<1,\"○（\"&ABS(ROUND(100*BA34/AZ34-100,1))&\"％減）\",\"\"))))),\"-\")","v":"-（81.1％増）"},{"$f":"IFERROR(IF(AZ34=\"-\",\"-\",\"（\"&TEXT(BA34,\"#,###\")&\"-\"&TEXT(AZ34,\"#,###\")&\"）/\"&TEXT(AZ34,\"#,###\")&\"=\"&TEXT((BA34-AZ34)/AZ34*100,\"0.0\")&\"%\"),\"-\")","v":"（586,756-323,919）/323,919=81.1%"},{"$f":"IFERROR(IF(BC34=\"-\",\"-\",IF(BC34=\"\",\"-\",IF(BC34/BB34=1,\"△\",IF(BC34/BB34>1,\"-（\"&ABS(ROUND(100*BC34/BB34-100,1))&\"％増）\",IF(BC34/BB34<1,\"○（\"&ABS(ROUND(100*BC34/BB34-100,1))&\"％減）\",\"\"))))),\"-\")","v":"○（20.1％減）"},{"$f":"IFERROR(IF(BB34=\"-\",\"-\",\"（\"&TEXT(BC34,\"#,###\")&\"-\"&TEXT(BB34,\"#,###\")&\"）/\"&TEXT(BB34,\"#,###\")&\"=\"&TEXT((BC34-BB34)/BB34*100,\"0.0\")&\"%\"),\"-\")","v":"（345,400-432,547）/432,547=-20.1%"},{"$f":"IFERROR(IF(BE34=\"-\",\"-\",IF(BE34=\"\",\"-\",IF(BE34/BD34=1,\"△\",IF(BE34/BD34>1,\"-（\"&ABS(ROUND(100*BE34/BD34-100,1))&\"％増）\",IF(BE34/BD34<1,\"○（\"&ABS(ROUND(100*BE34/BD34-100,1))&\"％減）\",\"\"))))),\"-\")","v":"-（38.5％増）"},{"$f":"IFERROR(IF(BD34=\"-\",\"-\",\"（\"&TEXT(BE34,\"#,###\")&\"-\"&TEXT(BD34,\"#,###\")&\"）/\"&TEXT(BD34,\"#,###\")&\"=\"&TEXT((BE34-BD34)/BD34*100,\"0.0\")&\"%\"),\"-\")","v":"（626,100-452,049）/452,049=38.5%"},{"$f":"IFERROR(IF(BG34=\"-\",\"-\",IF(BG34=\"\",\"-\",IF(BG34/BF34=1,\"△\",IF(BG34/BF34>1,\"-（\"&ABS(ROUND(100*BG34/BF34-100,1))&\"％増）\",IF(BG34/BF34<1,\"○（\"&ABS(ROUND(100*BG34/BF34-100,1))&\"％減）\",\"\"))))),\"-\")","v":"-（19.1％増）"},{"$f":"IFERROR(IF(BF34=\"-\",\"-\",\"（\"&TEXT(BG34,\"#,###\")&\"-\"&TEXT(BF34,\"#,###\")&\"）/\"&TEXT(BF34,\"#,###\")&\"=\"&TEXT((BG34-BF34)/BF34*100,\"0.0\")&\"%\"),\"-\")","v":"（515,100-432,547）/432,547=19.1%"},{"$f":"IFERROR(IF(BI34=\"-\",\"-\",IF(BI34=\"\",\"-\",IF(BI34/BH34=1,\"△\",IF(BI34/BH34>1,\"-（\"&ABS(ROUND(100*BI34/BH34-100,1))&\"％増）\",IF(BI34/BH34<1,\"○（\"&ABS(ROUND(100*BI34/BH34-100,1))&\"％減）\",\"\"))))),\"-\")","v":"-（13.7％増）"},{"$f":"IFERROR(IF(BH34=\"-\",\"-\",\"（\"&TEXT(BI34,\"#,###\")&\"-\"&TEXT(BH34,\"#,###\")&\"）/\"&TEXT(BH34,\"#,###\")&\"=\"&TEXT((BI34-BH34)/BH34*100,\"0.0\")&\"%\"),\"-\")","v":"（514,100-452,049）/452,049=13.7%"},{"$f":"IFERROR(IF(BK34=\"-\",\"-\",IF(BK34=\"\",\"-\",IF(BK34/BJ34=1,\"△\",IF(BK34/BJ34>1,\"-（\"&ABS(ROUND(100*BK34/BJ34-100,1))&\"％増）\",IF(BK34/BJ34<1,\"○（\"&ABS(ROUND(100*BK34/BJ34-100,1))&\"％減）\",\"\"))))),\"-\")","v":"-"},{"$f":"IFERROR(IF(BJ34=\"-\",\"-\",\"（\"&TEXT(BK34,\"#,###\")&\"-\"&TEXT(BJ34,\"#,###\")&\"）/\"&TEXT(BJ34,\"#,###\")&\"=\"&TEXT((BK34-BJ34)/BJ34*100,\"0.0\")&\"%\"),\"-\")","v":"-"},{"$f":"IFERROR(IF(BM34=\"-\",\"-\",IF(BM34=\"\",\"-\",IF(BM34/BL34=1,\"△\",IF(BM34/BL34>1,\"-（\"&ABS(ROUND(100*BM34/BL34-100,1))&\"％増）\",IF(BM34/BL34<1,\"○（\"&ABS(ROUND(100*BM34/BL34-100,1))&\"％減）\",\"\"))))),\"-\")","v":"-（8.4％増）"},{"$f":"IFERROR(IF(BL34=\"-\",\"-\",\"（\"&TEXT(BM34,\"#,###\")&\"-\"&TEXT(BL34,\"#,###\")&\"）/\"&TEXT(BL34,\"#,###\")&\"=\"&TEXT((BM34-BL34)/BL34*100,\"0.0\")&\"%\"),\"-\")","v":"（468,900-432,547）/432,547=8.4%"},{"$f":"IFERROR(IF(BO34=\"-\",\"-\",IF(BO34=\"\",\"-\",IF(BO34/BN34=1,\"△\",IF(BO34/BN34>1,\"-（\"&ABS(ROUND(100*BO34/BN34-100,1))&\"％増）\",IF(BO34/BN34<1,\"○（\"&ABS(ROUND(100*BO34/BN34-100,1))&\"％減）\",\"\"))))),\"-\")","v":"-"},{"$f":"IFERROR(IF(BN34=\"-\",\"-\",\"（\"&TEXT(BO34,\"#,###\")&\"-\"&TEXT(BN34,\"#,###\")&\"）/\"&TEXT(BN34,\"#,###\")&\"=\"&TEXT((BO34-BN34)/BN34*100,\"0.0\")&\"%\"),\"-\")","v":"-"},{"$f":"IFERROR(IF(BQ34=\"-\",\"-\",IF(BQ34=\"\",\"-\",IF(BQ34/BP34=1,\"△\",IF(BQ34/BP34>1,\"-（\"&ABS(ROUND(100*BQ34/BP34-100,1))&\"％増）\",IF(BQ34/BP34<1,\"○（\"&ABS(ROUND(100*BQ34/BP34-100,1))&\"％減）\",\"\"))))),\"-\")","v":"-（37.5％増）"},{"$f":"IFERROR(IF(BP34=\"-\",\"-\",\"（\"&TEXT(BQ34,\"#,###\")&\"-\"&TEXT(BP34,\"#,###\")&\"）/\"&TEXT(BP34,\"#,###\")&\"=\"&TEXT((BQ34-BP34)/BP34*100,\"0.0\")&\"%\"),\"-\")","v":"（594,800-432,547）/432,547=37.5%"},{"$f":"IFERROR(IF(BS34=\"-\",\"-\",IF(BS34=\"\",\"-\",IF(BS34/BR34=1,\"△\",IF(BS34/BR34>1,\"-（\"&ABS(ROUND(100*BS34/BR34-100,1))&\"％増）\",IF(BS34/BR34<1,\"○（\"&ABS(ROUND(100*BS34/BR34-100,1))&\"％減）\",\"\"))))),\"-\")","v":"○（13％減）"},{"$f":"IFERROR(IF(BR34=\"-\",\"-\",\"（\"&TEXT(BS34,\"#,###\")&\"-\"&TEXT(BR34,\"#,###\")&\"）/\"&TEXT(BR34,\"#,###\")&\"=\"&TEXT((BS34-BR34)/BR34*100,\"0.0\")&\"%\"),\"-\")","v":"（393,416-452,049）/452,049=-13.0%"},{"$f":"IFERROR(IF(BU34=\"-\",\"-\",IF(BU34=\"\",\"-\",IF(BU34/BT34=1,\"△\",IF(BU34/BT34>1,\"-（\"&ABS(ROUND(100*BU34/BT34-100,1))&\"％増）\",IF(BU34/BT34<1,\"○（\"&ABS(ROUND(100*BU34/BT34-100,1))&\"％減）\",\"\"))))),\"-\")","v":"○（5.2％減）"},{"$f":"IFERROR(IF(BT34=\"-\",\"-\",\"（\"&TEXT(BU34,\"#,###\")&\"-\"&TEXT(BT34,\"#,###\")&\"）/\"&TEXT(BT34,\"#,###\")&\"=\"&TEXT((BU34-BT34)/BT34*100,\"0.0\")&\"%\"),\"-\")","v":"（428,469-452,049）/452,049=-5.2%"},{"$f":"IFERROR(IF(BW34=\"-\",\"-\",IF(BW34=\"\",\"-\",IF(BW34/BV34=1,\"△\",IF(BW34/BV34>1,\"-（\"&ABS(ROUND(100*BW34/BV34-100,1))&\"％増）\",IF(BW34/BV34<1,\"○（\"&ABS(ROUND(100*BW34/BV34-100,1))&\"％減）\",\"\"))))),\"-\")","v":"○（9.8％減）"},{"$f":"IFERROR(IF(BV34=\"-\",\"-\",\"（\"&TEXT(BW34,\"#,###\")&\"-\"&TEXT(BV34,\"#,###\")&\"）/\"&TEXT(BV34,\"#,###\")&\"=\"&TEXT((BW34-BV34)/BV34*100,\"0.0\")&\"%\"),\"-\")","v":"（390,000-432,547）/432,547=-9.8%"},{"$f":"IFERROR(IF(BY34=\"-\",\"-\",IF(BY34=\"\",\"-\",IF(BY34/BX34=1,\"△\",IF(BY34/BX34>1,\"-（\"&ABS(ROUND(100*BY34/BX34-100,1))&\"％増）\",IF(BY34/BX34<1,\"○（\"&ABS(ROUND(100*BY34/BX34-100,1))&\"％減）\",\"\"))))),\"-\")","v":"-（3.2％増）"},{"$f":"IFERROR(IF(BX34=\"-\",\"-\",\"（\"&TEXT(BY34,\"#,###\")&\"-\"&TEXT(BX34,\"#,###\")&\"）/\"&TEXT(BX34,\"#,###\")&\"=\"&TEXT((BY34-BX34)/BX34*100,\"0.0\")&\"%\"),\"-\")","v":"（446,200-432,547）/432,547=3.2%"},{"$f":"IFERROR(IF(CA34=\"-\",\"-\",IF(CA34=\"\",\"-\",IF(CA34/BZ34=1,\"△\",IF(CA34/BZ34>1,\"-（\"&ABS(ROUND(100*CA34/BZ34-100,1))&\"％増）\",IF(CA34/BZ34<1,\"○（\"&ABS(ROUND(100*CA34/BZ34-100,1))&\"％減）\",\"\"))))),\"-\")","v":"-（66.1％増）"},{"$f":"IFERROR(IF(BZ34=\"-\",\"-\",\"（\"&TEXT(CA34,\"#,###\")&\"-\"&TEXT(BZ34,\"#,###\")&\"）/\"&TEXT(BZ34,\"#,###\")&\"=\"&TEXT((CA34-BZ34)/BZ34*100,\"0.0\")&\"%\"),\"-\")","v":"（718,440-432,547）/432,547=66.1%"},{"$f":"IFERROR(IF(CC34=\"-\",\"-\",IF(CC34=\"\",\"-\",IF(CC34/CB34=1,\"△\",IF(CC34/CB34>1,\"-（\"&ABS(ROUND(100*CC34/CB34-100,1))&\"％増）\",IF(CC34/CB34<1,\"○（\"&ABS(ROUND(100*CC34/CB34-100,1))&\"％減）\",\"\"))))),\"-\")","v":"-（7.5％増）"},{"$f":"IFERROR(IF(CB34=\"-\",\"-\",\"（\"&TEXT(CC34,\"#,###\")&\"-\"&TEXT(CB34,\"#,###\")&\"）/\"&TEXT(CB34,\"#,###\")&\"=\"&TEXT((CC34-CB34)/CB34*100,\"0.0\")&\"%\"),\"-\")","v":"（465,200-432,547）/432,547=7.5%"},{"$f":"IFERROR(IF(CE34=\"-\",\"-\",IF(CE34=\"\",\"-\",IF(CE34/CD34=1,\"△\",IF(CE34/CD34>1,\"-（\"&ABS(ROUND(100*CE34/CD34-100,1))&\"％増）\",IF(CE34/CD34<1,\"○（\"&ABS(ROUND(100*CE34/CD34-100,1))&\"％減）\",\"\"))))),\"-\")","v":"-（25.7％増）"},{"$f":"IFERROR(IF(CD34=\"-\",\"-\",\"（\"&TEXT(CE34,\"#,###\")&\"-\"&TEXT(CD34,\"#,###\")&\"）/\"&TEXT(CD34,\"#,###\")&\"=\"&TEXT((CE34-CD34)/CD34*100,\"0.0\")&\"%\"),\"-\")","v":"（407,300-323,919）/323,919=25.7%"},{"$f":"IFERROR(IF(CG34=\"-\",\"-\",IF(CG34=\"\",\"-\",IF(CG34/CF34=1,\"△\",IF(CG34/CF34>1,\"-（\"&ABS(ROUND(100*CG34/CF34-100,1))&\"％増）\",IF(CG34/CF34<1,\"○（\"&ABS(ROUND(100*CG34/CF34-100,1))&\"％減）\",\"\"))))),\"-\")","v":"-（109％増）"},{"$f":"IFERROR(IF(CF34=\"-\",\"-\",\"（\"&TEXT(CG34,\"#,###\")&\"-\"&TEXT(CF34,\"#,###\")&\"）/\"&TEXT(CF34,\"#,###\")&\"=\"&TEXT((CG34-CF34)/CF34*100,\"0.0\")&\"%\"),\"-\")","v":"（944,700-452,049）/452,049=109.0%"},{"$f":"IFERROR(IF(CI34=\"-\",\"-\",IF(CI34=\"\",\"-\",IF(CI34/CH34=1,\"△\",IF(CI34/CH34>1,\"-（\"&ABS(ROUND(100*CI34/CH34-100,1))&\"％増）\",IF(CI34/CH34<1,\"○（\"&ABS(ROUND(100*CI34/CH34-100,1))&\"％減）\",\"\"))))),\"-\")","v":"-（29.5％増）"},{"$f":"IFERROR(IF(CH34=\"-\",\"-\",\"（\"&TEXT(CI34,\"#,###\")&\"-\"&TEXT(CH34,\"#,###\")&\"）/\"&TEXT(CH34,\"#,###\")&\"=\"&TEXT((CI34-CH34)/CH34*100,\"0.0\")&\"%\"),\"-\")","v":"（560,000-432,547）/432,547=29.5%"},{"$f":"IFERROR(IF(CK34=\"-\",\"-\",IF(CK34=\"\",\"-\",IF(CK34/CJ34=1,\"△\",IF(CK34/CJ34>1,\"-（\"&ABS(ROUND(100*CK34/CJ34-100,1))&\"％増）\",IF(CK34/CJ34<1,\"○（\"&ABS(ROUND(100*CK34/CJ34-100,1))&\"％減）\",\"\"))))),\"-\")","v":"○（0.4％減）"},{"$f":"IFERROR(IF(CJ34=\"-\",\"-\",\"（\"&TEXT(CK34,\"#,###\")&\"-\"&TEXT(CJ34,\"#,###\")&\"）/\"&TEXT(CJ34,\"#,###\")&\"=\"&TEXT((CK34-CJ34)/CJ34*100,\"0.0\")&\"%\"),\"-\")","v":"（430,800-432,547）/432,547=-0.4%"},{"$f":"IFERROR(IF(CM34=\"-\",\"-\",IF(CM34=\"\",\"-\",IF(CM34/CL34=1,\"△\",IF(CM34/CL34>1,\"-（\"&ABS(ROUND(100*CM34/CL34-100,1))&\"％増）\",IF(CM34/CL34<1,\"○（\"&ABS(ROUND(100*CM34/CL34-100,1))&\"％減）\",\"\"))))),\"-\")","v":"-（3.9％増）"},{"$f":"IFERROR(IF(CL34=\"-\",\"-\",\"（\"&TEXT(CM34,\"#,###\")&\"-\"&TEXT(CL34,\"#,###\")&\"）/\"&TEXT(CL34,\"#,###\")&\"=\"&TEXT((CM34-CL34)/CL34*100,\"0.0\")&\"%\"),\"-\")","v":"（449,350-432,547）/432,547=3.9%"},{"$f":"IFERROR(IF(CO34=\"-\",\"-\",IF(CO34=\"\",\"-\",IF(CO34/CN34=1,\"△\",IF(CO34/CN34>1,\"-（\"&ABS(ROUND(100*CO34/CN34-100,1))&\"％増）\",IF(CO34/CN34<1,\"○（\"&ABS(ROUND(100*CO34/CN34-100,1))&\"％減）\",\"\"))))),\"-\")","v":"-（13.9％増）"},{"$f":"IFERROR(IF(CN34=\"-\",\"-\",\"（\"&TEXT(CO34,\"#,###\")&\"-\"&TEXT(CN34,\"#,###\")&\"）/\"&TEXT(CN34,\"#,###\")&\"=\"&TEXT((CO34-CN34)/CN34*100,\"0.0\")&\"%\"),\"-\")","v":"（515,100-452,049）/452,049=13.9%"},{"$f":"IFERROR(IF(CQ34=\"-\",\"-\",IF(CQ34=\"\",\"-\",IF(CQ34/CP34=1,\"△\",IF(CQ34/CP34>1,\"-（\"&ABS(ROUND(100*CQ34/CP34-100,1))&\"％増）\",IF(CQ34/CP34<1,\"○（\"&ABS(ROUND(100*CQ34/CP34-100,1))&\"％減）\",\"\"))))),\"-\")","v":"○（15.3％減）"},{"$f":"IFERROR(IF(CP34=\"-\",\"-\",\"（\"&TEXT(CQ34,\"#,###\")&\"-\"&TEXT(CP34,\"#,###\")&\"）/\"&TEXT(CP34,\"#,###\")&\"=\"&TEXT((CQ34-CP34)/CP34*100,\"0.0\")&\"%\"),\"-\")","v":"（366,400-432,547）/432,547=-15.3%"},{"$f":"IFERROR(IF(CS34=\"-\",\"-\",IF(CS34=\"\",\"-\",IF(CS34/CR34=1,\"△\",IF(CS34/CR34>1,\"-（\"&ABS(ROUND(100*CS34/CR34-100,1))&\"％増）\",IF(CS34/CR34<1,\"○（\"&ABS(ROUND(100*CS34/CR34-100,1))&\"％減）\",\"\"))))),\"-\")","v":"-"},{"$f":"IFERROR(IF(CR34=\"-\",\"-\",\"（\"&TEXT(CS34,\"#,###\")&\"-\"&TEXT(CR34,\"#,###\")&\"）/\"&TEXT(CR34,\"#,###\")&\"=\"&TEXT((CS34-CR34)/CR34*100,\"0.0\")&\"%\"),\"-\")","v":"-"},{"$f":"IFERROR(IF(CU34=\"-\",\"-\",IF(CU34=\"\",\"-\",IF(CU34/CT34=1,\"△\",IF(CU34/CT34>1,\"-（\"&ABS(ROUND(100*CU34/CT34-100,1))&\"％増）\",IF(CU34/CT34<1,\"○（\"&ABS(ROUND(100*CU34/CT34-100,1))&\"％減）\",\"\"))))),\"-\")","v":"○（29％減）"},{"$f":"IFERROR(IF(CT34=\"-\",\"-\",\"（\"&TEXT(CU34,\"#,###\")&\"-\"&TEXT(CT34,\"#,###\")&\"）/\"&TEXT(CT34,\"#,###\")&\"=\"&TEXT((CU34-CT34)/CT34*100,\"0.0\")&\"%\"),\"-\")","v":"（320,990-452,049）/452,049=-29.0%"},{"$f":"IFERROR(IF(CW34=\"-\",\"-\",IF(CW34=\"\",\"-\",IF(CW34/CV34=1,\"△\",IF(CW34/CV34>1,\"-（\"&ABS(ROUND(100*CW34/CV34-100,1))&\"％増）\",IF(CW34/CV34<1,\"○（\"&ABS(ROUND(100*CW34/CV34-100,1))&\"％減）\",\"\"))))),\"-\")","v":"○（7.5％減）"},{"$f":"IFERROR(IF(CV34=\"-\",\"-\",\"（\"&TEXT(CW34,\"#,###\")&\"-\"&TEXT(CV34,\"#,###\")&\"）/\"&TEXT(CV34,\"#,###\")&\"=\"&TEXT((CW34-CV34)/CV34*100,\"0.0\")&\"%\"),\"-\")","v":"（418,240-452,049）/452,049=-7.5%"},"／","／",{"$f":"IFERROR(IF(DA34=\"-\",\"-\",IF(DA34=\"\",\"-\",IF(DA34/CZ34=1,\"△\",IF(DA34/CZ34>1,\"-（\"&ABS(ROUND(100*DA34/CZ34-100,1))&\"％増）\",IF(DA34/CZ34<1,\"○（\"&ABS(ROUND(100*DA34/CZ34-100,1))&\"％減）\",\"\"))))),\"-\")","v":"-（28.5％増）"},{"$f":"IFERROR(IF(CZ34=\"-\",\"-\",\"（\"&TEXT(DA34,\"#,###\")&\"-\"&TEXT(CZ34,\"#,###\")&\"）/\"&TEXT(CZ34,\"#,###\")&\"=\"&TEXT((DA34-CZ34)/CZ34*100,\"0.0\")&\"%\"),\"-\")","v":"（581,000-452,049）/452,049=28.5%"},{"$f":"IFERROR(IF(DC34=\"-\",\"-\",IF(DC34=\"\",\"-\",IF(DC34/DB34=1,\"△\",IF(DC34/DB34>1,\"-（\"&ABS(ROUND(100*DC34/DB34-100,1))&\"％増）\",IF(DC34/DB34<1,\"○（\"&ABS(ROUND(100*DC34/DB34-100,1))&\"％減）\",\"\"))))),\"-\")","v":"○（18.2％減）"},{"$f":"IFERROR(IF(DB34=\"-\",\"-\",\"（\"&TEXT(DC34,\"#,###\")&\"-\"&TEXT(DB34,\"#,###\")&\"）/\"&TEXT(DB34,\"#,###\")&\"=\"&TEXT((DC34-DB34)/DB34*100,\"0.0\")&\"%\"),\"-\")","v":"（265,000-323,919）/323,919=-18.2%"},{"$f":"IFERROR(IF(DE34=\"-\",\"-\",IF(DE34=\"\",\"-\",IF(DE34/DD34=1,\"△\",IF(DE34/DD34>1,\"-（\"&ABS(ROUND(100*DE34/DD34-100,1))&\"％増）\",IF(DE34/DD34<1,\"○（\"&ABS(ROUND(100*DE34/DD34-100,1))&\"％減）\",\"\"))))),\"-\")","v":"○（1.2％減）"},{"$f":"IFERROR(IF(DD34=\"-\",\"-\",\"（\"&TEXT(DE34,\"#,###\")&\"-\"&TEXT(DD34,\"#,###\")&\"）/\"&TEXT(DD34,\"#,###\")&\"=\"&TEXT((DE34-DD34)/DD34*100,\"0.0\")&\"%\"),\"-\")","v":"（320,000-323,919）/323,919=-1.2%"},{"$f":"IFERROR(IF(DG34=\"-\",\"-\",IF(DG34=\"\",\"-\",IF(DG34/DF34=1,\"△\",IF(DG34/DF34>1,\"-（\"&ABS(ROUND(100*DG34/DF34-100,1))&\"％増）\",IF(DG34/DF34<1,\"○（\"&ABS(ROUND(100*DG34/DF34-100,1))&\"％減）\",\"\"))))),\"-\")","v":"○（7.1％減）"},{"$f":"IFERROR(IF(DF34=\"-\",\"-\",\"（\"&TEXT(DG34,\"#,###\")&\"-\"&TEXT(DF34,\"#,###\")&\"）/\"&TEXT(DF34,\"#,###\")&\"=\"&TEXT((DG34-DF34)/DF34*100,\"0.0\")&\"%\"),\"-\")","v":"（419,900-452,049）/452,049=-7.1%"}]
[null,null,null,null,"工程",{"$f":"IFERROR(IF(G35=\"-\",\"-\",IF(G35=\"\",\"-\",IF(G35/F35=1,\"△\",IF(G35/F35>1,\"-（\"&ABS(ROUND(100*G35/F35-100,1))&\"％増）\",IF(G35/F35<1,\"○（\"&ABS(ROUND(100*G35/F35-100,1))&\"％減）\",\"\"))))),\"-\")","v":"-（7％増）"},{"$f":"IFERROR(IF(F35=\"-\",\"-\",\"（\"&TEXT(G35,\"##0.000\")&\"-\"&TEXT(F35,\"##0.000\")&\"）/\"&TEXT(F35,\"##0.000\")&\"=\"&TEXT((G35-F35)/F35*100,\"0.0\")&\"%\"),\"-\")","v":"（2.000-1.870）/1.870=7.0%"},{"$f":"IFERROR(IF(I35=\"-\",\"-\",IF(I35=\"\",\"-\",IF(I35/H35=1,\"△\",IF(I35/H35>1,\"-（\"&ABS(ROUND(100*I35/H35-100,1))&\"％増）\",IF(I35/H35<1,\"○（\"&ABS(ROUND(100*I35/H35-100,1))&\"％減）\",\"\"))))),\"-\")","v":"○（37.4％減）"},{"$f":"IFERROR(IF(H35=\"-\",\"-\",\"（\"&TEXT(I35,\"##0.000\")&\"-\"&TEXT(H35,\"##0.000\")&\"）/\"&TEXT(H35,\"##0.000\")&\"=\"&TEXT((I35-H35)/H35*100,\"0.0\")&\"%\"),\"-\")","v":"（1.170-1.870）/1.870=-37.4%"},{"$f":"IFERROR(IF(K35=\"-\",\"-\",IF(K35=\"\",\"-\",IF(K35/J35=1,\"△\",IF(K35/J35>1,\"-（\"&ABS(ROUND(100*K35/J35-100,1))&\"％増）\",IF(K35/J35<1,\"○（\"&ABS(ROUND(100*K35/J35-100,1))&\"％減）\",\"\"))))),\"-\")","v":"△"},{"$f":"IFERROR(IF(J35=\"-\",\"-\",\"（\"&TEXT(K35,\"##0.000\")&\"-\"&TEXT(J35,\"##0.000\")&\"）/\"&TEXT(J35,\"##0.000\")&\"=\"&TEXT((K35-J35)/J35*100,\"0.0\")&\"%\"),\"-\")","v":"（1.870-1.870）/1.870=0.0%"},{"$f":"IFERROR(IF(M35=\"-\",\"-\",IF(M35=\"\",\"-\",IF(M35/L35=1,\"△\",IF(M35/L35>1,\"-（\"&ABS(ROUND(100*M35/L35-100,1))&\"％増）\",IF(M35/L35<1,\"○（\"&ABS(ROUND(100*M35/L35-100,1))&\"％減）\",\"\"))))),\"-\")","v":"○（8.6％減）"},{"$f":"IFERROR(IF(L35=\"-\",\"-\",\"（\"&TEXT(M35,\"##0.000\")&\"-\"&TEXT(L35,\"##0.000\")&\"）/\"&TEXT(L35,\"##0.000\")&\"=\"&TEXT((M35-L35)/L35*100,\"0.0\")&\"%\"),\"-\")","v":"（1.710-1.870）/1.870=-8.6%"},{"$f":"IFERROR(IF(O35=\"-\",\"-\",IF(O35=\"\",\"-\",IF(O35/N35=1,\"△\",IF(O35/N35>1,\"-（\"&ABS(ROUND(100*O35/N35-100,1))&\"％増）\",IF(O35/N35<1,\"○（\"&ABS(ROUND(100*O35/N35-100,1))&\"％減）\",\"\"))))),\"-\")","v":"△"},{"$f":"IFERROR(IF(N35=\"-\",\"-\",\"（\"&TEXT(O35,\"##0.000\")&\"-\"&TEXT(N35,\"##0.000\")&\"）/\"&TEXT(N35,\"##0.000\")&\"=\"&TEXT((O35-N35)/N35*100,\"0.0\")&\"%\"),\"-\")","v":"（1.870-1.870）/1.870=0.0%"},{"$f":"IFERROR(IF(Q35=\"-\",\"-\",IF(Q35=\"\",\"-\",IF(Q35/P35=1,\"△\",IF(Q35/P35>1,\"-（\"&ABS(ROUND(100*Q35/P35-100,1))&\"％増）\",IF(Q35/P35<1,\"○（\"&ABS(ROUND(100*Q35/P35-100,1))&\"％減）\",\"\"))))),\"-\")","v":"○（46.5％減）"},{"$f":"IFERROR(IF(P35=\"-\",\"-\",\"（\"&TEXT(Q35,\"##0.000\")&\"-\"&TEXT(P35,\"##0.000\")&\"）/\"&TEXT(P35,\"##0.000\")&\"=\"&TEXT((Q35-P35)/P35*100,\"0.0\")&\"%\"),\"-\")","v":"（1.000-1.870）/1.870=-46.5%"},{"$f":"IFERROR(IF(S35=\"-\",\"-\",IF(S35=\"\",\"-\",IF(S35/R35=1,\"△\",IF(S35/R35>1,\"-（\"&ABS(ROUND(100*S35/R35-100,1))&\"％増）\",IF(S35/R35<1,\"○（\"&ABS(ROUND(100*S35/R35-100,1))&\"％減）\",\"\"))))),\"-\")","v":"-（16.6％増）"},{"$f":"IFERROR(IF(R35=\"-\",\"-\",\"（\"&TEXT(S35,\"##0.000\")&\"-\"&TEXT(R35,\"##0.000\")&\"）/\"&TEXT(R35,\"##0.000\")&\"=\"&TEXT((S35-R35)/R35*100,\"0.0\")&\"%\"),\"-\")","v":"（2.180-1.870）/1.870=16.6%"},{"$f":"IFERROR(IF(U35=\"-\",\"-\",IF(U35=\"\",\"-\",IF(U35/T35=1,\"△\",IF(U35/T35>1,\"-（\"&ABS(ROUND(100*U35/T35-100,1))&\"％増）\",IF(U35/T35<1,\"○（\"&ABS(ROUND(100*U35/T35-100,1))&\"％減）\",\"\"))))),\"-\")","v":"△"},{"$f":"IFERROR(IF(T35=\"-\",\"-\",\"（\"&TEXT(U35,\"##0.000\")&\"-\"&TEXT(T35,\"##0.000\")&\"）/\"&TEXT(T35,\"##0.000\")&\"=\"&TEXT((U35-T35)/T35*100,\"0.0\")&\"%\"),\"-\")","v":"（1.870-1.870）/1.870=0.0%"},{"$f":"IFERROR(IF(W35=\"-\",\"-\",IF(W35=\"\",\"-\",IF(W35/V35=1,\"△\",IF(W35/V35>1,\"-（\"&ABS(ROUND(100*W35/V35-100,1))&\"％増）\",IF(W35/V35<1,\"○（\"&ABS(ROUND(100*W35/V35-100,1))&\"％減）\",\"\"))))),\"-\")","v":"△"},{"$f":"IFERROR(IF(V35=\"-\",\"-\",\"（\"&TEXT(W35,\"##0.000\")&\"-\"&TEXT(V35,\"##0.000\")&\"）/\"&TEXT(V35,\"##0.000\")&\"=\"&TEXT((W35-V35)/V35*100,\"0.0\")&\"%\"),\"-\")","v":"（1.870-1.870）/1.870=0.0%"},{"$f":"IFERROR(IF(Y35=\"-\",\"-\",IF(Y35=\"\",\"-\",IF(Y35/X35=1,\"△\",IF(Y35/X35>1,\"-（\"&ABS(ROUND(100*Y35/X35-100,1))&\"％増）\",IF(Y35/X35<1,\"○（\"&ABS(ROUND(100*Y35/X35-100,1))&\"％減）\",\"\"))))),\"-\")","v":"-"},{"$f":"IFERROR(IF(X35=\"-\",\"-\",\"（\"&TEXT(Y35,\"##0.000\")&\"-\"&TEXT(X35,\"##0.000\")&\"）/\"&TEXT(X35,\"##0.000\")&\"=\"&TEXT((Y35-X35)/X35*100,\"0.0\")&\"%\"),\"-\")","v":"-"},{"$f":"IFERROR(IF(AA35=\"-\",\"-\",IF(AA35=\"\",\"-\",IF(AA35/Z35=1,\"△\",IF(AA35/Z35>1,\"-（\"&ABS(ROUND(100*AA35/Z35-100,1))&\"％増）\",IF(AA35/Z35<1,\"○（\"&ABS(ROUND(100*AA35/Z35-100,1))&\"％減）\",\"\"))))),\"-\")","v":"-（9.6％増）"},{"$f":"IFERROR(IF(Z35=\"-\",\"-\",\"（\"&TEXT(AA35,\"##0.000\")&\"-\"&TEXT(Z35,\"##0.000\")&\"）/\"&TEXT(Z35,\"##0.000\")&\"=\"&TEXT((AA35-Z35)/Z35*100,\"0.0\")&\"%\"),\"-\")","v":"（2.050-1.870）/1.870=9.6%"},{"$f":"IFERROR(IF(AC35=\"-\",\"-\",IF(AC35=\"\",\"-\",IF(AC35/AB35=1,\"△\",IF(AC35/AB35>1,\"-（\"&ABS(ROUND(100*AC35/AB35-100,1))&\"％増）\",IF(AC35/AB35<1,\"○（\"&ABS(ROUND(100*AC35/AB35-100,1))&\"％減）\",\"\"))))),\"-\")","v":"○（19.3％減）"},{"$f":"IFERROR(IF(AB35=\"-\",\"-\",\"（\"&TEXT(AC35,\"##0.000\")&\"-\"&TEXT(AB35,\"##0.000\")&\"）/\"&TEXT(AB35,\"##0.000\")&\"=\"&TEXT((AC35-AB35)/AB35*100,\"0.0\")&\"%\"),\"-\")","v":"（1.510-1.870）/1.870=-19.3%"},{"$f":"IFERROR(IF(AE35=\"-\",\"-\",IF(AE35=\"\",\"-\",IF(AE35/AD35=1,\"△\",IF(AE35/AD35>1,\"-（\"&ABS(ROUND(100*AE35/AD35-100,1))&\"％増）\",IF(AE35/AD35<1,\"○（\"&ABS(ROUND(100*AE35/AD35-100,1))&\"％減）\",\"\"))))),\"-\")","v":"○（1.1％減）"},{"$f":"IFERROR(IF(AD35=\"-\",\"-\",\"（\"&TEXT(AE35,\"##0.000\")&\"-\"&TEXT(AD35,\"##0.000\")&\"）/\"&TEXT(AD35,\"##0.000\")&\"=\"&TEXT((AE35-AD35)/AD35*100,\"0.0\")&\"%\"),\"-\")","v":"（1.850-1.870）/1.870=-1.1%"},{"$f":"IFERROR(IF(AG35=\"-\",\"-\",IF(AG35=\"\",\"-\",IF(AG35/AF35=1,\"△\",IF(AG35/AF35>1,\"-（\"&ABS(ROUND(100*AG35/AF35-100,1))&\"％増）\",IF(AG35/AF35<1,\"○（\"&ABS(ROUND(100*AG35/AF35-100,1))&\"％減）\",\"\"))))),\"-\")","v":"○（53.5％減）"},{"$f":"IFERROR(IF(AF35=\"-\",\"-\",\"（\"&TEXT(AG35,\"##0.000\")&\"-\"&TEXT(AF35,\"##0.000\")&\"）/\"&TEXT(AF35,\"##0.000\")&\"=\"&TEXT((AG35-AF35)/AF35*100,\"0.0\")&\"%\"),\"-\")","v":"（0.870-1.870）/1.870=-53.5%"},{"$f":"IFERROR(IF(AI35=\"-\",\"-\",IF(AI35=\"\",\"-\",IF(AI35/AH35=1,\"△\",IF(AI35/AH35>1,\"-（\"&ABS(ROUND(100*AI35/AH35-100,1))&\"％増）\",IF(AI35/AH35<1,\"○（\"&ABS(ROUND(100*AI35/AH35-100,1))&\"％減）\",\"\"))))),\"-\")","v":"-"},{"$f":"IFERROR(IF(AH35=\"-\",\"-\",\"（\"&TEXT(AI35,\"##0.000\")&\"-\"&TEXT(AH35,\"##0.000\")&\"）/\"&TEXT(AH35,\"##0.000\")&\"=\"&TEXT((AI35-AH35)/AH35*100,\"0.0\")&\"%\"),\"-\")","v":"-"},{"$f":"IFERROR(IF(AK35=\"-\",\"-\",IF(AK35=\"\",\"-\",IF(AK35/AJ35=1,\"△\",IF(AK35/AJ35>1,\"-（\"&ABS(ROUND(100*AK35/AJ35-100,1))&\"％増）\",IF(AK35/AJ35<1,\"○（\"&ABS(ROUND(100*AK35/AJ35-100,1))&\"％減）\",\"\"))))),\"-\")","v":"○（28.3％減）"},{"$f":"IFERROR(IF(AJ35=\"-\",\"-\",\"（\"&TEXT(AK35,\"##0.000\")&\"-\"&TEXT(AJ35,\"##0.000\")&\"）/\"&TEXT(AJ35,\"##0.000\")&\"=\"&TEXT((AK35-AJ35)/AJ35*100,\"0.0\")&\"%\"),\"-\")","v":"（1.340-1.870）/1.870=-28.3%"},{"$f":"IFERROR(IF(AM35=\"-\",\"-\",IF(AM35=\"\",\"-\",IF(AM35/AL35=1,\"△\",IF(AM35/AL35>1,\"-（\"&ABS(ROUND(100*AM35/AL35-100,1))&\"％増）\",IF(AM35/AL35<1,\"○（\"&ABS(ROUND(100*AM35/AL35-100,1))&\"％減）\",\"\"))))),\"-\")","v":"-（60.4％増）"},{"$f":"IFERROR(IF(AL35=\"-\",\"-\",\"（\"&TEXT(AM35,\"##0.000\")&\"-\"&TEXT(AL35,\"##0.000\")&\"）/\"&TEXT(AL35,\"##0.000\")&\"=\"&TEXT((AM35-AL35)/AL35*100,\"0.0\")&\"%\"),\"-\")","v":"（3.000-1.870）/1.870=60.4%"},{"$f":"IFERROR(IF(AO35=\"-\",\"-\",IF(AO35=\"\",\"-\",IF(AO35/AN35=1,\"△\",IF(AO35/AN35>1,\"-（\"&ABS(ROUND(100*AO35/AN35-100,1))&\"％増）\",IF(AO35/AN35<1,\"○（\"&ABS(ROUND(100*AO35/AN35-100,1))&\"％減）\",\"\"))))),\"-\")","v":"-（32.1％増）"},{"$f":"IFERROR(IF(AN35=\"-\",\"-\",\"（\"&TEXT(AO35,\"##0.000\")&\"-\"&TEXT(AN35,\"##0.000\")&\"）/\"&TEXT(AN35,\"##0.000\")&\"=\"&TEXT((AO35-AN35)/AN35*100,\"0.0\")&\"%\"),\"-\")","v":"（2.470-1.870）/1.870=32.1%"},{"$f":"IFERROR(IF(AQ35=\"-\",\"-\",IF(AQ35=\"\",\"-\",IF(AQ35/AP35=1,\"△\",IF(AQ35/AP35>1,\"-（\"&ABS(ROUND(100*AQ35/AP35-100,1))&\"％増）\",IF(AQ35/AP35<1,\"○（\"&ABS(ROUND(100*AQ35/AP35-100,1))&\"％減）\",\"\"))))),\"-\")","v":"-（1.1％増）"},{"$f":"IFERROR(IF(AP35=\"-\",\"-\",\"（\"&TEXT(AQ35,\"##0.000\")&\"-\"&TEXT(AP35,\"##0.000\")&\"）/\"&TEXT(AP35,\"##0.000\")&\"=\"&TEXT((AQ35-AP35)/AP35*100,\"0.0\")&\"%\"),\"-\")","v":"（1.890-1.870）/1.870=1.1%"},{"$f":"IFERROR(IF(AS35=\"-\",\"-\",IF(AS35=\"\",\"-\",IF(AS35/AR35=1,\"△\",IF(AS35/AR35>1,\"-（\"&ABS(ROUND(100*AS35/AR35-100,1))&\"％増）\",IF(AS35/AR35<1,\"○（\"&ABS(ROUND(100*AS35/AR35-100,1))&\"％減）\",\"\"))))),\"-\")","v":"-（32.1％増）"},{"$f":"IFERROR(IF(AR35=\"-\",\"-\",\"（\"&TEXT(AS35,\"##0.000\")&\"-\"&TEXT(AR35,\"##0.000\")&\"）/\"&TEXT(AR35,\"##0.000\")&\"=\"&TEXT((AS35-AR35)/AR35*100,\"0.0\")&\"%\"),\"-\")","v":"（2.470-1.870）/1.870=32.1%"},{"$f":"IFERROR(IF(AU35=\"-\",\"-\",IF(AU35=\"\",\"-\",IF(AU35/AT35=1,\"△\",IF(AU35/AT35>1,\"-（\"&ABS(ROUND(100*AU35/AT35-100,1))&\"％増）\",IF(AU35/AT35<1,\"○（\"&ABS(ROUND(100*AU35/AT35-100,1))&\"％減）\",\"\"))))),\"-\")","v":"-（16.6％増）"},{"$f":"IFERROR(IF(AT35=\"-\",\"-\",\"（\"&TEXT(AU35,\"##0.000\")&\"-\"&TEXT(AT35,\"##0.000\")&\"）/\"&TEXT(AT35,\"##0.000\")&\"=\"&TEXT((AU35-AT35)/AT35*100,\"0.0\")&\"%\"),\"-\")","v":"（2.180-1.870）/1.870=16.6%"},{"$f":"IFERROR(IF(AW35=\"-\",\"-\",IF(AW35=\"\",\"-\",IF(AW35/AV35=1,\"△\",IF(AW35/AV35>1,\"-（\"&ABS(ROUND(100*AW35/AV35-100,1))&\"％増）\",IF(AW35/AV35<1,\"○（\"&ABS(ROUND(100*AW35/AV35-100,1))&\"％減）\",\"\"))))),\"-\")","v":"-（16.6％増）"},{"$f":"IFERROR(IF(AV35=\"-\",\"-\",\"（\"&TEXT(AW35,\"##0.000\")&\"-\"&TEXT(AV35,\"##0.000\")&\"）/\"&TEXT(AV35,\"##0.000\")&\"=\"&TEXT((AW35-AV35)/AV35*100,\"0.0\")&\"%\"),\"-\")","v":"（2.180-1.870）/1.870=16.6%"},{"$f":"IFERROR(IF(AY35=\"-\",\"-\",IF(AY35=\"\",\"-\",IF(AY35/AX35=1,\"△\",IF(AY35/AX35>1,\"-（\"&ABS(ROUND(100*AY35/AX35-100,1))&\"％増）\",IF(AY35/AX35<1,\"○（\"&ABS(ROUND(100*AY35/AX35-100,1))&\"％減）\",\"\"))))),\"-\")","v":"-（34.2％増）"},{"$f":"IFERROR(IF(AX35=\"-\",\"-\",\"（\"&TEXT(AY35,\"##0.000\")&\"-\"&TEXT(AX35,\"##0.000\")&\"）/\"&TEXT(AX35,\"##0.000\")&\"=\"&TEXT((AY35-AX35)/AX35*100,\"0.0\")&\"%\"),\"-\")","v":"（2.510-1.870）/1.870=34.2%"},{"$f":"IFERROR(IF(BA35=\"-\",\"-\",IF(BA35=\"\",\"-\",IF(BA35/AZ35=1,\"△\",IF(BA35/AZ35>1,\"-（\"&ABS(ROUND(100*BA35/AZ35-100,1))&\"％増）\",IF(BA35/AZ35<1,\"○（\"&ABS(ROUND(100*BA35/AZ35-100,1))&\"％減）\",\"\"))))),\"-\")","v":"○（10.2％減）"},{"$f":"IFERROR(IF(AZ35=\"-\",\"-\",\"（\"&TEXT(BA35,\"##0.000\")&\"-\"&TEXT(AZ35,\"##0.000\")&\"）/\"&TEXT(AZ35,\"##0.000\")&\"=\"&TEXT((BA35-AZ35)/AZ35*100,\"0.0\")&\"%\"),\"-\")","v":"（1.680-1.870）/1.870=-10.2%"},{"$f":"IFERROR(IF(BC35=\"-\",\"-\",IF(BC35=\"\",\"-\",IF(BC35/BB35=1,\"△\",IF(BC35/BB35>1,\"-（\"&ABS(ROUND(100*BC35/BB35-100,1))&\"％増）\",IF(BC35/BB35<1,\"○（\"&ABS(ROUND(100*BC35/BB35-100,1))&\"％減）\",\"\"))))),\"-\")","v":"-（16.6％増）"},{"$f":"IFERROR(IF(BB35=\"-\",\"-\",\"（\"&TEXT(BC35,\"##0.000\")&\"-\"&TEXT(BB35,\"##0.000\")&\"）/\"&TEXT(BB35,\"##0.000\")&\"=\"&TEXT((BC35-BB35)/BB35*100,\"0.0\")&\"%\"),\"-\")","v":"（2.180-1.870）/1.870=16.6%"},{"$f":"IFERROR(IF(BE35=\"-\",\"-\",IF(BE35=\"\",\"-\",IF(BE35/BD35=1,\"△\",IF(BE35/BD35>1,\"-（\"&ABS(ROUND(100*BE35/BD35-100,1))&\"％増）\",IF(BE35/BD35<1,\"○（\"&ABS(ROUND(100*BE35/BD35-100,1))&\"％減）\",\"\"))))),\"-\")","v":"-（7％増）"},{"$f":"IFERROR(IF(BD35=\"-\",\"-\",\"（\"&TEXT(BE35,\"##0.000\")&\"-\"&TEXT(BD35,\"##0.000\")&\"）/\"&TEXT(BD35,\"##0.000\")&\"=\"&TEXT((BE35-BD35)/BD35*100,\"0.0\")&\"%\"),\"-\")","v":"（2.000-1.870）/1.870=7.0%"},{"$f":"IFERROR(IF(BG35=\"-\",\"-\",IF(BG35=\"\",\"-\",IF(BG35/BF35=1,\"△\",IF(BG35/BF35>1,\"-（\"&ABS(ROUND(100*BG35/BF35-100,1))&\"％増）\",IF(BG35/BF35<1,\"○（\"&ABS(ROUND(100*BG35/BF35-100,1))&\"％減）\",\"\"))))),\"-\")","v":"○（19.3％減）"},{"$f":"IFERROR(IF(BF35=\"-\",\"-\",\"（\"&TEXT(BG35,\"##0.000\")&\"-\"&TEXT(BF35,\"##0.000\")&\"）/\"&TEXT(BF35,\"##0.000\")&\"=\"&TEXT((BG35-BF35)/BF35*100,\"0.0\")&\"%\"),\"-\")","v":"（1.510-1.870）/1.870=-19.3%"},{"$f":"IFERROR(IF(BI35=\"-\",\"-\",IF(BI35=\"\",\"-\",IF(BI35/BH35=1,\"△\",IF(BI35/BH35>1,\"-（\"&ABS(ROUND(100*BI35/BH35-100,1))&\"％増）\",IF(BI35/BH35<1,\"○（\"&ABS(ROUND(100*BI35/BH35-100,1))&\"％減）\",\"\"))))),\"-\")","v":"○（7％減）"},{"$f":"IFERROR(IF(BH35=\"-\",\"-\",\"（\"&TEXT(BI35,\"##0.000\")&\"-\"&TEXT(BH35,\"##0.000\")&\"）/\"&TEXT(BH35,\"##0.000\")&\"=\"&TEXT((BI35-BH35)/BH35*100,\"0.0\")&\"%\"),\"-\")","v":"（1.740-1.870）/1.870=-7.0%"},{"$f":"IFERROR(IF(BK35=\"-\",\"-\",IF(BK35=\"\",\"-\",IF(BK35/BJ35=1,\"△\",IF(BK35/BJ35>1,\"-（\"&ABS(ROUND(100*BK35/BJ35-100,1))&\"％増）\",IF(BK35/BJ35<1,\"○（\"&ABS(ROUND(100*BK35/BJ35-100,1))&\"％減）\",\"\"))))),\"-\")","v":"-"},{"$f":"IFERROR(IF(BJ35=\"-\",\"-\",\"（\"&TEXT(BK35,\"##0.000\")&\"-\"&TEXT(BJ35,\"##0.000\")&\"）/\"&TEXT(BJ35,\"##0.000\")&\"=\"&TEXT((BK35-BJ35)/BJ35*100,\"0.0\")&\"%\"),\"-\")","v":"-"},{"$f":"IFERROR(IF(BM35=\"-\",\"-\",IF(BM35=\"\",\"-\",IF(BM35/BL35=1,\"△\",IF(BM35/BL35>1,\"-（\"&ABS(ROUND(100*BM35/BL35-100,1))&\"％増）\",IF(BM35/BL35<1,\"○（\"&ABS(ROUND(100*BM35/BL35-100,1))&\"％減）\",\"\"))))),\"-\")","v":"○（19.3％減）"},{"$f":"IFERROR(IF(BL35=\"-\",\"-\",\"（\"&TEXT(BM35,\"##0.000\")&\"-\"&TEXT(BL35,\"##0.000\")&\"）/\"&TEXT(BL35,\"##0.000\")&\"=\"&TEXT((BM35-BL35)/BL35*100,\"0.0\")&\"%\"),\"-\")","v":"（1.510-1.870）/1.870=-19.3%"},{"$f":"IFERROR(IF(BO35=\"-\",\"-\",IF(BO35=\"\",\"-\",IF(BO35/BN35=1,\"△\",IF(BO35/BN35>1,\"-（\"&ABS(ROUND(100*BO35/BN35-100,1))&\"％増）\",IF(BO35/BN35<1,\"○（\"&ABS(ROUND(100*BO35/BN35-100,1))&\"％減）\",\"\"))))),\"-\")","v":"-"},{"$f":"IFERROR(IF(BN35=\"-\",\"-\",\"（\"&TEXT(BO35,\"##0.000\")&\"-\"&TEXT(BN35,\"##0.000\")&\"）/\"&TEXT(BN35,\"##0.000\")&\"=\"&TEXT((BO35-BN35)/BN35*100,\"0.0\")&\"%\"),\"-\")","v":"-"},{"$f":"IFERROR(IF(BQ35=\"-\",\"-\",IF(BQ35=\"\",\"-\",IF(BQ35/BP35=1,\"△\",IF(BQ35/BP35>1,\"-（\"&ABS(ROUND(100*BQ35/BP35-100,1))&\"％増）\",IF(BQ35/BP35<1,\"○（\"&ABS(ROUND(100*BQ35/BP35-100,1))&\"％減）\",\"\"))))),\"-\")","v":"○（41.2％減）"},{"$f":"IFERROR(IF(BP35=\"-\",\"-\",\"（\"&TEXT(BQ35,\"##0.000\")&\"-\"&TEXT(BP35,\"##0.000\")&\"）/\"&TEXT(BP35,\"##0.000\")&\"=\"&TEXT((BQ35-BP35)/BP35*100,\"0.0\")&\"%\"),\"-\")","v":"（1.100-1.870）/1.870=-41.2%"},{"$f":"IFERROR(IF(BS35=\"-\",\"-\",IF(BS35=\"\",\"-\",IF(BS35/BR35=1,\"△\",IF(BS35/BR35>1,\"-（\"&ABS(ROUND(100*BS35/BR35-100,1))&\"％増）\",IF(BS35/BR35<1,\"○（\"&ABS(ROUND(100*BS35/BR35-100,1))&\"％減）\",\"\"))))),\"-\")","v":"○（10.7％減）"},{"$f":"IFERROR(IF(BR35=\"-\",\"-\",\"（\"&TEXT(BS35,\"##0.000\")&\"-\"&TEXT(BR35,\"##0.000\")&\"）/\"&TEXT(BR35,\"##0.000\")&\"=\"&TEXT((BS35-BR35)/BR35*100,\"0.0\")&\"%\"),\"-\")","v":"（1.670-1.870）/1.870=-10.7%"},{"$f":"IFERROR(IF(BU35=\"-\",\"-\",IF(BU35=\"\",\"-\",IF(BU35/BT35=1,\"△\",IF(BU35/BT35>1,\"-（\"&ABS(ROUND(100*BU35/BT35-100,1))&\"％増）\",IF(BU35/BT35<1,\"○（\"&ABS(ROUND(100*BU35/BT35-100,1))&\"％減）\",\"\"))))),\"-\")","v":"○（10.7％減）"},{"$f":"IFERROR(IF(BT35=\"-\",\"-\",\"（\"&TEXT(BU35,\"##0.000\")&\"-\"&TEXT(BT35,\"##0.000\")&\"）/\"&TEXT(BT35,\"##0.000\")&\"=\"&TEXT((BU35-BT35)/BT35*100,\"0.0\")&\"%\"),\"-\")","v":"（1.670-1.870）/1.870=-10.7%"},{"$f":"IFERROR(IF(BW35=\"-\",\"-\",IF(BW35=\"\",\"-\",IF(BW35/BV35=1,\"△\",IF(BW35/BV35>1,\"-（\"&ABS(ROUND(100*BW35/BV35-100,1))&\"％増）\",IF(BW35/BV35<1,\"○（\"&ABS(ROUND(100*BW35/BV35-100,1))&\"％減）\",\"\"))))),\"-\")","v":"○（64.7％減）"},{"$f":"IFERROR(IF(BV35=\"-\",\"-\",\"（\"&TEXT(BW35,\"##0.000\")&\"-\"&TEXT(BV35,\"##0.000\")&\"）/\"&TEXT(BV35,\"##0.000\")&\"=\"&TEXT((BW35-BV35)/BV35*100,\"0.0\")&\"%\"),\"-\")","v":"（0.660-1.870）/1.870=-64.7%"},{"$f":"IFERROR(IF(BY35=\"-\",\"-\",IF(BY35=\"\",\"-\",IF(BY35/BX35=1,\"△\",IF(BY35/BX35>1,\"-（\"&ABS(ROUND(100*BY35/BX35-100,1))&\"％増）\",IF(BY35/BX35<1,\"○（\"&ABS(ROUND(100*BY35/BX35-100,1))&\"％減）\",\"\"))))),\"-\")","v":"○（46.5％減）"},{"$f":"IFERROR(IF(BX35=\"-\",\"-\",\"（\"&TEXT(BY35,\"##0.000\")&\"-\"&TEXT(BX35,\"##0.000\")&\"）/\"&TEXT(BX35,\"##0.000\")&\"=\"&TEXT((BY35-BX35)/BX35*100,\"0.0\")&\"%\"),\"-\")","v":"（1.000-1.870）/1.870=-46.5%"},{"$f":"IFERROR(IF(CA35=\"-\",\"-\",IF(CA35=\"\",\"-\",IF(CA35/BZ35=1,\"△\",IF(CA35/BZ35>1,\"-（\"&ABS(ROUND(100*CA35/BZ35-100,1))&\"％増）\",IF(CA35/BZ35<1,\"○（\"&ABS(ROUND(100*CA35/BZ35-100,1))&\"％減）\",\"\"))))),\"-\")","v":"○（41.2％減）"},{"$f":"IFERROR(IF(BZ35=\"-\",\"-\",\"（\"&TEXT(CA35,\"##0.000\")&\"-\"&TEXT(BZ35,\"##0.000\")&\"）/\"&TEXT(BZ35,\"##0.000\")&\"=\"&TEXT((CA35-BZ35)/BZ35*100,\"0.0\")&\"%\"),\"-\")","v":"（1.100-1.870）/1.870=-41.2%"},{"$f":"IFERROR(IF(CC35=\"-\",\"-\",IF(CC35=\"\",\"-\",IF(CC35/CB35=1,\"△\",IF(CC35/CB35>1,\"-（\"&ABS(ROUND(100*CC35/CB35-100,1))&\"％増）\",IF(CC35/CB35<1,\"○（\"&ABS(ROUND(100*CC35/CB35-100,1))&\"％減）\",\"\"))))),\"-\")","v":"-（16.6％増）"},{"$f":"IFERROR(IF(CB35=\"-\",\"-\",\"（\"&TEXT(CC35,\"##0.000\")&\"-\"&TEXT(CB35,\"##0.000\")&\"）/\"&TEXT(CB35,\"##0.000\")&\"=\"&TEXT((CC35-CB35)/CB35*100,\"0.0\")&\"%\"),\"-\")","v":"（2.180-1.870）/1.870=16.6%"},{"$f":"IFERROR(IF(CE35=\"-\",\"-\",IF(CE35=\"\",\"-\",IF(CE35/CD35=1,\"△\",IF(CE35/CD35>1,\"-（\"&ABS(ROUND(100*CE35/CD35-100,1))&\"％増）\",IF(CE35/CD35<1,\"○（\"&ABS(ROUND(100*CE35/CD35-100,1))&\"％減）\",\"\"))))),\"-\")","v":"○（19.8％減）"},{"$f":"IFERROR(IF(CD35=\"-\",\"-\",\"（\"&TEXT(CE35,\"##0.000\")&\"-\"&TEXT(CD35,\"##0.000\")&\"）/\"&TEXT(CD35,\"##0.000\")&\"=\"&TEXT((CE35-CD35)/CD35*100,\"0.0\")&\"%\"),\"-\")","v":"（1.500-1.870）/1.870=-19.8%"},{"$f":"IFERROR(IF(CG35=\"-\",\"-\",IF(CG35=\"\",\"-\",IF(CG35/CF35=1,\"△\",IF(CG35/CF35>1,\"-（\"&ABS(ROUND(100*CG35/CF35-100,1))&\"％増）\",IF(CG35/CF35<1,\"○（\"&ABS(ROUND(100*CG35/CF35-100,1))&\"％減）\",\"\"))))),\"-\")","v":"-（124.6％増）"},{"$f":"IFERROR(IF(CF35=\"-\",\"-\",\"（\"&TEXT(CG35,\"##0.000\")&\"-\"&TEXT(CF35,\"##0.000\")&\"）/\"&TEXT(CF35,\"##0.000\")&\"=\"&TEXT((CG35-CF35)/CF35*100,\"0.0\")&\"%\"),\"-\")","v":"（4.200-1.870）/1.870=124.6%"},{"$f":"IFERROR(IF(CI35=\"-\",\"-\",IF(CI35=\"\",\"-\",IF(CI35/CH35=1,\"△\",IF(CI35/CH35>1,\"-（\"&ABS(ROUND(100*CI35/CH35-100,1))&\"％増）\",IF(CI35/CH35<1,\"○（\"&ABS(ROUND(100*CI35/CH35-100,1))&\"％減）\",\"\"))))),\"-\")","v":"-（60.4％増）"},{"$f":"IFERROR(IF(CH35=\"-\",\"-\",\"（\"&TEXT(CI35,\"##0.000\")&\"-\"&TEXT(CH35,\"##0.000\")&\"）/\"&TEXT(CH35,\"##0.000\")&\"=\"&TEXT((CI35-CH35)/CH35*100,\"0.0\")&\"%\"),\"-\")","v":"（3.000-1.870）/1.870=60.4%"},{"$f":"IFERROR(IF(CK35=\"-\",\"-\",IF(CK35=\"\",\"-\",IF(CK35/CJ35=1,\"△\",IF(CK35/CJ35>1,\"-（\"&ABS(ROUND(100*CK35/CJ35-100,1))&\"％増）\",IF(CK35/CJ35<1,\"○（\"&ABS(ROUND(100*CK35/CJ35-100,1))&\"％減）\",\"\"))))),\"-\")","v":"○（19.3％減）"},{"$f":"IFERROR(IF(CJ35=\"-\",\"-\",\"（\"&TEXT(CK35,\"##0.000\")&\"-\"&TEXT(CJ35,\"##0.000\")&\"）/\"&TEXT(CJ35,\"##0.000\")&\"=\"&TEXT((CK35-CJ35)/CJ35*100,\"0.0\")&\"%\"),\"-\")","v":"（1.510-1.870）/1.870=-19.3%"},{"$f":"IFERROR(IF(CM35=\"-\",\"-\",IF(CM35=\"\",\"-\",IF(CM35/CL35=1,\"△\",IF(CM35/CL35>1,\"-（\"&ABS(ROUND(100*CM35/CL35-100,1))&\"％増）\",IF(CM35/CL35<1,\"○（\"&ABS(ROUND(100*CM35/CL35-100,1))&\"％減）\",\"\"))))),\"-\")","v":"○（10.2％減）"},{"$f":"IFERROR(IF(CL35=\"-\",\"-\",\"（\"&TEXT(CM35,\"##0.000\")&\"-\"&TEXT(CL35,\"##0.000\")&\"）/\"&TEXT(CL35,\"##0.000\")&\"=\"&TEXT((CM35-CL35)/CL35*100,\"0.0\")&\"%\"),\"-\")","v":"（1.680-1.870）/1.870=-10.2%"},{"$f":"IFERROR(IF(CO35=\"-\",\"-\",IF(CO35=\"\",\"-\",IF(CO35/CN35=1,\"△\",IF(CO35/CN35>1,\"-（\"&ABS(ROUND(100*CO35/CN35-100,1))&\"％増）\",IF(CO35/CN35<1,\"○（\"&ABS(ROUND(100*CO35/CN35-100,1))&\"％減）\",\"\"))))),\"-\")","v":"○（19.3％減）"},{"$f":"IFERROR(IF(CN35=\"-\",\"-\",\"（\"&TEXT(CO35,\"##0.000\")&\"-\"&TEXT(CN35,\"##0.000\")&\"）/\"&TEXT(CN35,\"##0.000\")&\"=\"&TEXT((CO35-CN35)/CN35*100,\"0.0\")&\"%\"),\"-\")","v":"（1.510-1.870）/1.870=-19.3%"},{"$f":"IFERROR(IF(CQ35=\"-\",\"-\",IF(CQ35=\"\",\"-\",IF(CQ35/CP35=1,\"△\",IF(CQ35/CP35>1,\"-（\"&ABS(ROUND(100*CQ35/CP35-100,1))&\"％増）\",IF(CQ35/CP35<1,\"○（\"&ABS(ROUND(100*CQ35/CP35-100,1))&\"％減）\",\"\"))))),\"-\")","v":"△"},{"$f":"IFERROR(IF(CP35=\"-\",\"-\",\"（\"&TEXT(CQ35,\"##0.000\")&\"-\"&TEXT(CP35,\"##0.000\")&\"）/\"&TEXT(CP35,\"##0.000\")&\"=\"&TEXT((CQ35-CP35)/CP35*100,\"0.0\")&\"%\"),\"-\")","v":"（1.870-1.870）/1.870=0.0%"},{"$f":"IFERROR(IF(CS35=\"-\",\"-\",IF(CS35=\"\",\"-\",IF(CS35/CR35=1,\"△\",IF(CS35/CR35>1,\"-（\"&ABS(ROUND(100*CS35/CR35-100,1))&\"％増）\",IF(CS35/CR35<1,\"○（\"&ABS(ROUND(100*CS35/CR35-100,1))&\"％減）\",\"\"))))),\"-\")","v":"-"},{"$f":"IFERROR(IF(CR35=\"-\",\"-\",\"（\"&TEXT(CS35,\"##0.000\")&\"-\"&TEXT(CR35,\"##0.000\")&\"）/\"&TEXT(CR35,\"##0.000\")&\"=\"&TEXT((CS35-CR35)/CR35*100,\"0.0\")&\"%\"),\"-\")","v":"-"},{"$f":"IFERROR(IF(CU35=\"-\",\"-\",IF(CU35=\"\",\"-\",IF(CU35/CT35=1,\"△\",IF(CU35/CT35>1,\"-（\"&ABS(ROUND(100*CU35/CT35-100,1))&\"％増）\",IF(CU35/CT35<1,\"○（\"&ABS(ROUND(100*CU35/CT35-100,1))&\"％減）\",\"\"))))),\"-\")","v":"-（60.4％増）"},{"$f":"IFERROR(IF(CT35=\"-\",\"-\",\"（\"&TEXT(CU35,\"##0.000\")&\"-\"&TEXT(CT35,\"##0.000\")&\"）/\"&TEXT(CT35,\"##0.000\")&\"=\"&TEXT((CU35-CT35)/CT35*100,\"0.0\")&\"%\"),\"-\")","v":"（3.000-1.870）/1.870=60.4%"},{"$f":"IFERROR(IF(CW35=\"-\",\"-\",IF(CW35=\"\",\"-\",IF(CW35/CV35=1,\"△\",IF(CW35/CV35>1,\"-（\"&ABS(ROUND(100*CW35/CV35-100,1))&\"％増）\",IF(CW35/CV35<1,\"○（\"&ABS(ROUND(100*CW35/CV35-100,1))&\"％減）\",\"\"))))),\"-\")","v":"△"},{"$f":"IFERROR(IF(CV35=\"-\",\"-\",\"（\"&TEXT(CW35,\"##0.000\")&\"-\"&TEXT(CV35,\"##0.000\")&\"）/\"&TEXT(CV35,\"##0.000\")&\"=\"&TEXT((CW35-CV35)/CV35*100,\"0.0\")&\"%\"),\"-\")","v":"（1.870-1.870）/1.870=0.0%"},"／","／",{"$f":"IFERROR(IF(DA35=\"-\",\"-\",IF(DA35=\"\",\"-\",IF(DA35/CZ35=1,\"△\",IF(DA35/CZ35>1,\"-（\"&ABS(ROUND(100*DA35/CZ35-100,1))&\"％増）\",IF(DA35/CZ35<1,\"○（\"&ABS(ROUND(100*DA35/CZ35-100,1))&\"％減）\",\"\"))))),\"-\")","v":"○（7％減）"},{"$f":"IFERROR(IF(CZ35=\"-\",\"-\",\"（\"&TEXT(DA35,\"##0.000\")&\"-\"&TEXT(CZ35,\"##0.000\")&\"）/\"&TEXT(CZ35,\"##0.000\")&\"=\"&TEXT((DA35-CZ35)/CZ35*100,\"0.0\")&\"%\"),\"-\")","v":"（1.740-1.870）/1.870=-7.0%"},{"$f":"IFERROR(IF(DC35=\"-\",\"-\",IF(DC35=\"\",\"-\",IF(DC35/DB35=1,\"△\",IF(DC35/DB35>1,\"-（\"&ABS(ROUND(100*DC35/DB35-100,1))&\"％増）\",IF(DC35/DB35<1,\"○（\"&ABS(ROUND(100*DC35/DB35-100,1))&\"％減）\",\"\"))))),\"-\")","v":"○（63.6％減）"},{"$f":"IFERROR(IF(DB35=\"-\",\"-\",\"（\"&TEXT(DC35,\"##0.000\")&\"-\"&TEXT(DB35,\"##0.000\")&\"）/\"&TEXT(DB35,\"##0.000\")&\"=\"&TEXT((DC35-DB35)/DB35*100,\"0.0\")&\"%\"),\"-\")","v":"（0.680-1.870）/1.870=-63.6%"},{"$f":"IFERROR(IF(DE35=\"-\",\"-\",IF(DE35=\"\",\"-\",IF(DE35/DD35=1,\"△\",IF(DE35/DD35>1,\"-（\"&ABS(ROUND(100*DE35/DD35-100,1))&\"％増）\",IF(DE35/DD35<1,\"○（\"&ABS(ROUND(100*DE35/DD35-100,1))&\"％減）\",\"\"))))),\"-\")","v":"○（46.5％減）"},{"$f":"IFERROR(IF(DD35=\"-\",\"-\",\"（\"&TEXT(DE35,\"##0.000\")&\"-\"&TEXT(DD35,\"##0.000\")&\"）/\"&TEXT(DD35,\"##0.000\")&\"=\"&TEXT((DE35-DD35)/DD35*100,\"0.0\")&\"%\"),\"-\")","v":"（1.000-1.870）/1.870=-46.5%"},{"$f":"IFERROR(IF(DG35=\"-\",\"-\",IF(DG35=\"\",\"-\",IF(DG35/DF35=1,\"△\",IF(DG35/DF35>1,\"-（\"&ABS(ROUND(100*DG35/DF35-100,1))&\"％増）\",IF(DG35/DF35<1,\"○（\"&ABS(ROUND(100*DG35/DF35-100,1))&\"％減）\",\"\"))))),\"-\")","v":"-（3.2％増）"},{"$f":"IFERROR(IF(DF35=\"-\",\"-\",\"（\"&TEXT(DG35,\"##0.000\")&\"-\"&TEXT(DF35,\"##0.000\")&\"）/\"&TEXT(DF35,\"##0.000\")&\"=\"&TEXT((DG35-DF35)/DF35*100,\"0.0\")&\"%\"),\"-\")","v":"（1.930-1.870）/1.870=3.2%"}]
[null,null,"判定の凡例 \n  ○：従来技術より優れる\n  △：従来技術と同程度\n  －：上記以外",null,"品質・出来形","-：性能評価については⑰並びに「総括（耐久性）」に記載。",null,"-：・必要に応じて退色塗料の混入による塗布確認。・性能評価については⑰並びに「総括（耐久性）」に記載。",null,"-：性能評価については⑰並びに「総括（耐久性）」に記載。",null,"-：性能評価については⑰並びに「総括（耐久性）」に記載。",null,"-：性能評価については⑰並びに「総括（耐久性）」に記載。",null,"-：性能評価については⑰並びに「総括（耐久性）」に記載。",null,"-：・退色塗料の混入による塗布確認。　・性能評価については⑰並びに「総括（耐久性）」に記載。",null,"-：性能評価については⑰並びに「総括（耐久性）」に記載。",null,"-：性能評価については⑰並びに「総括（耐久性）」に記載。",null,"-：性能評価については⑰並びに「総括（耐久性）」に記載。",null,"-：・性能評価については⑰並びに「総括（耐久性）」に記載。 ・専用の塗布量管理パステスターを設置し、適正発色を確認することで塗布量管理が可能。",null,"-：性能評価については⑰並びに「総括（耐久性）」に記載。",null,"-：性能評価については⑰並びに「総括（耐久性）」に記載。",null,"-：性能評価については⑰並びに「総括（耐久性）」に記載。",null,"-：性能評価については⑰並びに「総括（耐久性）」に記載。",null,"-：性能評価については⑰並びに「総括（耐久性）」に記載。",null,"-：性能評価については⑰並びに「総括（耐久性）」に記載。",null,"-：性能評価については⑰並びに「総括（耐久性）」に記載。",null,"-：性能評価については⑰並びに「総括（耐久性）」に記載。",null,"-：性能評価については⑰並びに「総括（耐久性）」に記載。",null,"-：性能評価については⑰並びに「総括（耐久性）」に記載。",null,"-：性能評価については⑰並びに「総括（耐久性）」に記載。",null,"-：・退色塗料の混入による塗布確認。　・性能評価については⑰並びに「総括（耐久性）」に記載。",null,"-：性能評価については⑰並びに「総括（耐久性）」に記載。",null,"-：性能評価については⑰並びに「総括（耐久性）」に記載。",null,"-：・フィルムゲージによる塗布量（塗布厚）の確認。　・性能評価については⑰並びに「総括（耐久性）」に記載。",null,"-：性能評価については⑰並びに「総括（耐久性）」に記載。",null,"-：性能評価については⑰並びに「総括（耐久性）」に記載。",null,"-：性能評価については⑰並びに「総括（耐久性）」に記載。",null,"-：性能評価については⑰並びに「総括（耐久性）」に記載。",null,"-：性能評価については⑰並びに「総括（耐久性）」に記載。",null,"-：性能評価については⑰並びに「総括（耐久性）」に記載。",null,"-：性能評価については⑰並びに「総括（耐久性）」に記載。",null,"-：性能評価については⑰並びに「総括（耐久性）」に記載。",null,"-：性能評価については⑰並びに「総括（耐久性）」に記載。",null,"-：性能評価については⑰並びに「総括（耐久性）」に記載。",null,"-：性能評価については⑰並びに「総括（耐久性）」に記載。",null,"-：性能評価については⑰並びに「総括（耐久性）」に記載。",null,"-：性能評価については⑰並びに「総括（耐久性）」に記載。",null,"-：性能評価については⑰並びに「総括（耐久性）」に記載。",null,"-：性能評価については⑰並びに「総括（耐久性）」に記載。",null,"-：性能評価については⑰並びに「総括（耐久性）」に記載。",null,"-：性能評価については⑰並びに「総括（耐久性）」に記載。",null,"-：性能評価については⑰並びに「総括（耐久性）」に記載。",null,"-：性能評価については⑰並びに「総括（耐久性）」に記載。",null,"-：性能評価については⑰並びに「総括（耐久性）」に記載。",null,"-：性能評価については⑰並びに「総括（耐久性）」に記載。",null,"/：性能評価については⑰並びに「総括（耐久性）」に記載。",null,"／",null,"/：性能評価については⑰並びに「総括（耐久性）」に記載。",null,"/：性能評価については⑰並びに「総括（耐久性）」に記載。",null,"/：性能評価については⑰並びに「総括（耐久性）」に記載。\t",null,"/：性能評価については⑰並びに「総括（耐久性）」に記載。\t"]
[null,null,null,null,"安全性","△：従来技術と同程度",null,"△：従来技術と同程度",null,"△：従来技術と同程度",null,"△：従来技術と同程度",null,"△：従来技術と同程度",null,"△：従来技術と同程度",null,"△：従来技術と同程度",null,"△：従来技術と同程度",null,"△：従来技術と同程度",null,"△：従来技術と同程度",null,"△：従来技術と同程度",null,"△：従来技術と同程度",null,"△：従来技術と同程度",null,"△：従来技術と同程度",null,"△：従来技術と同程度",null,"△：従来技術と同程度",null,"△：従来技術と同程度",null,"△：従来技術と同程度",null,"△：従来技術と同程度",null,"△：従来技術と同程度",null,"△：従来技術と同程度",null,"△：従来技術と同程度",null,"△：従来技術と同程度",null,"△：従来技術と同程度",null,"△：従来技術と同程度",null,"△：従来技術と同程度",null,"△：従来技術と同程度",null,"△：従来技術と同程度",null,"△：従来技術と同程度",null,"△：従来技術と同程度",null,"△：従来技術と同程度。",null,"△：従来技術と同程度。",null,"△：従来技術と同程度。",null,"△：従来技術と同程度。",null,"△：従来技術と同程度",null,"△：従来技術と同程度",null,"△：従来技術と同程度",null,"△：従来技術と同程度",null,"△：従来技術と同程度",null,"△：従来技術と同程度",null,"△：従来技術と同程度",null,"△：従来技術と同程度",null,"△：従来技術と同程度",null,"△：従来技術と同程度",null,"△：従来技術と同程度",null,"△：従来技術と同程度。",null,"△：従来技術と同程度。",null,"△：従来技術と同程度",null,"／",null,"△：従来技術と同程度",null,"△：従来技術と同程度",null,"△：従来技術と同程度",null,"△：従来技術と同程度"]
[null,null,null,null,"施工性","△：塗布回数は2回。",null,"-：塗装回数は浸透促進剤1回、主剤2回、結晶促進剤1回の計4回。",null,"○：塗装回数は1回。",null,"○：塗布回数は1回。",null,"○：塗装回数は1回。",null,"○：塗装回数は1回。",null,"△：塗布回数は2回。",null,"○：塗布回数は1回。",null,"○：塗装回数は1回。",null,"△：塗布回数は3回",null,"△：塗布回数は2回",null,"△：塗布回数は2回",null,"△：塗布回数は3回",null,"○：塗布回数は1回（新設構造物への塗装時）",null,"△：塗布回数は2回",null,"△：塗布回数は2回",null,"-：塗布回数は合計3回",null,"△：塗布回数は2回",null,"○：塗布回数は1回。",null,"△：塗布回数は2回（1回塗布の場合、合計塗布量は2回塗布より少ない）。",null,"△：塗布回数は2回（養生用は1回）",null,"△：塗布回数は2回（新設構造物の場合1回）",null,"△：塗布回数は3回。",null,"-：主剤2回、補助剤2回の4回塗布。",null,"○：塗装回数は連続2回。",null,"○：塗装回数は1回。",null,"△：塗布回数は2回。",null,"○：塗布回数は1回。",null,"△：塗布回数は2回。",null,"○：塗布回数は1回。",null,"△：塗布回数は2回。",null,"△：塗布回数は2回。",null,"○：塗布回数は1回。液垂れし難い。",null,"○：塗布回数は1回。液垂れし難い。",null,"○：塗布回数は1回。",null,"○：塗布回数は1回。",null,"△：塗布回数は2回。",null,"○：塗布回数は1回。",null,"○：塗布回数は1回。",null,"△：従来技術と同程度",null,"△：従来技術と同程度",null,"○：塗布回数は１回",null,"○：塗布回数は1回",null,"○：塗布回数は1回",null,"△：塗布回数は2回",null,"△：張付け作業は１回となるが、撤去が発生するため同程度。",null,"△：従来技術と同程度。",null,"○：塗布回数は1回",null,"／",null,"○：塗布回数は1回。",null,"○：塗布回数は1回",null,"○：規定の原液量を塗布するのではなく、水で希釈した流動性が高い希釈液をスプレイヤーで施工する為、施工性が向上する。",null,"○：1回塗りで少量の施工ができるため"]
[null,null,null,null,"環境","△：従来技術と同程度",null,"△：従来技術と同程度",null,"△：従来技術と同程度",null,"△：従来技術と同程度",null,"△：従来技術と同程度",null,"△：従来技術と同程度",null,"△：従来技術と同程度",null,"△：従来技術と同程度",null,"△：従来技術と同程度",null,"△：従来技術と同程度",null,"△：従来技術と同程度",null,"△：従来技術と同程度",null,"△：従来技術と同程度",null,"△：従来技術と同程度",null,"△：従来技術と同程度",null,"△：従来技術と同程度",null,"△：従来技術と同程度",null,"△：従来技術と同程度",null,"△：従来技術と同程度",null,"△：従来技術と同程度",null,"△：従来技術と同程度",null,"△：従来技術と同程度",null,"△：従来技術と同程度",null,"△：従来技術と同程度",null,"△：従来技術と同程度",null,"△：従来技術と同程度",null,"△：従来技術と同程度",null,"△：従来技術と同程度",null,"△：従来技術と同程度",null,"△：従来技術と同程度",null,"△：従来技術と同程度。",null,"△：従来技術と同程度。",null,"△：従来技術と同程度。",null,"△：従来技術と同程度。",null,"△：従来技術と同程度",null,"△：従来技術と同程度",null,"△：従来技術と同程度",null,"△：従来技術と同程度",null,"△：従来技術と同程度",null,"△：従来技術と同程度",null,"△：従来技術と同程度",null,"△：従来技術と同程度",null,"△：従来技術と同程度",null,"△：従来技術と同程度",null,"△：従来技術と同程度",null,"-：撤去した表面被覆材は、廃プラスチックとしての廃棄物処理が必要となる。",null,"△：従来技術と同程度。",null,"△：従来技術と同程度",null,"／",null,"△：従来技術と同程度",null,"△：従来技術と同程度",null,"△：従来技術と同程度",null,"△：従来技術と同程度"]
[null,"⑰","試験項目",null,"評価基準　注3）","シラン系評価基準評価基準","JSCE-K571（公的機関）","その他表面保護材評価基準","JSCE-K571（公的機関）","シラン系評価基準評価基準","JSCE-K571（自社試験）","ケイ酸塩系ASR適用可評価基準","JSCE-K572（公的機関）","シラン系評価基準評価基準","JSCE-K571（自社試験）","シラン系評価基準評価基準","JSCE-K571（公的機関）","シラン系評価基準評価基準","JSCE-K571（公的機関）","ケイ酸塩系ASR適用不可評価基準","JSCE-K572（自社試験）","ケイ酸塩系ASR適用不可評価基準","JSCE-K572（公的機関）","その他表面保護材評価基準","JSCE-K572（公的機関）","ケイ酸塩系ASR適用不可評価基準","JSCE-K572（公的機関・自社試験）","ケイ酸塩系ASR適用不可評価基準","JSCE-K571（公的機関）","ケイ酸塩系ASR適用不可評価基準","JSCE-K571（公的機関）","ケイ酸塩系ASR適用不可評価基準","JSCE-K572（公的機関）","ケイ酸塩系ASR適用不可評価基準","JSCE-K572（公的機関）","その他表面保護材評価基準","JSCE-K571（公的機関）","その他表面保護材評価基準","JSCE-K571、572（公的機関）","ケイ酸塩系ASR適用不可評価基準","JSCE-K572（公的機関）","シラン系評価基準評価基準","JSCE-K571（公的機関）","ケイ酸塩系ASR適用不可評価基準","JSCE-K572（公的機関）","ケイ酸塩系ASR適用不可評価基準","JSCE-K572（公的試験）（けい酸ナトリウム、けい酸カリウム配合製品の試験結果（1回塗布））","ケイ酸塩系ASR適用不可評価基準","JSCE-K572（公的試験）（けい酸ナトリウム配合製品の試験結果（1回塗布））","シラン系評価基準評価基準","JSCE-K571（公的機関）","その他表面保護材評価基準","JSCE-K571他（公的機関）","ケイ酸塩系ASR適用可評価基準","JSCE-K571（自社試験）","シラン系評価基準評価基準","JSCE-K571（公的機関）","ケイ酸塩系ASR適用不可評価基準","JSCE-K572（自社試験）","シラン系評価基準評価基準","JSCE-K571（公的機関）","ケイ酸塩系ASR適用可評価基準","JSCE-K572（公的機関）","ケイ酸塩系ASR適用不可評価基準","JSCE-K571（自社試験）","シラン系評価基準評価基準","JSCE-K571（自社試験） （含浸材+表面塗布材）","ケイ酸塩系ASR適用不可評価基準","JSCE-K572（自社試験）","シラン系評価基準評価基準","JSCE-K571（公的機関）","シラン系評価基準評価基準","JSCE-K571（公的機関）","ケイ酸塩系ASR適用不可評価基準","JSCE-K572（公的機関）","ケイ酸塩系ASR適用可評価基準","JSCE-K572（公的機関）","ケイ酸塩系ASR適用不可評価基準","-","ケイ酸塩系ASR適用不可評価基準","JSCE-K572（公的機関）","その他表面保護材評価基準","JSCE-K571（公的機関）","シラン系評価基準評価基準","JSCE-K 571（民間委託）","ケイ酸塩系ASR適用可評価基準","JSCE-K 572（民間委託）","ケイ酸塩系ASR適用不可評価基準","JSCE-K 572（公的機関）","ケイ酸塩系ASR適用可評価基準","JSCE-K 572（公的機関）","シラン系評価基準評価基準","JSCE-K 571（公的機関）","ケイ酸塩系ASR適用不可評価基準","JSCE-K 572（公的機関）","ケイ酸塩系ASR適用不可評価基準","JSCE-K 572（民間委託）","シラン系評価基準評価基準","JSCE-K 571（自社試験）","シラン系評価基準評価基準","JSCE-K 571（公的機関）","その他表面保護材評価基準","JSCE-K571（公的機関）","シラン系評価基準評価基準","JSCE-K 571（民間委託）","その他表面保護材評価基準","JSCE-K 571/JSCE-K 572（自社試験）","その他表面保護材評価基準","-","シラン系評価基準評価基準","JSCE-K 571（公的機関）"]
[null,null,"含浸深さ（ｍｍ）",null,"-","-","0.96mm","-","-","-","2.2mm","-","-","-","2.3mm","-","4.4mm","-","6.1mm","-","0～2mm","-","3.2mm","-","-","-","3.2mm","-","-","-","-","-","4.2mm","-","-","-","-","-","Sクリートガード（JSCE-K571）：1.1mm","-","4.4mm","-","4.1mm","-","1.8mm","-","1.3mm ","-","1.6mm","-","7.6mm","-","-","-","3.04mm","-","8.4mm","-","6mm","-","7.2mm","-","4～6mm","-","　-　(参考：実構造物でのリチウム浸透深さ50mm）","-","3.8㎜","-","15mm","-","4.8mm","-","4.2mm","-","2.6mm","-","4.0mm","-","-","-","-","-","6.5mm","-","16.2mm","-","3～5mm","-","1.6mm","-","4mm","-","1.7mm","-","3.1mm","-","-","-","4.4mm","-","5.5mm","／","／","-","6.0mm","-","3.7mm/10.5mm","-","-","-","5.7mm"]
[null,null,"中性化抑制率（％）",null,"A：30%以上、B：30～10%、C：10%以下","C","Ａ（88.7％）","B","A(38.6％)","C","Ａ（65％）","B","A（68％）","C","Ａ（74％）","C","Ａ（100％）","C","B（18％）","B","A（35％）","B","A（56％）","B","B（27％）","B","A（70％）","B","A（93.2％）","B","A（55.2％）","B","B（16％）","B","普通ポルトランドセメント：A（52.0％）、高炉セメントB種：A（50.4％）","B","A(54.8％）","B","Sクリートガード（JSCE-K571）：A（45％）","B","B（17％）","C","Ａ（33％）","B","A（33％）","B","B（23％）","B","C（8％）","C","Ａ（38％）","B","-","B","A（70％）","C","B（15％）","B","B（24％）","C","Ａ（100％）","B","A（42％）","B","A（100%）","C","A（83％）","B","A（50％）","C","A（93％）","C","A（96％）","B","C（8％）","B","Ａ（73％）","B","-","B","Ａ（40％）","B","Ｂ（22％）","C","Ａ（100％）","B","Ａ（48％）","B","C（8％）","B","Ａ（61.8％）","C","Ａ（82％）","B","-","B","Ａ（45％）","C","Ａ（100％）","C","A（32％）","／","／","C","A（100％）","B","A（62%）/A（62%）","B","-","C","A（100％）"]
[null,null,"Cl-浸透抑制率（％）",null,"A：80%以上、B：80～60%、C：60%以下","A","Ａ（100％）","A","C（13％）","A","Ａ（94％）","C","C（41％）","A","Ａ（87％）","A","Ａ（100％）","A","Ａ（100％）","C","C（24％）","C","C（43％）","A","B（62％）","C","Ｂ（73％）","C","C（19.3％）","C","C（35.2％）","C","C（16％）","C","普通ポルトランドセメント：C（29.4％）、高炉セメントB種：C（35.0％）","A","-","A","Sクリートガード（JSCE-K571）：A（100％）","C","C（4％）","A","Ａ（100％）","C","C（11％）","C","未実施","C","未実施","A","Ａ（100％）","A","C(36％)","C","A（80％）","A","Ａ（100％）","C","C（25％）","A","Ａ（100％）","C","C（26％）","C","C(15%)","A","B（73％）","C","C（21％）","A","A（100％）","A","A（100％）","C","C（3％）","C","Ａ（85％）","C","-","C","C（31％）","A","Ａ（98％）","A","Ａ（100％）","C","Ｃ（22％）","C","C（50％）","C","Ｃ（45.9％）","A","Ａ（91％）","C","-","C","-","A","Ａ（100％）","A","A（90％）","／","／","A","A（100％）","A","A（93%）/A（93%）","A","-","A","A（100％）"]
[null,null,"透水抑制率（％）",null,"A：80%以上、B：80～60%、C：60%以下","A","Ａ（95％）","A","B(77％)","A","Ａ（88％）","A","C（46％）","A","Ａ（98％）","A","Ａ（96％）","A","Ａ（85％）","-","C（55％）","-","B（67％）","A","B（62％）","-","Ａ（80％）","-","B（72.0％）","-","A（90.5％）","-","-","-","-","A","-","A","Sクリー卜アップ（JSCE-K572）：C（29％）、Sクリートガード（JSCE-K571）：A（85％）","-","-","A","Ａ（95％）","-","C（39％）","-","C（20％）","A","C（23％）","A","Ａ（84％）","A","-","A","A（81％）","A","Ａ（97％）","-","B（62％）","A","Ａ（89％）","A","C（35％）","-","C(65%)","A","A(90％）","-","C（39％）","A","A（90％）","A","A（90％）","-","C（12％）","A","Ｂ（73％）","-","-","-","B（67％）","A","Ａ（96％）","A","Ａ（84％）","A","Ａ（82％）","-","C（23％）","A","B（75.4％）","A","Ａ（91％）","-","Ｃ（50%）","-","Ｂ（68％）","A","Ａ（85％）","A","A（96％）","／","／","A","A（90％）","A","A（90%）/A（90%）","A","-","A","A（93％）"]
[null,null,"吸水抑制率（％）",null,"A：80%以上、B：80～60%、C：60%以下","A","Ａ（88％）","A","-","A","Ａ（87％）","A","C（75％）","A","Ａ（94％）","A","Ａ（93％）","A","Ａ（92％）","-","C（10％）","-","C（55％）","A","A（87％）","-","Ａ（81％）","-","-","-","-","-","C（34％）","-","-","A","-","A","Sクリー卜アップ（JSCE-K572）：C（0％）、Sクリートガード（JSCE-K571）：A（91％）","-","C（24％）","A","Ａ（90％）","-","C（22％）","-","C（14％）","A","C（14％）","A","Ａ（83％）","A","-","A","A（82％）","A","Ａ（96％）","-","C（18％）","A","Ａ（86％）","A","C（45％）","-","C(30%)","A","B（78％）","-","C（52％）","A","A（91％）","A","A（92％）","-","C（15％）","A","Ｂ（62％）","-","-","-","C（45％）","A","Ａ（91％）","A","Ａ（86％）","A","Ｂ（60％）","-","C（14％）","A","Ｃ（17.8％）","A","Ａ（93％）","-","Ａ（88%）","-","-","A","Ａ（85％）","A","A（91％）","／","／","A","A（92％）","A","A（94%）/A（94%）","A","-","A","A（93％）"]
[null,null,"透湿比（％）",null,"A：80%以上、B：80～60%、C：60%以下","B","Ａ（95％）","B","-","B","Ｃ（60％）","B","-","B","Ａ（92％）","B","Ａ（100％）","B","Ａ（92％）","-","-","-","-","B","A（95％）（JSCE-K571）","-","-","-","-","-","-","-","-","-","-","B","-","B","Sクリー卜アップ（JSCE-K571）：A（106％）、Sクリートガード（JSCE-K571）：A（96％）","-","-","B","Ａ（86％）","-","-","-","-","B","-","B","A（92％）","B","-","B","A（85％）","B","Ａ（82％）","-","-","B","Ａ（110％）","B","-","-","A（100%）","B","-","-","-","B","A（100％）","B","A（82％）","-","-","B","-","-","-","-","-","B","Ｂ（76％）","B","Ｂ（64％）","B","-","-","-","B","-","B","Ａ（87％）","-","-","-","-","B","Ａ（90％）","B","A（93％）","／","／","B","A（86％）","B","A（87%）/-","B","-","B","A（100％）"]
[null,null,"その他の試験",null,null,"・コンクリートの凍結融解試験法（JIS A1148、水中凍結水中融解）　無処理品との差異見られず（民間委託）",null,"アルカリシリカ反応抑制試験（走査型電子顕微鏡による観察）　けい酸ソーダの生成は確認されなかった",null,"凍結融解試験（RILEM CDF スケーリング試験）　無塗布のスケール量1306g/㎡に対してスケール量75g/㎡",null,"・ｽｹｰﾘﾝｸﾞに対する抵抗性試験（JSCE-K 572）　質量損失比18％（抑制率82％)（公的機関）",null,"-",null,"-",null,"-",null,"・ｽｹｰﾘﾝｸﾞに対する抵抗性試験（JSCE-K 572）　質量損失比35.29％（抑制率64.71％）",null,"ｽｹｰﾘﾝｸﾞに対する抵抗性試験（JSCE-K 572）　質量損失比43.1％（抑制率75.9％）（公的機関）・屋外暴露試験　劣化の進行具合は未処理のものに比べて遅い（自社試験）",null,"スケーリングに対する抵抗性試験（JSCE-K 572）：質量損失抑制率78％（公的機関）・ひび割れ透水性試験（JSCE-K 572）：ひび割れ透水抑制率31％（公的機関）・化学的浸食に対する抵抗性試験（JSCE-K 572）：質量損失抑制率64％（公的機関）・硬さ試験（JSCE-K 572）：モース硬度6.5、表面硬度比121.88％（公的機関）",null,"・ｽｹｰﾘﾝｸﾞに対する抵抗性試験（JSCE-K 572）　質量損失比77.9％（抑制率22.1％）（公的機関）・・ひび割れ透水性試験　（JSCE-K 572）　ひび割れ透水比7.7％（抑制率92.3％）（公的機関）・・加圧透水性試験　（JSCE-K 572） 水の浸透深さ比48.2％（51.8抑制％）（公的機関）・・自己補修機能確認試験　幅0.2mmのひび割れからの漏水が36時間程度で止水することが確認できた。（自社試験）",null,"透水性試験：透水抑制率（塩水）69.0％（公的機関）・ひび割れ透水性試験（JSCE-K 572）：ひび割れ透水抑制率91.2％（公的機関）",null,"透水性試験：透水抑制率（塩水）84.4％（公的機関）・ひび割れ透水性試験（JSCE-K 572）：ひび割れ透水抑制率91.6％（公的機関）",null,"スケーリングに対する抵抗性試験（JSCE-K 572）：質量損失抑制率61％（公的機関）・表層透気試験：透気係数が81.2％低減（自社試験）",null,"ひび割れ透水性試験（JSCE-K 572）：ひび割れ透水抑制率　普通ポルトランドセメント：98.9％、高炉セメントB種：99.4％（公的機関）",null,"化学抵抗性試験：5%希硫酸溶液に6週間漬けた後の重量減少率は無塗布供試体29.7%に対して7.4%（自社試験）・透水性試験：無塗布供試体（普通、高炉B）の透水係数（×10＾-10cm/sec）1.49、1.10に対して0.25、0.35（民間委託）・ひび割れ透水試験：供試体（普通、高炉B）のひび割れ透水比は塗布後2日で52.05％、45.22％に対して、塗布後14日で1.31％、0.60％（公的機関）・塩分浸透試験：塗布後の供試体（普通、高炉B）の浸透深さ比は74％、81％（公的機関）",null,"凍結融解試験（JISA1148）（Sクリー卜アップ）：未塗布での実質減少率2.75％に対して1.15％・耐候性試験（Sクリー卜ガード）：初期吸水率0.7％に対して、40サイクル後（920時間：約10年相当）0.8％",null,"スケーリングに対する抵抗性試験（JSCE-K 572）：質量損失抑制率21％（公的機関）・ひび割れ透水性試験（JSCE-K 572）：ひび割れ透水抑制率100％（公的機関）",null,"凍結融解試験（RILEM類似法）　スケーリングの抑制効果を確認（自社試験）・紫外線劣化抑制率試験（透水量試験）　紫外線劣化抑制率83％（公的機関）",null,"・ｽｹｰﾘﾝｸﾞに対する抵抗性試験（JSCE-K 572）　質量損失比49.55％（抑制率50.45％）（公的機関）",null,"・ｽｹｰﾘﾝｸﾞに対する抵抗性試験（JSCE-K 572）　質量損失比19.54％（抑制率80.46％）　（公的試験）・・塩害用：塩化物イオン浸透深さ試験（日本建築学会「鉄筋コンクリート造構造物の耐久性調査・診断及び補修指針（案）」・同解説の付1.4 浸透性吸水防止材の品質基準（案）に準拠）　無塗布に対するCl-浸透抑制率は28％程度（自社試験（カタログでの性能根拠））・・CV：凍結融解試験　300サイクルにおける質量変化抑制効果（自社試験（カタログでの性能根拠））",null,"・ｽｹｰﾘﾝｸﾞに対する抵抗性試験（JSCE-K 572）　質量損失比30.53％（抑制率69.47％）（公的試験）・・高炉スラグコンクリートでの物質透過性能（透水試験、促進中性化試験、塩分浸透試験）・・高炉スラグコンクリートの試験体で、同社のカリウム配合型より抑制効果が高い（自社試験）",null,"鋼材腐食試験（塩水繰り返し促進試験後、6年間の暴露試験）（自社試験）",null,"・中性化促進試験　60日での無塗布の中性化深さ27.9mmに対して、本技術は21.6mm（中性化抑制率22.6％）（公的機関）\n・透水試験　0.5N/m㎡,0.3N/m㎡の透水圧で無塗布では透水があったのに対して、本技術では透水が無かった（公的機関）\n・凍結融解試験　435サイクル時点での相対動弾性係数は無塗布に対して劣化が少ない（公的機関）\n・自己修復性能の検証　幅0.25～0.15mmのひび割れが約5ヶ月で自己修復（公的機関）",null,"-",null,"・コンクリートの凍結融解試験法（JIS A1148、水中凍結水中融解）　・無塗布の耐久性指数8に対して耐久性指数50（公的機関）",null,"・ｽｹｰﾘﾝｸﾞに対する抵抗性試験（JSCE-K 572）　質量損失比57％（抑制率43％）（自社試験）",null,"・温冷繰返し試験（JIS A 6909準拠）　温冷繰返し10サイクル後の無塗布に対する吸水比0.1以下（自社試験）",null,"・ｽｹｰﾘﾝｸﾞに対する抵抗性試験（JSCE-K 572）　質量損失比38％（抑制率62％）（公的機関）・・アルカリ骨材反応抑制効果確認試験（アルカリ骨材反応の進んだ構造物からコア採取）・　無塗布と比較して若干の膨張率低減を確認（公的機関（NETIS情報））",null,"・塩水凍結融解試験（ASTM　C672法）　50サイクルでの無塗布に対する質量損失比10%（抑制率90％）（自社試験）\n・塩水凍結融解試験（RILEM　CDF法）　28サイクルでの無塗布に対する質量損失比46%（抑制率75％）（自社試験）　",null,"凍結融解試験（人工海水）：シラン濃度を20％、40％、60％、80％のそれぞれが、300サイクルで相対動弾性係数100%程度（自社試験）",null,"凍結融解試験（JISA1148）：300サイクルでの相対動弾性係数99%、質量減少率0.01%（自社試験）・表層強度試験：無処理に比べ115％強度が向上（自社試験）",null,"-",null,"-",null,"加圧透水性試験（JSCＥ-K572）：水の浸透深さ抑制率2％（公的機関）・着色材の退化試験：退色を確認（屋外72時間）（自社試験）・スケーリングに対する抵抗性試験（JSCＥ-K572）：質量損失比81％（公的機関）・ひび割れ透水性試験（JSCＥ-K572）：ひび割れ透水抑制率24％（公的機関）",null,"凍結融解試験（JIS A 1148のうち、水中凍結融解試験方法（A法））　無塗布供試体に比してEP塗布供試体の質量減少率が小さく、相対弾性係数が大きい（公的機関）・アルカリ骨材反応抑制効果確認試験（カナダ法促進膨張試験）　緩和効果を確認（公的機関）・スケーリングに対する抵抗性試験（JSCE-K572）：質量損失比84％（公的機関）・ひび割れ透水性試験（JSCE-K572）：ひびわれ透水比40％（公的機関）",null,"透水量試験(JSCE-K572準拠)：透水量がけい酸塩素表面含浸材単体57.0mlに対して、53.5ml（透水比93.9％）を確認（自社試験）・透水係数試験(JSCE-K572準拠)：透水係数がけい酸塩素表面含浸材単体1.0×10^10m/sに対して、0.65×10^6m/s（低減率65％）を確認（自社試験）・吸水率試験(JSCE-K572準拠)：吸水率がけい酸塩素表面含浸材単体3.3％に対して、2.9％（吸水比87.9％）を確認（自社試験）・摩耗試験(JIS K 7204準拠)：摩耗減量がけい酸塩素表面含浸材単体0.95gに対して、0.72g（低減率75.8％）を確認（自社試験）",null,"乾燥固形分率試験（JSCE-K572）を実施し、乾燥固形分率22％を確認・含浸深さ試験（JIS Z 2244）を実施し、含浸深さ7mmを確認（自社試験）・ひび割れ透水性試験（JSCE-K572）を実施し、ひび割れ透水比4％を確認",null,"促進耐候性試験を実施し、試験結果塩化物イオン浸透抑制率100％を確認",null,"-",null,"乾燥固形分率試験（JSCE-K572）：乾燥固形分率22.5％、加圧透水性試験（JSCE-K572）：0.38/day（民間委託）、促進中性化試験（RH促進中性化試験槽に於ける中性深さ測定）：3.52％（民間委託）・塩分浸透性試験（AASHTO　T-227に準拠）：4.64％（民間委託）、水中凍結水中融解法（JIS　A　6204付属書2に準拠RCPT試験結果）：2.8％（公的機関）・けい酸塩系塗布防水工事（JASS-8T-301に準拠）：31％合格（但し針状結晶は不合格）（公的機関）、表面引張強度（JIS　A　1113に準拠）：2.46N/mm2（民間委託）・表面硬度（JIS　K　5600　5.4「鉛筆法」に準拠、マイクロビッカース硬度計にて測定）：9H 　41.5HV0.3（民間委託）、テストハンマー強度（JSCE　G504に準拠）：26.8N／ｍｍ２（民間委託）",null,"乾燥固形分率試験（JSCE-K 572）：乾燥固形分率28.05％（公的機関）,ｽｹｰﾘﾝｸﾞに対する抵抗性試験（JSCE-K 572）：質量損失比30.5％（抑制率69.5％）（公的機関）・ひび割れ透水性試験（JSCE-K 572）：ひび割れ透水比1.13％（公的機関）,加圧透水性試験（JSCE-K 572）：水の浸透深さ比58.1％（公的機関）・反応性確認試験（JSCE-K 572）：水酸化カルシウムとの反応性を確認（公的機関）・外観観察試験（JSCE-K 572）：外観変化なし（公的機関）",null,"乾燥固形分率試験：乾燥固形分率25.4％（公的機関）・ｽｹｰﾘﾝｸﾞに対する抵抗性試験（JSCE-K 572）：質量損失比69.1％（抑制率30.9％）（公的機関）・ひび割れ透水性試験（JSCE-K 572）：ひび割れ透水比12.4％（公的機関）",null,"塗布試験：塗布2時間で疎水層の形成、さらに連続2時間連続降雨で疎水層を喪失しないことを確認（自社試験）",null,"-",null,"乾燥固形分率試験（JSCE-K572 6.2）：乾燥固形分率56.2％（公的機関）、スケーリングに対する抵抗性試験（CDF法）：質量損失比44.8％（抑制率55.2％）（民間委託）",null,"-",null,"外観（JSCE-K571-2100）：変化なし　判定（グレード）NC（公的機関）・密度試験：0.876g/㎤（民間委託）・耐候性試験：キセノンランプ3か月照射（実暴露9年相当）後の透水抑制率88％、塩化物イオン抑制率90％",null,"／",null,"-",null,"乾燥固形分率試験（JSCE-K 572）：乾燥固形分率51.5％（自社試験）・ひび割れ透水性試験（JSCE-K 572）：ひび割れ透水比0％（抑制率100％）（自社試験）・加圧透水性試験（JSCE-K 572）：水の浸透深さ比11.6％（抑制率88.4％）（自社試験）",null,"・吸水率標準要求の試験（JTJ275-2000に準拠）：標準要求の吸水率≤0.01mm/min1/2、測定値 2.21x10-6mm/min1/2・・乾燥時間（JT/T695-2007に準拠）：標準要求の表面乾燥時間（完全乾燥時間）≤2ｈ（≤24ｈ）、測定値0.5ｈ（3ｈ）・・耐酸性 (10%硫酸溶液) ,耐アルカリ性(10%水酸化ナトリウム液)試験（JT/T695-2007に準拠）：標準要求である240時間以上異常なし・・通気性試験（T/CECS476-2017に準拠）：水蒸気透過率基準値≥80g/(m2.d)、測定値83g/(m2.d)　・塩化物吸収低減効果試験（JTJ275-2000に準拠）：基準値≤90%、測定値90.4%",null,"・コンクリート2次製品（テールアルメ壁面パネル）への適用性について、製品の削孔コア試料およびテストピースを用いて外観観察試験、含浸深さ試験、吸水率試験（JSCE-K 571-2013）、および塩化物イオン抵抗試験（JSCE-G 572-2003）を実施した結果、すべての供試体において吸水抑制率および塩化物イオン浸透抑制率が向上することを確認した（自社試験）。"]
[null,"⑱","塗布方法",null,null,"低圧噴霧、スプレー散布、ローラー刷毛塗り、刷毛塗り",259908,"低圧噴霧、スプレー散布、ローラー刷毛塗り、刷毛塗り",259908,"ローラー刷毛塗り、刷毛塗り",259908,"低圧噴霧、ローラー刷毛塗り、刷毛塗り",259908,"スプレー散布、ローラー刷毛塗り、刷毛塗り",259908,"スプレー散布、ローラー刷毛塗り、刷毛塗り",259908,"低圧噴霧、スプレー散布、ローラー刷毛塗り、刷毛塗り",259908,"低圧噴霧、スプレー散布、ローラー刷毛塗り、刷毛塗り",259908,"スプレー散布、ローラー刷毛塗り、刷毛塗り",259908,"刷毛塗り、ローラー塗り、又は噴霧により行う",259908,"スプレー散布、ローラー刷毛塗り、刷毛塗り",259908,"噴霧器、ローラー等",259908,"噴霧器、ローラー等",259908,"ローラー刷毛、噴霧器等",259908,"散布機等",259908,"ローラー等で塗布または噴霧",259908,"高圧洗浄ガン、エア スプレー、噴霧器、ローラー、刷毛等",259908,"ローラー刷毛、噴霧器等",259908,"スプレー散布、ローラー刷毛塗り、刷毛塗り",259908,"低圧噴霧、スプレー散布、ローラー刷毛塗り、刷毛塗り、コテバケ",259908,"低圧噴霧、スプレー散布、ローラー刷毛塗り、刷毛塗り",259908,"低圧噴霧、スプレー散布、ローラー刷毛塗り、刷毛塗り",259908,"低圧噴霧、スプレー散布、ローラー刷毛塗り、刷毛塗り",259908,"スプレー散布、刷毛塗り",259908,"低圧噴霧、スプレー散布、ローラー刷毛塗り、刷毛塗り",259908,"スプレー散布、ローラー刷毛塗り、刷毛塗り",259908,"低圧噴霧、スプレー散布、ローラー刷毛塗り、刷毛塗り",259908,"低圧噴霧、スプレー散布、ローラー刷毛塗り、刷毛塗り",259908,"低圧噴霧、ローラー刷毛塗り、刷毛塗り",259908,"低圧噴霧、ローラー刷毛塗り、刷毛塗り",259908,"刷毛塗り、ローラー刷毛塗り",259908,"低圧噴霧、ローラー塗り",259908,"ローラー刷毛塗り、刷毛塗り、スプレー散布",259908,"ローラー刷毛塗り、刷毛塗り、スプレー散布",259908,"ローラー塗り、噴霧",259908,"噴霧器、ローラー、刷毛",259908,"ローラー塗り、噴霧",259908,"噴霧器,ローラー,刷毛,モップ,ゴムワイパー　",259908,"刷毛、ローラー、スプレー",259908,"ローラー、刷毛",259908,"ローラー、刷毛",259908,"噴霧器、ローラー、刷毛",259908,"ローラー、刷毛、噴霧器",259908,"エアレススプレー、ローラー、刷毛",259908,"噴霧器、ローラー、刷毛",259908,"刷毛等による表面被覆材の張付け",259908,"エアレスガン、噴霧器、ローラー、刷毛",259908,"噴霧器・ローラー・刷毛にて全体的に均一になるように塗布",259908,"／",259908,"はけ、ローラー、吹き付け",259908,"刷毛、ローラー、低圧噴霧",259908,"スプレイヤー",259908,"噴霧器・ローラー・刷毛",259908]
[null,"⑲","表面含浸材の色",null,null,"無色透明（調色可能）",259908,"水溶液（主剤：青、浸透促進剤：ピンク、結晶促進剤：淡緑）",259908,"半透明（粘性液体）",259908,"無色透明",259908,"無色透明",259908,"乳白色",259908,"無色透明",259908,"　無色透明",259908,"透明",259908,"無色透明",259908,"無色透明",259908,"無色透明",259908,"リアクトライズ：無色透明液体、カルサプリ：黄色透明液体",259908,"無色透明",259908,"FS-#50：青色、FS-#55：無色透明",259908,"透明無色",259908,"無色透明",259908,"白色または淡桃白色液体",259908,"乳白色（ペースト状）",259908,"無色透明",259908,"無色",259908,"無色",259908,"無色～淡黄色透明",259908,"灰色紛体（粉体：水＝1：0.35 の重量比で混練り ）",259908,"無色透明",259908,"無色透明",259908,"無色透明",259908,"淡黄色(ジェル状）",259908,"無色粘稠性液体",259908,"白色透明",259908,"含浸材：無色透明、表面塗布材：薄い黄色",259908,"無色透明",259908,"乳白色",259908,"乳白色",259908,"無色から淡泊色液体",259908,"無色透明",259908,"無色もしくは淡黄色",259908,"無色透明",259908,"少し白濁",259908,"白濁色（時間経過で透明）",259908,"透明",259908,"無色透明",259908,"無色透明",259908,"無色",259908,"無色透明",259908,"無色透明",259908,"微白色液体（常温）",259908,"無色透明",259908,"／",259908,"淡黄色～褐色・ジェル状",259908,"乳白色",259908,"無色・透明",259908,"塗布後は無色透明",259908]
[null,"⑳","耐用年数",null,null,"30年ﾎﾟﾘﾏｰ劣化せず（再塗布効果あり）",null,"不明（再塗布効果あり）",null,"同種材料の追跡調査：20年（再塗布効果あり）",null,"20年（中性化の屋外暴露）",null,"不明（再塗布効果あり）",null,"紫外線劣化抵抗性試験：10～20年（再塗布効果あり）",null,"実績：20年（再塗布効果あり）",null,"不明（再塗布効果あり）",null,"不明（基本的には再塗布不可）",null,"-",null,"20年（JSCE-K571試験データより）",null,"-",null,"-",null,"推定20年",null,"標準的ライフサイクルは10～15年、平成28年度時点で実績1年",null,"-",null,"試験結果10年以上（10年経過した施工面の散水試験、耐候性試験（キセノンランプ照射+過酸化水素水噴霧40サイクル（920時間）））",null,"推定20年",null,"促進耐候性試験：10～20年（再塗布効果あり）",null,"施工実績：10年以上（再塗布効果あり）",null,"不明（再塗布効果あり）",null,"不明（再塗布効果あり）",null,"実績：20年（再塗布効果あり）",null,"日本で施工され始めて３０年以上経つが再施工が必要になった事例はない",null,"実績：10年（再塗布効果あり）",null,"実績：15年（再塗布効果あり）",null,"不明（再塗布効果あり）",null,"促進耐候性試験：15年（再塗布効果あり）",null,"JCI_2013_論文：20年（再塗布効果あり）",null,"５年保管したサンプル分析：5年（再塗布効果あり）",null,"実証実験：9年（平成30年時点で撥水性の維持を確認）",null,"-",null,"-",null,"-",null,"実績：14年",null,"実績：23年",null,"-",null,"-",null,"促進耐候性試験：10年",null,"試験結果：15年",null,"実績：21年",null,"-",null,"-",null,"-",null,"-",null,"-",null,"促進耐候性試験：20年",null,"10～15年",null,"／",null,"促進耐候試験：試験結果15年以上（耐久性が実証されたシラン系表面含浸材（アクアシール1400）がベース）",null,"-",null,"-",null,"15～20年：根拠はなし（一般的なシラン・シロキサン系表面含浸材と同等として）"]
[null,"㉑","施工実績\n（過去３年）",null,"国土交通省：活用効果調査表数","29件(九州で0件)",null,"25件(九州で3件)",null,"49件(九州で5件)",null,"50件（九州で16件）",null,"21件(九州で19件)",null,"18件(九州で2件)",null,"54件(九州で5件)",null,"33件（九州で10件）",null,"10件（九州で1件）",null,"0件（九州で0件）",null,"2件（九州で0件）",null,"1件（九州で0件）",null,"1件（九州で0件）",null,"13件（九州で1件）",null,"0件（九州で0件）",null,"1件（九州で0件）",null,"4件（九州で0件）",null,"1件（九州で0件）",null,"203件(九州で14件)",null,"172件(九州で31件)",null,"173件(九州で21件)",null,"173件(九州で21件)",null,"105件(九州で46件)",null,"33件(九州で11件)",null,"10件（九州で0件）",null,"5件(九州で0件)",null,"120件(九州で6件)",null,"138件(九州で24件)",null,"32件(九州で6件)",null,"18件(九州で2件)",null,"0件（九州で0件）",null,"2件（九州で0件）",null,"0件（九州で0件）",null,"0件（九州で0件）",null,"0件（九州で0件）",null,"0件（九州で0件）",null,"0件（九州で0件）",null,"2件（九州で0件）",null,"2件（九州で0件）",null,"1件（九州で0件）",null,"1件（九州で0件）",null,"7件（九州で0件）",null,"2件（九州で0件）",null,"2件（九州で0件）",null,"0件（九州で0件）",null,"0件（九州で0件）",null,"0件（九州で0件）",null,"0件（九州で0件）",null,"／",null,"0件（九州で0件）",null,"0件（九州で0件）",null,"0件（九州で0件）",null,"0件（九州で0件）"]
[null,null,null,null,"地方自治体：開発者ヒアリング","172件（九州で10件）",null,"126件（九州で0件）",null,"171件（九州で6件）",null,"523件（九州で108件）",null,"10件（九州で5件）",null,"9件（九州で1件）",null,"多数件（九州で多数件）",null,"279件（九州で20件）",null,"0件（九州で0件）",null,"未回答",null,"192件（九州で95件）",null,"100件以上（九州で50件以上）",null,"100件以上（九州で50件以上）",null,"83件（九州で12件）",null,"未回答",null,"9件（九州で1件）",null,"11件（九州で0件）",null,"52件（九州で6件）",null,"262件（九州で42件）",null,"130件（九州で8件）",null,"43件（九州で5件）",null,"43件（九州で5件）",null,"多数件（九州で多数件）",null,"6件（九州で1件）",null,"0件（九州で0件）",null,"6件（九州で0件）",null,"54件（九州で7件）",null,"809件（九州で262件）",null,"未回答",null,"15件（九州で5件）",null,"未回答",null,"8件（九州で1件）",null,"12件（九州で7件）",null,"12件（九州で7件）",null,"2件（九州で0件）",null,"18件（九州で1件）",null,"5件（九州で1件）",null,"40件（九州で10件）",null,"未回答",null,"273件（九州で60件）",null,"7件（九州で2件）",null,"61件（九州で2件）",null,"5件（九州で0件）",null,"18件（九州で0件）",null,"0件（九州で0件）",null,"未回答",null,"材料販売のため実績件数は不明",null,"50件（九州で15件）",null,"／",null,"126件（九州で39件）",null,"250件（九州で32件）",null,"0件（九州で0件）",null,"0件（九州で0件）"]
[null,null,null,null,"その他：開発者ヒアリング","35件（九州で1件）",null,"1486件（九州で0件）",null,"8件（九州で0件）",null,"21件（九州で3件）",null,"6件（九州で2件）",null,"193件（九州で14件）",null,"少数件（九州で少数件）",null,"8件（九州で0件）",null,"0件（九州で0件）",null,"未回答",null,"6件（九州で5件）",null,"1件（九州で0件）",null,"1件（九州で0件）",null,"57件（九州で12件）",null,"未回答",null,"22件（九州で0件）",null,"22件（九州で0件）",null,"8件（九州で1件）",null,"33件（九州で12件）",null,"246件（九州で19件）",null,"2137件（九州で275件）",null,"2137件（九州で275件）",null,"少数件（九州で少数件）",null,"168件（九州で0件）",null,"0件（九州で0件）",null,"2件（九州で0件）",null,"0件（九州で0件）",null,"237件（九州で12件）",null,"未回答",null,"4件（九州で1件）",null,"未回答",null,"20件（九州で2件）",null,"0件（九州で0件）",null,"0件（九州で0件）",null,"13件（九州で0件）",null,"317件（九州で5件）",null,"10件（九州で1件）",null,"4件（九州で0件）",null,"未回答",null,"12件（九州で0件）",null,"29件（九州で0件）",null,"806件（九州で72件）",null,"2件（九州で0件）",null,"0件（九州で0件）",null,"3件（九州で3件）",null,"未回答",null,"材料販売のため実績件数は不明",null,"3件（九州で0件）",null,"／",null,"16件（九州で0件）",null,"50件（九州で0件）",null,"20件（九州で0件）",null,"0件（九州で0件）"]
[null,"㉒","特許等",null,"特許","-",null,"第5147186号 ",null,"-",null,"-",null,"-",null,"-",null,"-",null,"第4555398号",null,"-",null,"-",null,"-",null,"-",null,"-",null,"-",null,"第5751499号「ケイ酸塩系表面含浸工法に用いる反応促進材およびコンクリート補強方法」",null,"-",null,"-",null,"-",null,"第4338908号",null,"第3806621号、第4515328号 ",null,"-",null,"-",null,"-",null,"第2694190号 ",null,"-",null,"-",null,"第4484872号",null,"-",null,"-",null,"-",null,"-",null,"-",null,"-",null,"-",null,"-",null,"特許第4532138号、特許4472266号",null,"-",null,"特許第6309140号、特許第5923697号、特許第6418635号",null,"特許第6207859号",null,"-",null,"特願2020-134110コンクリート打ち放し面の表面処理方法および打ち放しコンクリートの強度向上方法、特願2020-005821セメント系構造物の強度向上方法、特願2019-035259セメント系構造物の表面保護化粧工法",null,"-",null,"-",null,"-",null,"-",null,"第6485892号「コンクリートの表面保護工法」",null,"-",null,"-",null,"／",null,"-",null,"-",null,"実用新案登録第3245688号「セメントコンクリート構造物」",null,"-"]
[null,null,null,null,"建設技術審査証明","-",null,"-",null,"-",null,"-",null,"-",null,"-",null,"-",null,"-",null,"-",null,"-",null,"-",null,"-",null,"-",null,"-",null,"-",null,"-",null,"-",null,"-",null,"-",null,"-",null,"-",null,"-",null,"-",null,"-",null,"-",null,"-",null,"-",null,"-",null,"-",null,"-",null,"-",null,"-",null,"-",null,"-",null,"-",null,"-",null,"-",null,"-",null,"-",null,"-",null,"-",null,"-",null,"-",null,"-",null,"-",null,"-",null,"-",null,"-",null,"／",null,"-",null,"-",null,"-",null,"-"]
[null,"㉓","備考",null,null,"・消防法:危険物第4類第2石油類(非水溶性)　であり、引火性は有するので火気に注意\n-VE評価：2017/12/14～、事後評価2回目（2017/12/14）は本工法比較表には未反映。",null,"-VR評価：2017/02/15～、事後評価2回目（2017/02/15）は本工法比較表には未反映。",null,"-",null,"-",null,"-",null,"・効果発現後リコートが可能。他社撥水効果を示したコンクリートへの再塗布による含浸が可能。",null,"・退色塗料の混入による塗布確認を行う。　・製品仕様としては、プロテクトシルBH Nは新設構造物を対象とし、プロテクトシルCITは既設構造物を対象とすることが望ましい。（ヒアリング情報）",null,"-",null,"・登録後の製品改良、施工実績により歩掛等の登録内容変更予定。・JSCE-K572試験の結果は改良した製品の試験結果（2015/4提出）。\nVE評価：2016/10/13～、事後評価1回目（2016/10/13）、活用促進技術：(2016/10/13～)は本工法比較表には未反映。",null,"-",null,"施工検査の塗布及び塗布量確認は、管理 テスターによる発色反応の目視確認及び溶液のアルカリ総量の計測を行う。",null,"-",null,"-",null,"-",null,"-",null,"-",null,"-",null,"-",null,"・NETIS登録当初は『浸透性吸水防止材「マジカルリペラー」』\n・マジカルリペラーHVは、新設構造物を対象とした標準仕様(塗布量100g/㎡)と、寒冷地仕様(塗布量200g/㎡)がある。",null,"-",null,"注意事項：複数の製品仕様が1技術としてNETISに登録されているため、活用に当たっては各現場ごとの用途について事前に開発者に問合せを行うものとする。",null,"注意事項：複数の製品仕様が1技術としてNETISに登録されているため、活用に当たっては各現場ごとの用途について事前に開発者に問合せを行うものとする。",null,"・コンクリートに劣化因子が内在する場合でも内部鉄筋に保護層が形成されているので非破壊で適応可能となる。・コンクリートの電気抵抗値(吸水防止効果)を上げ、鉄筋に保護層を形成する事により、マクロセル腐食(リングアノード)を抑制する。",null,"-",null,"・ＪSCE-K572等の試験は実施していない（2015/6）。",null,"・鉄筋周囲が比較的乾燥した状態となることで、腐食の進行も抑制できる。",null,"・上記の内容は「Osmo」についての内容である。※製品名を「L-OSMO反応型（SG）」に変更（令和5年8月社名変更）\n・完了検査、効果確認検査項目として、現場吸水試験器（HK-120006-A）による透水量試験を行う。",null,"-",null,"-",null,"・JSCE-K572は同開発者の新技術にて実施予定のため本技術では実施されていない。",null,"-",null,"-",null,"・注意事項：複数の製品仕様が1技術としてNETISに登録されているため、活用に当たっては各現場ごとの用途について事前に開発者に問合せを行うものとする。",null,"・注意事項：複数の製品仕様が1技術としてNETISに登録されているため、活用に当たっては各現場ごとの用途について事前に開発者に問合せを行うものとする。",null,"塗布後の白化試験を行い、白化しにくいことを確認している（自社試験）。",null,"-",null,"-",null,"-",null,"-",null,"-",null,"-",null,"-",null,"-",null,"-",null,"-",null,"-",null,"-",null,"-",null,"／",null,"-",null,"-",null,"-",null,"-"]
["総括","㉔","コンクリートの耐久性向上の効果\n（材料の性能等）",null,null,"・中性化抑制性能は、シラン系評価基準の中性化抑制率:C（10%以下）に対して、本技術はA（88.7%）であり評価基準と比較して特に優れている（補完情報より）。\n・塩害抑制性能は、シラン系評価基準のCl-浸透抑制率:A(80%以上)に対して、本技術はA（100%）であり評価基準を満足している（補完情報より）。\n・アルカリシリカ反応抑制性能は、シラン系評価基準の透水抑制率:A（80%以上）に対して、本技術はA（95%）、吸水抑制率:A（80%以上）に対して、本技術はA（88%）であり評価基準を満足しているため、塗布面からの水分供給は抑制され、補修工法として有効（補完情報より）。",null,"・中性化抑制性能は、けい酸塩系評価基準の中性化抑制率:B（30～10%）に対して、本技術はA（38.6%）であり評価基準と比較して優れている（補完情報より）。\n・アルカリシリカ反応抑制性能は、走査型電子顕微鏡による観察でけい酸ソーダの生成が確認されなかったことから、効果が確認されている（補完情報より）。",null,"・中性化抑制性能は、シラン系評価基準の中性化抑制率:C（10%以下）に対して、本技術はA（65%）であり評価基準と比較して特に優れている（補完情報より）。\n・塩害抑制性能は、シラン系評価基準のCl-浸透抑制率:A(80%以上)に対して、本技術はA（94%）であり評価基準を満足している（補完情報より）。\n・アルカリシリカ反応抑制性能は、シラン系評価基準の透水抑制率:A（80%以上）に対して、本技術はA（88%）、吸水抑制率:A（80%以上）に対して、本技術はA（87%）であり評価基準を満足しているため、塗布面からの水分供給は抑制され、補修工法として有効（補完情報より）。\n・凍害抑制性能は、凍結融解試験（RILEM CDF スケーリング試験）で効果が確認されている（補完情報より）。",null,"・中性化抑制性能は、けい酸塩系評価基準の中性化抑制率:B(30～10%）に対して、本技術はA(68%）であり評価基準と比較して優れている（補完情報より）。\n・塩害抑制性能は、けい酸塩系評価基準のCl-浸透抑制率:C(60%以下)に対して、本技術はC(41%)であり評価基準を満足している（補完情報より）。\n・凍害抑制性能は、スケーリング試験（JSCE-K 572）で効果が確認されている（補完情報より）。",null,"・中性化抑制性能は、シラン系評価基準の中性化抑制率:C（10%以下）に対して、本技術はA（74%）であり評価基準と比較して特に優れている（補完情報より）。\n・塩害抑制性能は、シラン系評価基準のCl-浸透抑制率:A(80%以上)に対して、本技術はA（87%）であり評価基準を満足している（補完情報より）。\n・アルカリシリカ反応抑制性能は、シラン系評価基準の透水抑制率:A（80%以上）に対して、本技術はA（98%）、吸水抑制率:A（80%以上）に対して、本技術はA（94%）であり評価基準を満足しているため、塗布面からの水分供給は抑制され、補修工法として有効（補完情報より）。",null,"・中性化抑制性能は、シラン系評価基準の中性化抑制率:C（10%以下）に対して、本技術はA（100%）であり評価基準と比較して特に優れている（補完情報より）。\n・塩害抑制性能は、シラン系評価基準のCl-浸透抑制率:A(80%以上)に対して、本技術はA（100%）であり評価基準を満足している（補完情報より）。\n・アルカリシリカ反応抑制性能は、シラン系評価基準の透水抑制率:A（80%以上）に対して、本技術はA（96%）、吸水抑制率:A（80%以上）に対して、本技術はA（93%）であり評価基準を満足しているため、塗布面からの水分供給は抑制され、補修工法として有効（補完情報より）。",null,"・中性化抑制性能は、シラン系評価基準の中性化抑制率:C（10%以下）に対して、本技術はB（18%）であり評価基準と比較して優れている（補完情報より）。\n・塩害抑制性能は、シラン系評価基準のCl-浸透抑制率:A(80%以上)に対して、本技術はA（100%）であり評価基準を満足している（補完情報より）。\n・アルカリシリカ反応抑制性能は、シラン系評価基準の透水抑制率:A（80%以上）に対して、本技術はA（85%）、吸水抑制率:A（80%以上）に対して、本技術はA（92%）であり評価基準を満足しているため、塗布面からの水分供給は抑制され、補修工法として有効（補完情報より）。",null,"・中性化抑制性能は、けい酸塩系評価基準の中性化抑制率:B(30～10%）に対して、本技術はA(35%）であり評価基準と比較して優れている（補完情報より）。\n・塩害抑制性能は、けい酸塩系評価基準のCl-浸透抑制率:C(60%以下)に対して、本技術はC(24%)であり評価基準を満足している（補完情報より）。\n・凍害抑制性能は、スケーリング試験（JSCE-K 572）で効果が確認されている（補完情報より）。",null,"・中性化抑制性能は、けい酸塩系評価基準の中性化抑制率:B（30～10%）に対して、本技術はA（75%）であり評価基準と比較して優れている（補完情報より）。\n・塩害抑制性能は、けい酸塩系評価基準のCl-浸透抑制率:C(10%以下)に対して、本技術はC（43%）であり評価基準を満足している（補完情報より）。\n・凍害抑制性能は、スケーリング試験（JSCE-K 572）で効果が確認されている（補完情報より）。",null,"・［中性化抑制］：けい酸塩系評価基準の中性化抑制率:B(30～10%）に対して、本技術はB（27％）であり評価基準を満足している（補完情報より）。\n・［アルカリシリカ反応抑制］：シラン系評価基準の吸水抑制率:A（80%以上）に対して、本技術はA（87%）であり評価基準を満足しているため、塗布面からの水分供給は抑制され、補修工法として有効（補完情報より）。\n・［凍害抑制、化学的浸食抑制］：凍害抑制、化学的浸食抑制性能はスケーリングに対する抵抗性試験、化学的浸食に対する抵抗性試験（JSCE-K 572）により効果が確認されている（補完情報より）。",null,"・中性化抑制性能は、けい酸塩系評価基準の中性化抑制率:B(30～10%）に対して、本技術はA(70%）であり評価基準と比較して優れている（補完情報より）。\n・塩害抑制性能は、けい酸塩系評価基準のCl-浸透抑制率:C(60%以下)に対して、本技術はC(73%)であり評価基準と比較して優れている（補完情報より）。",null,"・［中性化抑制］けい酸塩系評価基準の中性化抑制率:B(30～10%）に対して、本技術はA(93.2%）であり評価基準と比較して優れている（補完情報より）。\n・［塩害抑制］けい酸塩系評価基準のCl-浸透抑制率:C(60%以下)に対して、本技術はC(19.3%)であり評価基準を満足している（補完情報より）。\n・［その他］けい酸塩系評価基準の透水抑制率:C(60%以下)に対して、本技術はB（72.0％）であり、また塩水の場合は69.0％である（補完情報より）。",null,"・［中性化抑制］けい酸塩系評価基準の中性化抑制率:B(30～10%）に対して、本技術はA(55.2%）であり評価基準と比較して優れている（補完情報より）。\n・［塩害抑制］けい酸塩系評価基準のCl-浸透抑制率:C(60%以下)に対して、本技術はC(35.2%)であり評価基準を満足している（補完情報より）。\n・［その他］けい酸塩系評価基準の透水抑制率:C(60%以下)に対して、本技術はA（90.5％）であり、また塩水の場合は84.4％である（補完情報より）。",null,"・［中性化抑制］けい酸塩系評価基準の中性化抑制率:B(30～10%）に対して、本技術はB（16％）であり評価基準を満足している（補完情報より）。\n・［塩害抑制］けい酸塩系評価基準のCl-浸透抑制率:C(60%以下)に対して、本技術はC（16％）であり評価基準を満足している（補完情報より）。\n・凍害抑制性能は、スケーリング試験（JSCE-K 572）で効果が確認されている（補完情報より）。",null,"・［中性化抑制］：けい酸塩系評価基準の中性化抑制率:B(30～10%）に対して、本技術は普通ポルトランドセメントでA（52.0％）、高炉セメントB種でA（50.4％）であり評価基準と比較して優れている（補完情報より）。\n・［塩害抑制］：けい酸塩系評価基準のCl-浸透抑制率:C（60%以下）に対して、本技術は普通ポルトランドセメントでC（29.4％）、高炉セメントB種でC（35.0％）であり評価基準を満足している（補完情報より）。\n・［その他］：ひび割れ透水抑制率は普通ポルトランドセメントで98.9％、高炉セメントB種で99.4％であり、止水性が確認できる（補完情報より）。",null,"・［中性化抑制］：けい酸塩系評価基準の中性化抑制率:B(30～10%）に対して、本技術はA(54.8％）であり評価基準と比較して優れている（補完情報より）。\n・［塩害抑制］：JSCE-K571による試験結果ではないが、塗布後の供試体（普通、高炉B）の塩分浸透深さ比は74％、81％（抑制率26％、19％）である（補完情報より）。\n・[化学的浸食抑制]：化学抵抗性試験（5％希硫酸）において効果が確認されている（補完情報より）。\n・［防水性］：ひび割れ透水比は塗布後2日の供試体（普通、高炉B）では52.05％、45.22％に対して、塗布後14日では1.31％、0.60％であり、ひび割れの閉塞による防水効果が確認できる（補完情報より）。",null,"・［中性化抑制］：けい酸塩系評価基準の中性化抑制率:B(30～10%）に対して、本技術はA（45％）であり評価基準と比較して優れている（補完情報より）。\n・［塩害抑制］：シラン系評価基準のCl-浸透抑制率:A（80%以上）に対して、本技術はA（100％）であり評価基準を満足している（補完情報より）。\n・[アルカリシリカ反応抑制]：シラン系評価基準の透水抑制率、給水抑制率:A（80%以上）、透湿比:B（80～60％）に対して、本技術はA（85％）、A(91％）、A(96％）であり評価基準を満足しているため、塗布面からの水分供給は抑制され、補修工法として有効（補完情報より）。\n・［凍害抑制性能］：凍結融解試験（JISA1148）で効果が確認されている（補完情報より）。",null,"・［中性化抑制］けい酸塩系評価基準の中性化抑制率:B(30～10%）に対して、本技術はB（17％）であり評価基準を満足している（補完情報より）。\n・［塩害抑制］けい酸塩系評価基準のCl-浸透抑制率:C(60%以下)に対して、本技術はC（4％）であり評価基準を満足している（補完情報より）。\n・凍害抑制性能は、スケーリング試験（JSCE-K 572）で効果が確認されている（補完情報より）。",null,"・中性化抑制性能は、シラン系評価基準の中性化抑制率:C（10%以下）に対して、本技術はA（33%）であり評価基準と比較して特に優れている（補完情報より）。\n・塩害抑制性能は、シラン系評価基準のCl-浸透抑制率:A(80%以上)に対して、本技術はA（100%）であり評価基準を満足している（補完情報より）。\n・アルカリシリカ反応抑制性能は、シラン系評価基準の透水抑制率:A（80%以上）に対して、本技術はA（95%）、吸水抑制率:A（80%以上）に対して、本技術はA（90%）であり評価基準を満足しているため、塗布面からの水分供給は抑制され、補修工法として有効（補完情報より）。\n・凍害抑制性能は、凍結融解試験（RILEM類似法）で効果が確認されている（補完情報より）。",null,"・中性化抑制性能は、けい酸塩系評価基準の中性化抑制率:B(30～10%）に対して、本技術はA(33%）であり評価基準と比較して優れている（補完情報より）。\n・塩害抑制性能は、けい酸塩系評価基準のCl-浸透抑制率:C(60%以下)に対して、本技術はC(11%)であり評価基準を満足している（補完情報より）。\n・凍害抑制性能は、スケーリング試験（JSCE-K 572）で効果が確認されている（補完情報より）。",null,"・JSCE-K572での試験結果は1回塗布（塗布量125ml/㎡）であり、けい酸ナトリウム、けい酸カリウム配合製品共通の試験結果である（補完資料より）。\n・中性化抑制性能は、けい酸塩系評価基準の中性化抑制率:B(30～10%）に対して、本技術はB(23%）であり評価基準を満足している（補完情報より）。\n・塩害抑制性能は、JSCE-K572での試験は未実施であるが、塩害用では日本建築学会基準に準拠した試験でCl-浸透抑制率は28％程度である（補完情報より）。\n・凍害抑制性能は、スケーリング試験（JSCE-K572）で効果が確認されている（補完情報より）。またCVでは凍結融解試験で300サイクルにおける質量変化抑制効果が確認されている（補完情報より）。",null,"・JSCE-K572での試験結果は1回塗布（塗布量125ml/㎡）での試験結果である（補完資料より）。\n・中性化抑制性能は、JSCE-K572の試験結果はけい酸塩系評価基準の中性化抑制率:B(30～10%）に対して、本技術はC(8%）であり評価基準を満足しないが、高炉スラグコンクリートを供試体とした促進中性化試験では、同社のけい酸ナトリウム、カリウム配合型よりも中性化速度係数は低いことが確認されている（補完情報より）。\n・塩害抑制性能は、JSCE-K572での試験は未実施であるが、高炉スラグコンクリートを供試体とした塩分浸透性試験では、同社のけい酸ナトリウム、カリウム配合型よりも塩分浸透深さは低いことが確認されている（補完情報より）。\n・凍害抑制性能は、スケーリング試験（JSCE-K572）で効果が確認されている（補完情報より）。",null,"・中性化抑制性能は、シラン系評価基準の中性化抑制率:C（10%以下）に対して、本技術はA（38%）であり評価基準と比較して特に優れている（補完情報より）。\n・塩害抑制性能は、シラン系評価基準のCl-浸透抑制率:A(80%以上)に対して、本技術はA（100%）であり評価基準を満足している（補完情報より）。\n・アルカリシリカ反応抑制性能は、シラン系評価基準の透水抑制率:A（80%以上）に対して、本技術はA（84%）、吸水抑制率:A（80%以上）に対して、本技術はA（83%）であり評価基準を満足しているため、塗布面からの水分供給は抑制され、補修工法として有効（補完情報より）。",null,"・中性化抑制性能は、JSCE-K571による試験結果ではないが、60日での無塗布の中性化深さ27.9mmに対して、本技術は21.6mm（中性化抑制率22.6％）である（補完情報より）。\n・アルカリシリカ反応抑制性能は、JSCE-K571による試験結果ではないが、0.5N/mm2,0.3N/mm2の透水圧で無塗布では透水があったのに対して、本技術では透水が無く、塗布面からの水分供給の抑制は期待できる（補完情報より）。\n・凍害抑制性能は、凍結融解試験において効果が確認されている（補完情報より）。",null,"・中性化抑制性能は、けい酸塩系評価基準の中性化抑制率:B（30～10%）に対して、本技術はA（70%）であり、評価基準と比較して優れている（補完情報より）。\n・塩害抑制性能は、けい酸塩系評価基準のCl-浸透抑制率:C(60%以下)に対して、本技術はA（80%）であり、評価基準より特に優れている（補完情報より）。\n・アルカリシリカ反応抑制性能は、シラン系評価基準の透水抑制率:A（80%以上）に対して、本技術はA（81%）、吸水抑制率:A（80%以上）に対して、本技術はA（82%）であり評価基準を満足しているため、塗布面からの水分供給は抑制され、補修工法として有効（補完情報より）。",null,"・中性化抑制性能は、シラン系評価基準の中性化抑制率:C（10%以下）に対して、本技術はB（15%）であり評価基準と比較して優れている（補完情報より）。\n・塩害抑制性能は、シラン系評価基準のCl-浸透抑制率:A(80%以上)に対して、本技術はA（100%）であり評価基準を満足している（補完情報より）。\n・アルカリシリカ反応抑制性能は、シラン系評価基準の透水抑制率:A（80%以上）に対して、本技術はA（97%）、吸水抑制率:A（80%以上）に対して、本技術はA（96%）であり評価基準を満足しているため、塗布面からの水分供給は抑制され、補修工法として有効（補完情報より）。\n・凍害抑制性能は、コンクリートの凍結融解試験法（JIS A1148）で効果が確認されている（補完情報より）。",null,"・中性化抑制性能は、けい酸塩系評価基準の中性化抑制率:B(30～10%）に対して、本技術はB(24%）であり評価基準を満足している（補完情報より）。\n・塩害抑制性能は、けい酸塩系評価基準のCl-浸透抑制率:C(60%以下)に対して、本技術はC(25%)であり評価基準を満足している（補完情報より）。\n・凍害抑制性能は、スケーリング試験（JSCE-K572）で効果が確認されている（補完情報より）。",null,"・中性化抑制性能は、シラン系評価基準の中性化抑制率:C（10%以下）に対して、本技術はA（100%）であり評価基準と比較して特に優れている（補完情報より）。\n・塩害抑制性能は、シラン系評価基準のCl-浸透抑制率:A(80%以上)に対して、本技術はA（100%）であり評価基準を満足している（補完情報より）。\n・アルカリシリカ反応抑制性能は、シラン系評価基準の透水抑制率:A（80%以上）に対して、本技術はA（89%）、吸水抑制率:A（80%以上）に対して、本技術はA（86%）であり評価基準を満足しているため、塗布面からの水分供給は抑制され、補修工法として有効（補完情報より）。\n・凍害抑制性能は、温冷繰返し試験（JIS A 6909準拠）で効果が確認されている（補完情報より）。",null,"・中性化抑制性能は、けい酸塩系評価基準の中性化抑制率:B(30～10%）に対して、本技術はA(42%）であり評価基準と比較して優れている（補完情報より）。\n・塩害抑制性能は、けい酸塩系評価基準のCl-浸透抑制率:C(60%以下)に対して、本技術はC(26%)であり評価基準を満足している（補完情報より）。\n・アルカリシリカ反応抑制効果は,シラン系評価基準の透水抑制率:A（80%以上）に対して、本技術はC（35%）、吸水抑制率:A（80%以上）に対して、本技術はC（45%）であり評価基準を満足しないが、無塗布と比較して若干の膨張率の低減が確認されている（補完情報より）。\n・凍害抑制性能は、スケーリング試験（JSCE-K 572）で効果が確認されている（補完情報より）。",null,"・中性化抑制性能は、けい酸塩系評価基準の中性化抑制率:B(30～10%）に対して、本技術はA(100%）であり評価基準と比較して優れている（補完情報より）。\n・塩害抑制性能は、けい酸塩系評価基準のCl-浸透抑制率:C(60%以下)に対して、本技術は:C(15%)であり評価基準を満足している（補完情報より）。\n・凍害抑制性能は塩水凍結融解試験（ASTM　C672法、RILEM　CDF法）で効果が確認されている（補完情報より）。",null,"・中性化抑制性能は、シラン系評価基準の中性化抑制率:C（10%以下）に対して、本技術はA（83%）であり評価基準と比較して特に優れている（補完情報より）。\n・凍害抑制性能は、凍結融解試験で効果が確認されている（補完情報より）。",null,"・中性化抑制性能は、けい酸塩系評価基準の中性化抑制率:B(30～10%）に対して、本技術はA(50%）であり評価基準と比較して優れている（補完情報より）。\n・塩害抑制性能は、けい酸塩系評価基準のCl-浸透抑制率:C(60%以下)に対して、本技術はC(21%)であり評価基準を満足している（補完情報より）。\n・凍害抑制性能は、凍結融解試験（JISA1148）で効果が確認されている（補完情報より）。",null,"・中性化抑制性能は、シラン系評価基準の中性化抑制率:C（10%以下）に対して、A（93％）であり評価基準と比較して特に優れている（補完情報より）。\n・塩害抑制性能は、シラン系評価基準のCl-浸透抑制率:A(80%以上)に対して、A（100％）であり評価基準を満足している（補完情報より）。\n・アルカリシリカ反応抑制性能は、シラン系評価基準の透水抑制率:A（80%以上）に対して、A（90％）、吸水抑制率:A（80%以上）に対して、A（91％）、透湿比Ｂ（80～60％）に対して、本技術はＡ（100％)であり、評価基準を満足しているため、塗布面からの水分供給は抑制され、補修工法として有効（補完情報より）。",null,"・中性化抑制性能は、シラン系評価基準の中性化抑制率:C（10%以下）に対して、A（96％）であり評価基準と比較して特に優れている（補完情報より）。\n・塩害抑制性能は、シラン系評価基準のCl-浸透抑制率:A(80%以上)に対して、A（100％）であり評価基準を満足している（補完情報より）。\n・アルカリシリカ反応抑制性能は、シラン系評価基準の透水抑制率:A（80%以上）に対して、A（90％）、吸水抑制率:A（80%以上）に対して、A（92％）、透湿比B（80～60％）に対して、本技術はA（82％）であり、評価基準を満足しているため、塗布面からの水分供給は抑制され、補修工法として有効（NETIS情報より）。",null,"・［塩害抑制］けい酸塩系評価基準のCl-浸透抑制率:C(60%以下)に対して、本技術はＣ（3％）である（補完情報より）。\n・凍害抑制性能は、スケーリング試験（JSCＥ-K572）で効果が確認されている（補完情報より）。",null,"・中性化抑制性能は、けい酸塩系評価基準の中性化抑制率:B(30～10%）に対して、本技術はA(73%）であり評価基準と比較して優れている（補完情報より）。\n・塩害抑制性能は、けい酸塩系評価基準のCl-浸透抑制率:C(60%以下)に対して、本技術はＡ(85%)であり評価基準と比較して特に優れている（補完情報より）。\n・アルカリシリカ反応抑制性能は、けい酸塩素評価基準の透水抑制率Ｃ（60％以下）に対して、本技術はＢ（73％）、吸水抑制率Ｃ（60％以下）に対して、本技術はＢ（62％）であり評価基準を満足しているため、塗布面からの水分供給は抑制され、補修工法として有効（補完情報より）。\n・凍害抑制は、スケーリング試験（JSCE-K572）で効果が確認されている（補完情報より）。",null,"・透水量は、けい酸塩素表面含浸材単体57.0mlに対して、本技術は53.5ml（透水比93.9％）であった（補完情報より）。\n・透水係数は、けい酸塩素表面含浸材単体1.0×10-10m/sに対して、本技術は0.65×10-6m/s（低減率65％）であった（補完情報より）。\n・吸水率は、けい酸塩素表面含浸材単体3.3％に対して、本技術は2.9％（吸水比87.9％）であった（補完情報より）。",null,"・中性化抑制性能は、けい酸塩系評価基準の中性化抑制率:B(30～10%）に対して、本技術はA(40%）であり評価基準と比較して優れている（NETIS情報より）。\n・塩害抑制性能は、けい酸塩系評価基準のCl-浸透抑制率:C(60%以下)に対して、本技術はC(31%)である（NETIS情報より）。",null,"・中性化抑制性能は、シラン系評価基準の中性化抑制率:C（10%以下）に対して、B（22％）であり評価基準と比較して優れている（補完情報より）。\n・塩害抑制性能は、シラン系評価基準のCl-浸透抑制率:A(80%以上)に対して、A（98％）であり評価基準を満足している（補完情報より）。\n・アルカリシリカ反応抑制性能は、シラン系評価基準の透水抑制率:A（80%以上）に対して、A（96％）、吸水抑制率:A（80%以上）に対して、A（91％）、透湿比Ｂ（80～60％）に対して、本技術はB（76％)であり、評価基準を満足しているため、塗布面からの水分供給は抑制され、補修工法として有効（補完情報より）。",null,"・中性化抑制性能は、シラン系評価基準の中性化抑制率:C（10%以下）に対して、A（100％）であり評価基準と比較して特に優れている（補完情報より）。\n・塩害抑制性能は、シラン系評価基準のCl-浸透抑制率:A(80%以上)に対して、A（100％）であり評価基準を満足している（補完情報より）。\n・アルカリシリカ反応抑制性能は、シラン系評価基準の透水抑制率:A（80%以上）に対して、A（84％）、吸水抑制率:A（80%以上）に対して、A（86％）、透湿比:B（80～60％）に対して、本技術はB（64％）であり、評価基準を満足しているため、塗布面からの水分供給は抑制され、補修工法として有効（補完情報より）。",null,"・中性化抑制性能は、けい酸塩系評価基準の中性化抑制率:B(30～10%）に対して、本技術はA(48%)であり評価基準と比較して優れている（補完情報より）。\n・塩害抑制性能は、けい酸塩系評価基準のCl-浸透抑制率:C(60%以下)に対して、本技術はC（22％）であり評価基準を満足している（補完情報より）。",null,"・塩害抑制性能は、けい酸塩系評価基準のCl-浸透抑制率:C(60%以下)に対して、本技術はC(50%)である（補完情報より）。\n・けい酸塩系評価基準の透水抑制率:C(60%以下)に対して、本技術はC（23％）である（補完情報より）。\n・凍害抑制性能は、スケーリング試験（JSCE-K 572）で効果が確認されている（補完情報より）。",null,"・中性化抑制性能は、けい酸塩系評価基準の中性化抑制率:B(30～10%）に対して、本技術はＡ（61.8％）である（補完情報より）。\n・塩害抑制性能は、けい酸塩系評価基準のCl-浸透抑制率:C(60%以下)に対して、本技術はＣ（45.9％）である（補完情報より）。\n・凍害抑制性能は、スケーリング試験（JSCE-K 572）で効果が確認されている（補完情報より）。",null,"・中性化抑制性能は、シラン系評価基準の中性化抑制率:C（10%以下）に対して、Ａ（82％）であり評価基準と比較して特に優れている（補完情報より）。\n・塩害抑制性能は、シラン系評価基準のCl-浸透抑制率:（80%以上）に対して、A（91%）であり、評価基準を満足している（補完情報より）。\n・アルカリシリカ反応抑制性能は、シラン系評価基準の透湿比:B（80～60%）に対して、A（87%）であり評価基準と比較して優れている。また、シラン系評価基準の透水抑制率:A（80%以上）に対してＡ（91％）、吸水抑制率:A（80%以上）に対してA（93%）であり、評価基準を満足している（補完情報より）。",null,"・けい酸塩系評価基準の透水抑制率:C(60%以下)に対して本技術はC（50％）である。\n・吸水抑制率:C(60%以下)に対して本技術はA（88％）であり、評価基準を満足している（NETIS情報より）。",null,"・中性化抑制性能は、けい酸塩系評価基準の中性化抑制率:B(30～10%）に対して、本技術はA(45%)であり評価基準と比較して優れている（NETIS情報より）。\n・凍害抑制性能は、スケーリング試験（CDF法）で効果が確認されている（NETIS情報より）。",null,"・中性化抑制性能は、シラン系評価基準の中性化抑制率:C（10%以下）に対してＡ（100％）であり、評価基準と比較して特に優れている（補完情報より）。\n・塩害抑制性能は、シラン系評価基準のCl-浸透抑制率:A（80%以上）に対してA（100%）であり、評価基準を満足している（補完情報より）。\n・アルカリシリカ反応抑制性能は、シラン系評価基準の透湿比:B（80～60%）に対してA（90%）、透水抑制率:A（80%以上）に対してＡ（85％）、吸水抑制率:A（80%以上）に対してA（85%）であり、評価基準を満足しているため、塗布面からの水分供給は抑制され、補修工法として有効である。なお、促進膨張試験は実施されていない（補完情報より）。\n・凍害抑制性能は、シラン系評価基準の透水抑制率:A（80%以上）に対してＡ（85％）、吸水抑制率:A（80%以上）に対してA（85%）、Cl-浸透抑制率:A（80%以上）に対してA（100%）、透湿比:B（80～60%）に対してA（90%）であり、評価基準を満足している。なお、スケーリング試験は実施されていない（補完情報より）。",null,"・中性化抑制性能は、シラン系評価基準の中性化抑制率:C（10%以下）に対して、A（32％）であり評価基準と比較して特に優れている（補完情報より）。\n・塩害抑制性能は、シラン系評価基準のCl-浸透抑制率:A(80%以上)に対して、A（90％）であり評価基準を満足している（補完情報より）。\n・アルカリシリカ反応抑制性能は、シラン系評価基準の透水抑制率:A（80%以上）に対して、A（96％）、吸水抑制率:A（80%以上）に対して、A（91％）、透湿比B（80～60％）に対して、本技術はA（93％）であり、評価基準を満足しているため、塗装面からの水分供給は抑制され、補修工法として有効である。なお、促進膨張試験は実施されていない（補完情報より）。",null,"／",null,"・中性化抑制性能は、シラン系評価基準の中性化抑制率:C（10%以下）に対して、A（100%）であり評価基準と比較して特に優れている（補完情報より）。\n・塩害抑制性能は、シラン系評価基準のCl-浸透抑制率:A(80%以上)に対して、A（100%）であり評価基準を満足している（補完情報より）。\n・アルカリシリカ反応抑制性能は、シラン系評価基準の透水抑制率:A（80%以上）に対して、A（90%）、吸水抑制率:A（80%以上）に対して、A（92%）、透湿比B（80～60%）に対して、本技術はA（86%）であり、評価基準を満足しているため、塗布面からの水分供給は抑制され、補修工法として有効である。なお、促進膨張試験は実施されていない（補完情報より）。\n・凍害抑制性能は、シラン系評価基準の透水抑制率:A（80%以上）に対してＡ（85％）、吸水抑制率:A（80%以上）に対してA（85%）、Cl-浸透抑制率:A（80%以上）に対してA（100%）、透湿比:B（80～60%）に対してA（90%）であり、評価基準を満足している。なお、スケーリング試験は実施されていない（補完情報より）。",null,"・中性化抑制性能は、シラン系評価基準の中性化抑制率C（10％以下）に対して、A（62％）であり評価基準と比較して特に優れている（補完情報より）。\n・塩害抑制性能は、シラン系評価基準のCl-浸透抑制率A（80％以上）に対して、A（93％）であり評価基準を満たしている（補完情報より）。\n・アルカリシリカ反応抑制性能は、シラン系評価基準の透水抑制率A（80％以上）に対してA（90％）、吸水抑制率A（80％以上）に対してA（94％）、透湿比B（80～60％）に対してA（87％）であり、評価基準と比較して優れているため、塗布面からの水分供給は抑制され、補修工法として有効である。なお、促進膨張試験は実施されていない（補完情報より）。",null,"・［化学的浸食抑制］：耐酸性、耐アルカリ性試験（JT/T695-2007に準拠）において効果が確認されている（補完情報より）。\n・［アルカリシリカ反応抑制］：吸水率試験（JTJ275-2000に準拠）において、塗布面からの水分供給が抑制されることを確認している。なお、促進膨張試験は実施されていない（補完情報より）。\n・［塩害抑制］：塩化物吸収低減効果試験（JTJ275-2000に準拠）において、効果が確認されている（補完情報より）。",null,"・中性化抑制性能は、シラン系評価基準の中性化抑制率C(10%以下）に対して、本技術はA(100%)であり、評価基準を満足している（補完情報より）。\n・塩害抑制性能は、シラン系評価基準のCl-浸透抑制率:A（80%以上）に対してA（100%）であり、評価基準を満足している（補完情報より）。\n・アルカリシリカ反応抑制性能は、シラン系評価基準の透湿比:B（80～60%）に対してA（100%）、透水抑制率:A（80%以上）に対してＡ（93％）、吸水抑制率:A（80%以上）に対してA（93%）であり、評価基準を満足している。なお、本評価においてはASR反応性に関する直接的な試験は実施していない（補完情報より）。"]
[null,"㉕","施工性\n(留意事項含む）",null,null,"・従来技術の塗布回数は1～3回であり、本技術は2回塗布である（NETIS情報、表面保護工法設計施工指針より）。\n・気温が5℃～35℃の範囲で使用すること（NETIS情報より）。\n・塗装完了後、24時間以内の気温が氷点下まで下がる場合は、防寒対策を実施すること（評価情報のコメントより）。",null,"・従来技術の塗布回数はシラン系1～3回、けい酸塩系1～2回であるが、本技術は計4回塗布である（NETIS情報、表面保護工法設計施工指針より）。\n・施工時気温(5℃～40℃)（NETIS情報）。\n・施工は、リバコン技能士の資格が必要となる（評価情報からのコメント）。",null,"・従来技術の塗布回数は1～3回であり、本技術は1回塗布である（NETIS情報、表面保護工法設計施工指針より）。\n・0℃以上で施工すること(0℃未満の場合、コンクリート中の水分が凍結していることがあり、そのときには効果を発揮できないため)（評価情報のコメントより）。\n・コンクリート表面にくぼみ等があっても、パテ埋め等は行わず、そのまま施工すること（評価情報のコメントより）。",null,"・従来技術の塗布回数は1～2回であり、本技術は1回塗布である（NETIS情報、表面保護工法設計施工指針より）。\n・5℃～30℃で施工可能（補完情報より）。\n・粒子コロイドの物理的作用と化学反応(C-S-Hゲルの生成)によりコンクリートを保護し、劣化因子(水、二酸化炭素、酸素、塩化物イオン)の侵入を抑制し、耐久性を向上させる（NETIS情報より）。",null,"・従来技術の塗布回数は1～3回であり、本技術は1回塗布である（補完情報、表面保護工法設計施工指針より）。\n・5℃～30℃で施工可能（補完情報より）。",null,"・従来技術の塗布回数は1～3回であり、本技術は1回塗布である（NETIS情報、表面保護工法設計施工指針より）。\n・0℃～40℃で施工可能（NETIS情報より）。",null,"・従来技術の塗布回数は1～3回であり、本技術は2回塗布である（NETIS情報、表面保護工法設計施工指針より）。\n・コンクリート表面温度及び外気温が5～40℃の適用温度範囲内であること（NETIS情報より）。",null,"・従来技術の塗布回数は1～2回であり、本技術は1回塗布である（NETIS情報、表面保護工法設計施工指針より）。\n・施工時に反応促進剤を混合する2液性のタイプに変えたことにより、反応性が向上し、散水養生が不要となるため、施工性が良くなり、工期の短縮が図れる（NETIS情報より）。\n・コンクリート表面温度が0℃以上にて施工すること（NETIS情報より）。",null,"・従来技術の塗布回数は1～2回であり、本技術は1回塗布である（NETIS情報、表面保護工法設計施工指針より）。\n・5℃～40℃で施工可能（補完情報より）。",null,"・従来技術の塗布回数は1～2回であり、本技術は3回塗布である（NETIS情報、表面保護工法設計施工指針より）。\n・5℃～35℃で施工可能（補完情報より）。",null,"・従来技術の塗布回数は1～2回であり、本技術は2回塗布である\n（NETIS情報、表面保護工法設計施工指針より）。\n・5℃～40℃で施工可能（NETIS情報より）。",null,"・従来技術の塗布回数は1～2回であり、本技術は2回塗布である（NETIS情報、表面保護工法設計施工指針より）。\n・0℃～35℃で施工可能（NETIS情報より）。",null,"・従来技術の塗布回数は1～2回であり、本技術は3回塗布である（NETIS情報、表面保護工法設計施工指針より）。\n・0℃～35℃で施工可能（NETIS情報より）。",null,"・従来技術の塗布回数は1～2回であり、本技術は1回塗布である（新設構造物への塗装時）（補完情報、表面保護工法設計施工指針より）。\n・5℃～30℃で施工可能（NETIS情報より）。",null,"・従来技術の塗布回数は1～2回であり、本技術は2回塗布である（NETIS情報、表面保護工法設計施工指針より）。\n・5℃～40℃で施工可能（補完情報より）。",null,"・従来技術の塗布回数は1～2回であり、本技術は2回塗布である（補完情報、表面保護工法設計施工指針より）。\n・4℃以上で施工可能（NETIS情報より）。",null,"・従来技術の塗布回数は1～2回であり、本技術は合計3回塗布である（補完情報、表面保護工法設計施工指針より）。\n・5℃～40℃で施工可能（補完情報より）。",null,"・従来技術の塗布回数は1～2回であり、本技術は2回塗布である（補完情報、表面保護工法設計施工指針より）。\n・5℃～30℃で施工可能（NETIS情報より）。",null,"・従来技術の塗布回数は1～3回であり、本技術は1回塗布である（NETIS情報、表面保護工法設計施工指針より）。\n・塗布材料をクリーム状やジェル状としたことによって、鉛直面や床版下面への施工時でも飛散や液ダレをほとんど生じないため、塗布量を容易に管理することができるようになった（NETIS情報より）。\n・外気温が0℃を下回ると材料が凍結する恐れがあり、冬季における施工には留意が必要である（評価情報のコメントより）。",null,"・従来技術の塗布回数は1～2回であり、本技術は2回塗布である（NETIS情報、表面保護工法設計施工指針より）。\n・5℃～30℃で施工可能（NETIS情報より）。",null,"・従来技術の塗布回数は1～2回であり、本技術は1～2回塗布である（NETIS情報、表面保護工法設計施工指針より）。\n　（以下はRCガーデックス全般について）\n・5℃～40℃で施工可能（NETIS情報より）。",null,"・従来技術の塗布回数は1～2回であり、本技術は1～2回塗布である（NETIS情報、表面保護工法設計施工指針より）。\n　（以下はRCガーデックス全般について）\n・5℃～40℃で施工可能（NETIS情報より）。",null,"・従来技術の塗布回数は1～3回であり、本技術は標準で3回塗布である（NETIS情報、表面保護工法設計施工指針より）。\n・5℃～40℃で施工可能（補完情報より）。\n・耐久性（鉄筋腐食の抑制効果）について、短期間では評価ができないため、長期間における効果の検証が必要である（評価情報のコメントより）。　",null,"・従来技術の塗布回数はシラン系1～3回、けい酸塩系1～2回であるが、本技術は計4回塗布である（NETIS情報、表面保護工法設計施工指針より）。\n・日平均気温が4℃以下になることが予想されるときは、寒中コンクリート施工に準じるものとする（NETIS情報）。\n・結晶生成による緻密化の開始までに概ね3ヶ月程度要するため、補助工法の併用が必要となる場合がある（NETIS情報）。\n・セメントと同じ成分組織であるため、コンクリートと同様の扱い方が必要である（評価情報からのコメント）。\n・ザイペックス・トレーナー有資格者による施工となる（評価情報からのコメント）。\n・表面の仕上がりが不均一でザラザラしており、美観を損ねるおそれがある（評価情報からのコメント）。",null,"・従来技術の塗布回数は1～2回であり、本技術は1回塗布（連続2回塗布）である（NETIS情報、表面保護工法設計施工指針より）。\n・0℃～40℃で施工可能（補完情報より）。",null,"・従来技術の塗布回数は1～3回であり、本技術は1回塗布である（NETIS情報、表面保護工法設計施工指針より）。\n・高性能シランに増粘剤を混合し高粘性ジェル状とすることにより、液ダレをなくし、養生を簡素化した（NETIS情報より）。\n・従来管理し難かった、材料使用量(塗布厚)をフィルムゲージを使用し、目視にて簡単に計測できるようにした（NETIS情報より）。\n・施工温度は5℃～30℃（NETIS情報より）。",null,"・従来技術の塗布回数は1～2回であり、本技術は2回塗布である（NETIS情報、表面保護工法設計施工指針より）。\n・5℃～40℃で施工可能（補完情報より）。",null,"・従来技術の塗布回数は1～3回であり、本技術は1回塗布である（NETIS情報、表面保護工法設計施工指針より）。\n・施工時、施工面が温度 0℃以上で乾燥していること（NETIS情報より）。\n・ジェル状のため、水平面と同様に垂直面、さらには、床版下面などの上向き面にも均質に施工でき品質向上に繋がる（NETIS情報より）。\n・施工後15年程度で再施工することで、効果の継続性が期待できるが、異常が無いか経過観察を行う必要がある（評価情報のコメントより）。",null,"・従来技術の塗布回数は1～2回であり、本技術は2回塗布である（NETIS情報、表面保護工法設計施工指針より）。\n・1℃～40℃で施工可能（補完情報より）。",null,"・従来技術の塗布回数は1～2回であり、本技術は1回塗布である（NETIS情報、表面保護工法設計施工指針より）。\n・5℃～40℃で施工可能（NETIS、補完情報より）。\n・1回塗りで、散水養生が不要のため施工性が向上し、施工時間が短縮できることにより工程の短縮が図られている（評価情報からのコメント）。",null,"・従来技術の塗布回数は1～3回であり、本技術は2回塗布である（補完情報、表面保護工法設計施工指針より）。\n・含浸材および表面塗布材の両者を併用した2層構造にできる材料に替えたことにより、高い耐水特性の必要性の有無により、含侵材のみの単層処理(1度塗り)、性質の異なる処理材を重ね塗りする2層処理(2度塗り)が選択でき、特に重要な部位の耐久性が向上し、品質の向上が図れる（NETIS情報より）。　（本工法比較表では全面で2層処理するものとしている。）\n・5～60℃で施工可能（NETIS情報より）。",null,"・従来技術の塗布回数は1～3回であり、本技術は2回塗布である（補完情報、表面保護工法設計施工指針より）。\n・施工時の気温が5℃以上である事(採暖養生下での適用可)（NETIS情報より）。",null,"・従来技術の塗布回数は1～3回であり、本技術は1回塗布である（補完情報、表面保護工法設計施工指針より）。\n・チクソ性を有する材料を使用するため、従来のシラン系含浸工法よりもダレ難く、1回で所定量が塗布できる（NETIS情報より）。\n・外気温が0 ℃を超え、35℃以下であること（NETIS情報より）。",null,"・従来技術の塗布回数は1～3回であり、本技術は1回塗布である（補完情報、表面保護工法設計施工指針より）。\n・チクソ性を有する材料を使用するため、従来のシラン系含浸工法よりもダレ難く、1回で所定量が塗布できる（NETIS情報より）。\n・外気温が0 ℃を超え、35℃以下であること（NETIS情報より）。",null,"・従来技術の塗布回数は1～2回であり、本技術は1回塗布である（NETIS情報、表面保護工法設計施工指針より）。\n・5℃～40℃で施工可能（NETIS情報より）。\n・0.2mm以上のひび割れは、別途補修が必要となる（NETIS情報より）。\n・石材、鋼製建具、ガラス面、手摺り等金属面に付着乾燥すると白く変色し、除去できないため、飛散防止対策を行う（NETIS情報より）。",null,"・従来技術の塗布回数は1～2回であり、本技術は1回塗布である（NETIS情報、表面保護工法設計施工指針より）。\n・0℃～40℃で施工可能（補完情報より）。\n・塗布前後は、必ず潤滑状態にする（NETIS情報より）。\n・コンクリート打設5日後以降に施工する（NETIS情報より）。\n・アルミ、ステンレス、ガラス等は養生をする（NETIS情報より）。",null,"・従来技術の塗布回数は1～2回であり、本技術は2回塗布である（NETIS情報、表面保護工法設計施工指針より）。\n・外部の施工で降雨・降雪時の場合は施工不可（NETIS情報より）。\n・5℃～40℃で施工可能（補完情報より）。",null,"・従来技術の塗布回数は1～2回であり、本技術は1回塗布である（NETIS情報、表面保護工法設計施工指針より）。\n・5℃～40℃で施工可能（補完情報より）。",null,"・従来技術の塗布回数はシラン系1～3回、けい酸塩系1～2回であり、本技術は1回塗布である（NETIS情報、表面保護工法設計施工指針より）。\n・-20℃～60℃で施工可能（NETIS情報より）。",null,"・従来技術の塗布回数は1～3回であり、本技術は3～4回塗布である（補完情報、表面保護工法設計施工指針より）。\n・0℃～40℃で施工可能（NETIS情報より）。\n・プロコンガードプライマーを塗布した後、12時間以上の養生時間をおいてプロコンガードSを塗布する（NETIS情報より）。",null,"・従来技術の塗布回数は1～2回であり、本技術は2回塗布である（補完情報、表面保護工法設計施工指針より）。\n・5℃～35℃で施工可能（補完情報より）。",null,"・従来技術の塗布回数は1～2回であり、本技術は1回塗布である（補完情報、表面保護工法設計施工指針より）。\n・5℃～40℃で施工可能（補完情報より）。\n・単一配合であったけい酸ナトリウム系表面含浸材の配合を主成分はそのままとし、複数の添加剤と組み合わせた配合の材料に変えた事により散水及び2回目塗布工程を省略して施工ができる（NETIS情報より）。",null,"・従来技術の塗布回数は1～2回であり、本技術は標準1回塗布であるが、天井面垂直面施工時は薬剤の液垂れ防止のため2回に分けて散布する（補完情報、表面保護工法設計施工指針より）。\n・0℃～35℃で施工可能（NETIS情報より）。",null,"・従来技術の塗布回数は1～3回であり、本技術は1回塗布である。また、2時間以内に降雨の影響を受けた場合は再塗布が必要である（NETIS情報、補完情報、表面保護工法設計施工指針より）。\n・-40℃～40℃で施工可能（NETIS情報より）",null,"・従来技術の塗布回数は1～2回であり、本技術は2回塗布である（補完情報、表面保護工法設計施工指針より）。\n・5℃～40℃で施工可能（NETIS情報より）。",null,"・従来技術の塗布回数は1～2回に対し、本技術は、けい酸塩系表面含浸材を塗布した表面被覆材にコンクリート面を張付け、湿潤養生後に表面被覆材を撤去する（NETIS情報、表面保護工法設計施工指針より）。\n・外気温5℃以上で施工可能（NETIS情報より）。\n・本工法は、表面被覆材の張り付けに際し、施工面の平坦性の確保が必要となる。下地処理の方法(サンダーケレン等)や断面補修の要否については、現場条件により、適宜検討すること（補完情報・WGからのコメント）。",null,"・従来技術の塗布回数は1～3回であり、本技術は2回塗布（含浸材1回、親水化剤1回）である（NETIS情報、補完情報、表面保護工法設計施工指針より）。\n・5℃～40℃以内で施工可能（NETIS情報より）\n・ひび割れや空隙がある場合（0.2㎜以上）、塗布前にセメント系充填剤による補修が必要（NETIS情報より）。\n・シラン・シロキサン系含浸材を塗布した後、24時間以上の乾燥養生を行って、親水化剤を塗布する（NETIS情報より）。",null,"・従来技術の塗布回数は1～3回であり、本技術は1回塗布である（NETIS情報、補完情報、表面保護工法設計施工指針より）。\n・0℃～35℃で施工可能（補完情報より）。",null,"補完調査、WGでの検討は未実施",null,"・従来技術の塗布回数は1～3回であり、本技術は1回塗布である（NETIS情報、補完情報、表面保護工法設計施工指針より）。\n・0℃以上～60℃以下（コンクリート表面温度）で施工可能（補完情報より）。\n・既に塩化物イオンが浸透した既設構造物に対しても適用可能である（内在塩分3.5㎏/㎡のコンクリート供試体での促進試験で実証（腐食発生限界2.0㎏/㎡））（補完情報より）。",null,"・従来技術の塗布回数はシラン系1～3回、けい酸塩系1～2回であり、本技術は1回塗布である（NETIS情報、表面保護工法設計施工指針より）。\n・5℃～40℃で施工可能（NETIS情報より）。",null,"・従来技術の塗布回数は1～2回であり、本技術は1回塗布である（補完情報、表面保護工法設計施工指針より）。\n・5℃以上で施工可能であるが、原液を水で希釈して使用するため、氷点下、激しい高温及び超乾燥状態が重なる条件での施工を避ける（補完情報より）。",null,"・従来技術の塗布回数は1～3回であり、本技術は1回塗布である（補完情報、表面保護工法設計施工指針より）。"]
[null,"㉖","その他（留意事項含む）",null,null,"・九州地方での活用実績はない（補完情報より）。\n・有機溶剤を使用しないことで、VCO(揮発性有機化合物)の発生を抑制できた（評価情報のコメントより）。\n・硬化反応時に微量のアルコールを生成するため、換気の良い場所で取り扱うこと（評価情報のコメントより）。\n・消防法:危険物第4類第2石油類（引火点が21℃以上70℃未満）(非水溶性)であり、引火性は有するので火気に注意（NETIS情報より）。",null,"・本技術はその他の系の表面含浸材（触媒性化合物）であるが、JSCE-K571（シラン系、けい酸塩系）での試験が実施されている。",null,"・シラン系評価基準の透湿比:B（80～60%）に対して、本技術はC（60%）であり、評価基準よりも低いことに注意（補完情報より）。\n・本技術のJSCE-K571の試験結果は自社試験によるものである。\n・本技術の凍結融解試験の試験結果は公的機関によるものであるが証明書等は提出されていない。",null,"\n・NETISではアルカリシリカ反応抑制に効果があると記載されているが、潜伏期で他工法との併用が条件であり、試験結果もシラン系基準の透水抑制率、吸水抑制率の評価基準を満足しておらず、採用に当たっては過去の実証結果、開発者の意見等を勘案して要検討（補完情報より）。\n・本比較表ではJSCE-K572（けい酸塩系）の試験結果に対して、JSCE-K571（シラン系、けい酸塩系）での試験結果に対する性能グレードで評価している。\n・本技術の試験結果は、公的機関によるものであるが証明書等は提出されていない。",null,"・本技術のJSCE-K571の試験結果は自社試験によるものである。",null,"・効果発現後リコートが可能。他社撥水効果を示したコンクリートへの再塗布による含浸が可能（補完情報より）。\n・NETISでは凍害抑制に効果があると記載されているが、凍害に関する試験結果がないため、採用に当たっては過去の実証結果、開発者の意見等を勘案して要検討。",null,"・NETISでは凍害抑制に効果があると記載されているが、凍害に関する試験結果がないため、採用に当たっては過去の実証結果、開発者の意見等を勘案して要検討。",null,"・本比較表ではJSCE-K572（けい酸塩系）の試験結果に対して、JSCE-K571（シラン系、けい酸塩系）での試験結果に対する性能グレードで評価している。\n・本技術のJSCE-K572の試験結果は自社試験の結果である。",null,"・本比較表ではJSCE-K572（けい酸塩系）の試験結果に対して、JSCE-K571（シラン系、けい酸塩系）での試験結果に対する性能グレードで評価している。\n・本技術の試験結果は、公的機関によるものであるが証明書等は提出されていない。",null,"・シラン系評価基準の透水抑制率:A（80%以上）に対して、本技術はB（62%）であり評価基準を満足しないことに注意（補完情報より）。\n・シラン系評価基準のCl-浸透抑制率:A（80%以上）に対して、本技術はB（62％）であり評価基準を満足しないことに注意（補完情報より）。\n・本比較表では透湿比を除いてJSCE-K572（けい酸塩系）の試験結果に対して、JSCE-K571（シラン系、その他の系）での試験結果に対する性能グレードで評価している（補完情報より）。",null,"・九州地方（国土交通省）での活用実績はない（評価情報より）。\n・毛細孔、ひび割れなどの空隙を無機コロイド粒子によって、充填することで緻密化となる。また、還元反応により、鉄筋の腐食抑制が期待できる（NETIS情報より）。\n・0.2mm以下の新たなひび割れを自己修復する（NETIS情報より）。\n・本技術のJSCE-K572の試験結果のうち、中性化抑制率とCl-浸透抑制率に対する試験は、自社試験によるものである。",null,"・九州地方（国土交通省）での活用実績はない（評価情報より）。\n・水や海水（雨水、飛沫等）の影響が大きい施工現場ではカルシウム補助剤「カルサプリ」を併用する（透水抑制率90.5％、Cl-浸透抑制率C35.2％）（補完情報より）。\n・本技術の試験結果は、公的機関によるものであるが、証明書等は出されていない（補完情報より）。",null,"・九州地方（国土交通省）での活用実績はない（評価情報より）。\n・水や海水（雨水、飛沫等）の影響が小さい施工現場、或いは中性化抑制を目的とする場合は「リアクトライズ」単独施工とする（中性化抑制率93.2％）（補完情報より）。\n・本技術の試験結果は、公的機関によるものであるが、証明書等は提出されていない（補完情報より）。",null,"・本技術は、新設構造物に塗布することで更なる品質向上、耐久性向上、長寿命化を目的としたものである（補完情報より）。\n・既設構造物を対象とする場合は、「2液混合型けい酸塩系表面含浸材CS-21ビルダー（CG-170009-A）」、または「コンクリート改質剤CS-21（NETIS掲載期間終了技術）」を用いること（補完情報より）。",null,"・九州地方（国土交通省）での活用実績はない（評価情報より）。",null,"・ザイペックス・液体タイプ(XLP) 塗布・吹付工法は、ザイペックス協会員による材工での責任施工としている。\n・本技術はその他の系の表面含浸材であるが、中性化抑制率はJSCE-K571での試験が実施されている（補完情報より）。\n・化学抵抗性試験（5％希硫酸）は自社試験によるものである（補完情報より）。",null,"・九州地方（国土交通省）での活用実績はない（評価情報より）。\n・本技術の試験結果は、Sクリートアップ、Sクリートガードそれぞれ単独での試験結果である（補完情報より）。\n・塗布する順番を逆にすると、上記の試験結果の効果が得られないので留意すること（WGからのコメント）。",null,"・九州地方（国土交通省）での活用実績はない（評価情報より）。\n・本技術は、経年劣化した既設コンクリート構造物の表面保護に最適な、2液混合型の反応系けい酸塩系表面含浸材である（補完情報より）。\n・新設構造物を対象とする場合は、「けい酸塩系表面含浸材CS-21ネオ（CG-160013-A）」、または「コンクリート改質剤CS-21（NETIS掲載期間終了技術）」を用いること（補完情報より）。\n・標準配合における主剤、助剤の混合比は、重量比5：1であるが、荷姿は主剤が5kg/缶、助剤が4kg/缶であるため、配合割合に留意すること（WGからのコメント）。",null,"\n\n・本技術の凍結融解試験の試験結果は自社試験によるものである。",null,"・水和反応活性成分の添加により、コンクリートの材齢を問わず効果を発揮する（NETIS情報）。\n・本比較表ではJSCE-K572（けい酸塩系）の試験結果に対して、JSCE-K571（シラン系、けい酸塩系）での試験結果に対する性能グレードで評価している。",null,"・本技術の塩化物イオン浸透深さ試験、凍結融解試験の試験結果は自社試験の結果である。\n　（以下はRCガーデックス全般について）\n・従来のコロイド状けい酸ナトリウムと比べてナノサイズと小さく、浸透速度、浸透深さ、反応速度等が改善されるため、品質・出来形の向上が図られている（評価情報のコメント）。\n・本技術は複数の製品仕様があり、製品仕様により適用条件、適用範囲が異なる為、採用に当たっては施工条件、過去の実証結果、開発者の意見等勘案して要検討（NETIS情報より）。",null,"・本技術の高炉スラグコンクリートでの物質透過性能の試験結果は自社試験の結果である。\n　（以下はRCガーデックス全般について）\n・従来のコロイド状けい酸ナトリウムと比べてナノサイズと小さく、浸透速度、浸透深さ、反応速度等が改善されるため、品質・出来形の向上が図られている（評価情報のコメント）。\n・本技術は複数の製品仕様があり、製品仕様により適用条件、適用範囲が異なる為、採用に当たっては施工条件、過去の実証結果、開発者の意見等勘案して要検討（NETIS情報より）。",null,"\n・コンクリートに劣化因子が内在する場合でも内部鉄筋に保護層が形成されているので非破壊で適応可能となる（NETIS情報より）。\n・コンクリートの電気抵抗値(吸水防止効果)を上げ、鉄筋に保護層を形成する事により、マクロセル腐食(リングアノード)を抑制する（NETIS情報より）。\n・火気厳禁（評価情報のコメントより）。\n・本技術の鋼材腐食試験の試験結果は自社試験によるものである。",null,"・NETISでは塩害抑制に効果があると記載されているが、シラン系評価基準のCl-浸透抑制率:A(80%以上)に対して、本技術はC（36%）であるため、採用に当たっては過去の実証結果、開発者の意見等を勘案して要検討（補完情報より）。\n・新設・既設コンクリートの表層(約300mm)の毛細管空隙やひび割れ(0.3mm程度まで他工法を併用することなく)にコンクリートの結晶を増殖させて緻密化し改質する（NETIS情報）。\n・本技術はその他の系の表面含浸材（触媒性化合物）であるが、Cl-浸透抑制率のみJSCE-K571での試験が実施されている。\n・本技術の自己修復性能の検証は、公的機関によるものであるが証明書等は提出されていない。",null,"・九州地方での活用実績はない（補完情報より）。\n・本技術はけい酸塩系表面含浸材であるが、JSCE-K572（けい酸塩系）ではなく、JSCE-K571（シラン系、けい酸塩系）での試験が実施されている。\n・本技術のJSCE-K571の試験結果は自社試験によるものである。\n・NETISでは凍害抑制に効果があると記載されているが、凍害に関する試験結果がないため、採用に当たっては過去の実証結果、開発者の意見等を勘案して要検討。",null,"・九州地方での活用実績はない（補完情報より）。\n・鉄筋周囲が比較的乾燥した状態となることで、腐食の進行も抑制できる（補完情報より）。\n・本技術の凍結融解試験の試験結果は公的機関によるものであるが証明等は提出されていない。",null,"・本技術のJSCE-K572の試験結果は自社試験の結果である。",null,"・シール材が均一に含浸するように塗布面の清掃を行い、0.3mm以上のクラックやジャンカ等は、施工前に補修しておく必要がある（評価情報のコメントより）。\n・材料の保管は直射日光をさけて密閉状態で行い、一度開封した物は使い切るか廃棄処分をする。引火性があるので火気に気をつける必要がある（評価情報のコメントより）。\n・ジェル状のため飛散しにくく、溶剤の大気放出がないため、環境面での評価向上につながった（評価情報のコメントより）。\n・本技術の温冷繰返し試験の試験結果は自社試験によるものである（補完情報より）。",null,"・本比較表ではJSCE-K572（けい酸塩系）の試験結果に対して、JSCE-K571（シラン系、けい酸塩系）での試験結果に対する性能グレードで評価している。\n・本技術のJSCE-K572の試験結果は、公的機関によるものであるが証明書等は提出されていない。",null,"・本技術はけい酸塩系表面含浸材であるが、JSCE-K572（けい酸塩系）ではなく、JSCE-K571（シラン系、けい酸塩系）での試験が実施されている。\n・本技術のJSCE-K571等の試験結果は自社試験によるものである。",null,"・九州地方での活用実績はない（補完情報より）。\n・NETISでは塩害抑制、ASR抑制に効果があると記載されているが、シラン系評価基準のCl-浸透抑制率:A（80%以上）、吸水抑制率:A（80%以上）に対して、本技術はCl-浸透抑制率:B（73%）、吸水抑制率:B（78%）であり評価基準を満足しないことに注意（補完情報より）。\n・第2液（シロキサン系表面塗布材）は、主剤と触媒を4対1で混ぜ合わせて使用するが、劣化が早いので、必要量のみ混合して使用し、混合液が少なくなったら、直ちに新しい液剤を混合し使用すること（NETIS情報より）。\n・本技術のJSCE-K571の試験結果は自社試験（共同開発者（ものつくり大学）における試験）の結果である。",null,"・九州地方での活用実績はない（補完情報より）。\n・水性材料であり、揮発性有機溶剤が含まれないため安全性の向上が図れる（NETIS情報より）。\n・本技術のJSCE-K572の試験結果は自社試験の結果である。",null,"・九州地方での活用実績はない（補完情報より）。\n・NETISでは凍害抑制に効果があると記載されているが、塗布後の供試体での凍結融解試験等は実施されていないため、採用に当たっては過去の実証結果、開発者の意見等を勘案して要検討（補完情報より）。\n・トルエン、キシレン等の成分を含まない低臭溶剤を使用している（NETIS情報より）。\n・低臭溶剤ではあるが、危険物第四類第二石油類に該当するので、周囲での火気の使用は避けること（NETIS情報より）。\n・本技術のJSCE-K571の試験結果は、公的機関によるものであるが証明書等は提出されていない。",null,"・九州地方での活用実績はない（補完情報より）。\n・NETISでは凍害抑制に効果があると記載されているが、塗布後の供試体での凍結融解試験等は実施されていないため、採用に当たっては過去の実証結果、開発者の意見等を勘案して要検討（補完情報より）。\n・溶剤を含有する製品が使用出来ない現場向けの、非溶剤タイプである（NETIS情報より）。\n・非溶剤ではあるが、危険物第四類第三石油類に該当するので、周囲での火気の使用は避けること（NETIS情報より）。\n・本技術のJSCE-K571の試験結果は、公的機関によるものであるが証明書等は提出されていない。",null,"・九州地方での活用実績はない（補完情報より）。\n・散水洗浄が不要なので、含浸材の流出がない。但し、歩行者の出入りがある箇所等において、ぬめりが残る場合は、散水洗浄が必要となるため、洗浄水の回収が必要（補完情報より）。\n・白化試験を実施し、白化しにくいことを確認している（補完情報より）。\n・NETISでは、中性化抑制に効果があると記載されているが、けい酸塩素評価基準の中性化抑制率Ｂ（30～10％）に対して、本技術はＣ（8％）であるため、採用にあたっては、過去の実証結果、開発者の意見等を勘案して要検討（WGからのコメント）。",null,"・九州地方（国土交通省）での活用実績はない（評価情報より）。\n・本工法は均質なナノレベルのけい酸塩粒子に変えたことにより含浸性が高まり、従来のけい酸塩系表面含浸材より保護層が厚くなった。一般的にけい酸塩系はアルカリシリカ反応抑制の効果はないとされているが、開発者による性能試験結果により効果が示されている（補完情報より）。\n・コンクリート表面を形成する保護層の長寿命化により、コンクリート構造物の長寿命化が実現（NETIS情報より）。\n・コンクリートの表層部を目視し異常があれば、すぐに補修する(1年点検、10年点検実施)（NETIS情報より）。\n・大きなひび割れがある場合、エバープロロング材を使用して、微細セメント等を充填して補修する（NETIS情報より）。\n・本技術の試験結果は、公的機関によるものであるが、証明書等は提出されていない（補完情報より）。",null,"・九州地方（国土交通省）での活用実績はない（補完情報より）。\n・本技術はプラスCaのみでは効果が得られないため、必ずけい酸塩系表面含浸材と併用すること（補完情報より）。\n・補完情報では、中性化抑制、塩害抑制及び凍害抑制効果があるとされているが、表面含浸材に関する試験結果（JSCE-K572)がないため、採用にあたっては、過去の実証結果、開発者の意見等を勘案して要検討（WGからのコメント）。\n・透水量試験、透水係数試験、給水試験及び摩耗試験の試験結果は、けい酸塩系表面含浸材（RCガードCE　TYPE-Li）と併用した場合である（補完情報より）。",null,"・九州地方での活用実績はない（補完情報より）。\n・ひび割れ幅が0.2mm以上のコンクリートは、他の工法との併用等を検討する（NETIS情報より）。\n・海水に触れる場所には適用できない（NETIS情報より）。",null,"・気温が60℃以下であってもコンクリートの表面温度が60℃を超える場合があるので表面温度にも注意（NETIS情報より）。\n・表面の見かけの撥水効果は比較的早期に無くなるが、劣化因子に対する保護効果は長期に持続するためすぐに再塗布を行う必要はない（NETIS情報より）。\n・再塗布の際には、旧撥水層の除去は行わずに再塗布することが出来る（NETIS情報より）。\n・本技術の促進耐候性試験の試験結果は公的機関によるものであるが証明書等は提出されていない（補完情報より）。",null,"・九州地方（国土交通省）での活用実績はない（評価情報より）。\n・鉄筋かぶりが深い場合（50mm以上）は、鉄筋に十分な亜硝酸イオンが到達しない可能性があるため留意すること（補完情報より）。\n・本技術のJSCE-K571の試験結果は民間企業への委託によるものである。",null,"・九州地方（国土交通省）での活用実績はない（評価情報より）。\n・本技術のJSCE-K572の試験結果は民間企業への委託によるものである。\n・開発者は、シラン系評価基準の透水抑制率C:（60%以下）に対して、本技術はA:（82%）であることより、アルカリシリカ反応抑制の効果があるとしているが、採用にあたっては過去の結果、開発者の意見等を勘案して要検討（WGからのコメント）。",null,"・九州地方での活用実績はない（補完情報より）。\n・開発会社は中性化抑制に効果があるとしているが、中性化抑制性能はけい酸塩系評価基準の中性化抑制率:B(30～10%）に対して、本技術はC(8%）であり、採用にあたっては過去の結果、開発者の意見等を勘案して要検討（WGからのコメント）。\n・本比較表ではJSCE-K572（けい酸塩系）の試験結果に対して、JSCE-K571（シラン系、けい酸塩系）での試験結果に対する性能グレードで評価している。\n・本技術のJSCE-K 572の試験結果は、公的機関によるものである。\n・Cl-浸透に対する抵抗性試験試験結果は公的機関によるものであるが証明書等は提出されていない。",null,"・九州地方（国土交通省）での活用実績はない（補完情報より）。\n・本技術のJSCE-K 572の試験結果は、公的機関によるものである。\n・撥水効果を付与した表面含浸材であり、開発者はアルカリシリカ反応抑制があるとしているが、コンクリート表面からの透水抑制のみでは抑制できないため、採用にあたっては過去の結果、開発者の意見等を勘案して要検討（WGからのコメント）。",null,"・九州地方（国土交通省）での活用実績はない（補完情報より）。\n・本技術のJSCE-K 571の試験結果は、公的機関によるものである。",null,"・九州地方（国土交通省）での活用実績はない（補完情報より）。\n・コンクリート内部の空隙をなくすことにより、中性化抑制、塩害抑制があるとしているが、性能評価に関する試験は、提出されていないため、採用にあたっては、過去の結果、開発者の意見等を勘案して要検討（WGからのコメント）。\n・本比較表ではJSCE-K572（けい酸塩系）の試験結果に対して、JSCE-K571（シラン系、けい酸塩系）での試験結果に対する性能グレードで評価している。\n・本技術のJSCE-K 572の試験結果は、公的機関によるものである。",null,"・九州地方（国土交通省）での活用実績はない（補完情報より）。\n・表面含浸材の浸透時間後(3日間)、表面被覆材を撤去し、産業廃棄物処理を行う必要がある（NETIS情報より）。\n・コンクリート内に浸透した表面含浸材が効果を発揮する張付け後28日経過した時点に、効果を確認するため表層透気試験を施工スパン毎に行い、透気係数改善率=10%以上を合格とする（NETIS情報より）。\n・本技術のJSCE-K572の試験結果は民間企業への委託によるものである。\n・開発会社は、塩害抑制に効果があるとしているが、塩害に関する試験結果がないため、採用にあたっては、過去の実証結果、開発者の意見等を勘案して要検討。\n・性能試験結果は、本工法の施工方法と同様に表面被覆材（シール）を用いた方法（塗布方向：上向き）で塗布した試験体によるものである（補完情報より）。",null,"・九州地方（国土交通省）での活用実績はない（評価情報より）。\n・本技術のJSCE-K571の試験結果は自社試験によるものである。",null,"・九州地方（国土交通省）での活用実績はない（評価情報より）。\n・本技術のJSCE-K571の試験結果は、公的機関によるものである。また、その他の試験結果は民間委託によるものである。\n・有機溶剤を含まない無溶剤型の材料であり、VOC（揮発性有機化合物）の発生を抑制できる（NETIS情報より）。",null,"／",null,"・九州地方（国土交通省）での活用実績はない（評価情報より）。\n・本技術のJSCE-K571の試験結果は民間企業への委託によるものである。\n・鉄筋腐食抑制成分がかぶり深さまで浸透して十分に効果が発揮されるには日数を要する(40～48mm位置で180日)(WGからのコメント)。",null,"・九州地方（国土交通省）での活用実績はない（評価情報より）。\n・本技術の試験結果は自社試験によるものである。",null,"・九州地方での活用実績はない（補完情報より）\n・本技術は海外メーカー（中華人民共和国）の製品であり、国内での施工実績はない。なお、中国全域においては100箇所以上の高速道路、橋梁、空港などで実績がある（補完情報より）。\n・⑪その他の試験は、中華人民共和国の国家認定機関により評価されているため、採用にあたっては開発者の意見等を勘案して要検討（WGからのコメント）。",null,"・九州地方（国土交通省）での活用実績はない（評価情報より）。\n・本技術のJSCE-K571の試験結果は公的機関によるものである。\n・現場打ちコンクリートに比べ、基準強度が高く、水セメント比が小さいコンクリート2次製品に対しても効果的であることを確認（自社実験より）。"]
[]
[]
[null,null,"施工費用\n注1）","施工費等",null,{"$f":"G32","v":259908},null,{"$f":"I32","v":140666},null,{"$f":"K32","v":266000},null,{"$f":"M32","v":277100},null,{"$f":"O32","v":229100},null,{"$f":"Q32","v":338200},null,{"$f":"S32","v":433100},null,{"$f":"U32","v":266000},null,{"$f":"W32","v":308759},null,{"$f":"Y32","v":"未回答"},null,{"$f":"AA32","v":180700},null,{"$f":"AC32","v":233733},null,{"$f":"AE32","v":265967},null,{"$f":"AG32","v":94000},null,{"$f":"AI32","v":"未回答"},null,{"$f":"AK32","v":186870.66666666666},null,{"$f":"AM32","v":263160},null,{"$f":"AO32","v":386000},null,{"$f":"AQ32","v":288100},null,{"$f":"AS32","v":388000},null,{"$f":"AU32","v":410780},null,{"$f":"AW32","v":410780},null,{"$f":"AY32","v":587000},null,{"$f":"BA32","v":239374},null,{"$f":"BC32","v":266400},null,{"$f":"BE32","v":232765},null,{"$f":"BG32","v":315100},null,{"$f":"BI32","v":326000},null,{"$f":"BK32","v":"未回答"},null,{"$f":"BM32","v":266400},null,{"$f":"BO32","v":"未回答"},null,{"$f":"BQ32","v":266400},null,{"$f":"BS32","v":236336},null,{"$f":"BU32","v":236336},null,{"$f":"BW32","v":165000},null,{"$f":"BY32","v":198600},null,{"$f":"CA32","v":266400},null,{"$f":"CC32","v":267200},null,{"$f":"CE32","v":263300},null,{"$f":"CG32","v":519000},null,{"$f":"CI32","v":340000},null,{"$f":"CK32","v":215200},null,{"$f":"CM32","v":238683},null,{"$f":"CO32","v":210900},null,{"$f":"CQ32","v":266400},null,{"$f":"CS32","v":"未回答"},null,{"$f":"CU32","v":108360},null,{"$f":"CW32","v":253240},null,{"$f":"CY32","v":"／"},null,{"$f":"DA32","v":326000},null,{"$f":"DC32","v":100000},null,{"$f":"DE32","v":200000},null,{"$f":"DG32","v":266400}]
[null,null,null,"表面含浸材材料費",null,{"$f":"G33","v":264000},null,374533,null,170000,null,268400,null,193100,null,212800,null,178500,null,110000,null,130900,null,"未回答",null,319200,null,186667,null,280000,null,126000,null,"未回答",null,231000,null,216840,null,264000,null,175000,null,252000,null,161700,null,161700,null,661500,null,347382,null,79000,null,393335,null,200000,null,188100,null,"未回答",null,202500,null,"未回答",null,328400,null,157080,null,192133,null,225000,null,247600,null,452040,null,198000,null,144000,null,425700,null,220000,null,215600,null,210667,null,304200,null,100000,null,"未回答",null,212630,null,165000,null,"／",null,255000,null,165000,null,120000,null,153500]
[null,null,null,"合計",null,523908,null,{"$f":"I34","v":515199},null,436000,null,545500,null,422200,null,551000,null,611600,null,376000,null,439659,null,"未回答",null,499900,null,420400,null,545967,null,220000,null,"未回答",null,417870.66666666663,null,480000,null,650000,null,463100,null,640000,null,572480,null,572480,null,1248500,null,586756,null,345400,null,626100,null,515100,null,514100,null,"未回答",null,468900,null,"未回答",null,594800,null,393416,null,428469,null,390000,null,446200,null,718440,null,465200,null,407300,null,944700,null,560000,null,430800,null,449350,null,515100,null,366400,null,"未回答",null,320990,null,418240,null,"／",null,581000,null,265000,null,320000,null,419900]
[null,null,"施工日数","合計（塗布完了後の養生時間は含まない）",null,2,null,1.17,null,1.8699999999999999,null,1.71,null,1.8699999999999999,null,1,null,2.1799999999999997,null,1.8699999999999999,null,1.8699999999999999,null,"未回答",null,2.0499999999999998,null,1.51,null,1.85,null,0.87,null,"未回答",null,1.34,null,3,null,2.4699999999999998,null,1.89,null,2.4699999999999998,null,2.1799999999999997,null,2.1799999999999997,null,2.5099999999999998,null,1.6800000000000002,null,2.1799999999999997,null,2,null,1.51,null,1.74,null,"未回答",null,1.51,null,"未回答",null,1.1000000000000001,null,1.67,null,1.67,null,0.66,null,1,null,1.1000000000000001,null,2.1799999999999997,null,1.5,null,4.2,null,3,null,1.51,null,1.68,null,1.51,null,1.8699999999999999,null,"未回答",null,3,null,1.8699999999999999,null,"／",null,1.74,null,0.68,null,1,null,1.93]
[null,null,null,"内訳","下地処理",1,null,0.17,null,1.18,null,1.38,null,1.18,null,0.5,null,1.18,null,1.18,null,1.18,null,"-",null,1.38,null,1.18,null,1.18,null,0.5,null,"-",null,0.34,null,"-",null,1,null,1.18,null,1,null,1.18,null,1.18,null,1.18,null,0.34,null,1.18,null,1.36,null,1.18,null,1.18,null,"-",null,1.18,null,"-",null,1,null,1,null,1,null,0.33,null,"-",null,1,null,1.18,null,1,null,2.2000000000000002,null,1,null,1.18,null,1.18,null,1.18,null,1.18,null,"-",null,1,null,1.18,null,"／",null,1.18,null,0.34,null,"-",null,{"$f":"DG36","v":1.18}]
[null,null,null,null,"含浸材塗布",1,null,1,null,0.69,null,0.33,null,0.69,null,0.5,null,1,null,0.69,null,0.69,null,"-",null,0.67,null,0.33,null,0.67,null,0.37,null,"-",null,1,null,"-",null,1.47,null,0.71,null,1.47,null,1,null,1,null,1.33,null,1.34,null,1,null,0.64,null,0.33,null,0.56000000000000005,null,"-",null,0.33,null,"-",null,0.1,null,0.67,null,0.67,null,0.33,null,"-",null,0.1,null,1,null,0.5,null,2,null,2,null,0.33,null,0.5,null,0.33,null,0.69,null,"-",null,2,null,0.69,null,"／",null,0.56000000000000005,null,0.34,null,"-",null,0.78]
[null,null,"施工工程",null,null,"下地処理・乾燥→含浸材塗布→乾燥養生（2時間）→含浸材塗布→乾燥養生（24時間）",null,"下地処理・指触乾燥→塗布[4回]→指触乾燥",null,"下地処理・乾燥→含浸材塗布→乾燥養生（48時間）",null,"下地処理・散水→含浸剤塗布→湿潤養生（1.5時間）",null,"下地処理・乾燥→含浸材塗布→乾燥養生（6時間）",null,"下地処理・乾燥→含浸材塗布→乾燥養生（24時間）",null,"下地処理・乾燥→含浸材塗布→指触乾燥→含浸材塗布→乾燥養生（4時間）",null,"下地処理→2液の混合攪拌→含浸剤塗布→乾燥養生（24時間）",null,"下地処理→含浸材塗布（2回）→乾燥養生（12時間）",null,"下地処理→A液塗布→養生→B液塗布（2回）→養生",null,"下地処理→塗布面乾燥→含浸剤塗布→浸透散水→含浸剤塗布→浸透散水→養生",null,"下地処理→含浸材塗布（2回）→養生",null,"下地処理→補助剤塗布→養生→含浸材塗布（2回）→養生",null,"下地処理→含浸材塗布（1回）→養生",null,"下地処理→FS-#50塗布→乾燥養生→FS-#55塗布→散水養生",null,"下地処理→含浸材塗布→表面乾燥→含浸材塗布→養生",null,"下地処理→Sクリートアップ塗布（1回）→養生→Sクリートガード塗布（2回）→養生",null,"下地処理→含浸材塗布（2回）→養生",null,"下地処理・乾燥→含浸剤塗布→乾燥養生（24時間）",null,"下地処理・散水→含浸剤塗布→表面乾燥→散水→含浸剤塗布→表面乾燥→湿潤養生",null,"下地処理・散水→含浸剤塗布→湿潤養生（0.5～1時間）→含浸剤塗布→湿潤養生（0.5～1時間）",null,"下地処理・散水→含浸剤塗布→湿潤養生（0.5～1時間）→含浸剤塗布→湿潤養生（0.5～1時間）",null,"下地処理・乾燥→含浸材塗布（3回程度、間隔20分）→乾燥養生（4時間）",null,"下地処理・散水→ 補助剤塗布→主剤塗付→表乾→主剤塗付→補助剤塗布→気乾後、3日間湿潤養生",null,"下地処理・乾燥→含浸材塗布→乾燥養生（24時間）",null,"下地処理・乾燥→含浸材塗布→乾燥養生（24時間）",null,"下地処理・散水→含浸剤塗布→湿潤養生（30分）→含浸剤塗布→湿潤養生（30分～45分）",null,"下地処理・乾燥→含浸材塗布→乾燥養生（24時間）",null,"下地処理→含浸剤塗布→湿潤養生（自然乾燥)→含浸剤塗布→湿潤養生（1～2時間）",null,"下地処理→含浸材塗布（2回塗布の場合、塗布間隔30分）→18時間乾燥",null,"下地処理→含浸材塗布（1回）→表面乾燥→表面塗布材塗布（1回）→乾燥養生",null,"下地処理・散水→含浸剤塗布→湿潤養生（30～40分）→含浸剤塗布→湿潤養生（30～45分）",null,"下地処理→含浸材塗布（1回）→乾燥養生",null,"下地処理→含浸材塗布（1回）→乾燥養生",null,"下地処理→含浸材塗布（1回）→養生",null,"下地処理→含浸材塗布（1回）→養生",null,"下地処理→プラスCa、含浸材塗布（2回）→養生",null,"下地処理→含浸材塗布（1回）→養生",null,"注）開発者の回答は、「下地処理工、表面含浸材塗布工」の合計である。",null,"下地処理→プライマー塗布（2回～3回）→含浸材塗布（1回）→養生",null,"下地処理→清掃→含浸材塗布（2回）→養生",null,"下地処理→含浸材塗布（1回）",null,"下地処理→含浸材塗布（1回）",null,"下地処理→養生→含浸材塗布（1回）→乾燥養生（2時間）",null,"下地処理→含浸材塗布（2回）→乾燥養生",null,"事前散水→表面被覆材の張付け→養生（含浸材浸透）→表面被覆材の撤去",null,"下地処理→清掃・洗浄→養生→含浸材塗布→養生(24時間)→親水化剤塗布→養生（24時間）",null,"下地処理→乾燥→含侵材塗布（1回）→乾燥養生（8時間以上）",null,"／",null,"素地調整→含浸材塗布（1回）→養生（24時間以上）",null,"下地処理→含浸材塗布→乾燥養生（24時間）",null,"下地処理→含浸材塗布→養生",null,"下地処理→乾燥→含浸材塗布（1回）→養生（8時間以上）"]
[null,null,"塗布回数",null,null,"2回",null,"4回（浸透促進剤1回、主剤2回、結晶促進剤1回）",null,"1回",null,"1回",null,"1回",null,"1回",null,"２回",null,"1回（2液は塗布前に混合する）",null,"1回",null,"3回",null,"2回",null,"2回",null,"3回",null,"1回",null,"2回",null,"2回",null,"Sクリートアップ1回、Sクリートガード2回",null,"2回",null,"1回",null,"2回",null,"2回（養生用は1回）",null,"2回（新設構造物の場合1回）",null,"3回（状況によって2～6回）",null,"4回（主剤2回、補助剤2回）",null,"1回（反応性が速いため連続2回塗り）",null,"1回",null,"2回",null,"1回",null,"2回",null,"1回（垂直面、天井面は2回塗布）",null,"2回（含浸材1回、表面塗布材1回）",null,"連続2回",null,"1回",null,"1回",null,"1回",null,"1回",null,"2回",null,"1回",null,"1回目",null,"3回～4回",null,"2回",null,"1回",null,"1回",null,"1回",null,"2回",null,"1回",null,"2回（含浸材1回、親水化剤1回）",null,"1回",null,"／",null,"１回",null,"1回",null,"１回",null,"１回"]
[null,null,"塗布量",null,null,{"$f":"G40","v":"0.15kg/㎡"},null,{"$f":"I40","v":"主剤150ｃｃ/㎡（密度1.00ｇ/cm3）"},null,{"$f":"K40","v":"0.20kg/㎡"},null,{"$f":"M40","v":"0.22kg/㎡"},null,{"$f":"O40","v":"0.13kg/㎡（既設）  (0.10kg/㎡（新設）)"},null,{"$f":"Q40","v":"0.19kg/㎡"},null,{"$f":"S40","v":"0.3L/㎡（0.2～0.3L/㎡）　（密度0.88ｇ/cm3)"},null,{"$f":"U40","v":"0.25kg/㎡（2液混合　A液：B液＝100：46）"},null,{"$f":"W40","v":"0.20kg/㎡"},null,{"$f":"Y40","v":"A液：0.25kg/㎡、B液：0.2L/㎡"},null,{"$f":"AA40","v":"0.25kg/㎡"},null,{"$f":"AC40","v":"0.3kg/㎡"},null,{"$f":"AE40","v":"リアクトライズ：0.3kg/㎡、カルサプリ：0.133kg/㎡"},null,{"$f":"AG40","v":"0.2kg/㎡"},null,{"$f":"AI40","v":"FS-#50：0.25kg/㎡、FS-#55：0.25kg/㎡"},null,{"$f":"AK40","v":"0.2kg/㎡（2回合計）"},null,{"$f":"AM40","v":"0.35kg/㎡"},null,{"$f":"AO40","v":"0.3kg/㎡"},null,{"$f":"AQ40","v":"0.20kg/㎡"},null,{"$f":"AS40","v":"0.30kg/㎡（1回塗りの場合0.20kg/㎡）"},null,{"$f":"AU40","v":"0.25L/㎡（現場で2倍希釈したもの、養生用は0.15L/㎡、ただし防水用・塩害用には希釈済製品がある）"},null,{"$f":"AW40","v":"0.25L/㎡（現場で2倍希釈したもの、1回塗布は0.15L/㎡）"},null,{"$f":"AY40","v":"0.6L/㎡（密度0.88ｇ/cm3)"},null,{"$f":"BA40","v":"主剤1.2kg/㎡（2回合計）"},null,{"$f":"BC40","v":"0.30L/㎡　(密度1.05ｇ/cm3)"},null,{"$f":"BE40","v":"0.50kg/㎡"},null,{"$f":"BG40","v":"0.20kg/㎡"},null,{"$f":"BI40","v":"0.20kg/㎡（標準）（厳しい条件の場合0.35kg/㎡（1回塗布））"},null,{"$f":"BK40","v":"0.24kg/㎡"},null,{"$f":"BM40","v":"0.30kg/㎡（基準処理量0.25～0.30kg/㎡）"},null,{"$f":"BO40","v":"含浸材0.275kg/㎡、表面塗布材0.275kg/㎡（ロス率10％を含む）"},null,{"$f":"BQ40","v":"0.2kg/㎡"},null,{"$f":"BS40","v":"0.214kg/㎡（ロス率7％含む）"},null,{"$f":"BU40","v":"0.214kg/㎡（ロス率7％含む）"},null,{"$f":"BW40","v":"0.223kg/㎡"},null,{"$f":"BY40","v":"0.150kg/㎡"},null,{"$f":"CA40","v":"（プラスCa）0.200kg/㎡+（けい酸塩系含浸材）0.200kg/㎡"},null,{"$f":"CC40","v":"0.20～0.35kg/m2"},null,{"$f":"CE40","v":"0.2kg/m2"},null,{"$f":"CG40","v":"0.300kg/㎡"},null,{"$f":"CI40","v":"0.2kg/㎡"},null,{"$f":"CK40","v":"0.2ｋg/㎡"},null,{"$f":"CM40","v":"0.25kg/㎡（0.2～0.3㎏/㎡）"},null,{"$f":"CO40","v":"0.21㎏/㎡"},null,{"$f":"CQ40","v":"0.20kg/㎡"},null,{"$f":"CS40","v":"0.14kg/㎡"},null,{"$f":"CU40","v":"0.2kg/㎡"},null,{"$f":"CW40","v":"0.22kg/m2(施工時のロス率10％含む）"},null,{"$f":"CY40","v":"／"},null,{"$f":"DA40","v":"0.23kg/㎡（ロス10％含む）"},null,{"$f":"DC40","v":"0.1kg/㎡（ロス10％含む）"},null,{"$f":"DE40","v":"標準塗布量が0.4kg/㎡(ロス量込み)"},null,{"$f":"DG40","v":"0.18kg/m2（加えて5%程度のロス率を要考慮）"}]
[null,null,"比較式",null,null,{"$f":"G41","v":"（523,908-452,049）/452,049=15.9%"},null,"（515,199-323,919）/323,919=59.1%",null,"（436,000-452,049）/452,049=-3.6%",null,"（545,500-432,547）/432,547=26.1%",null,"（422,200-452,049）/452,049=-6.6%",null,"（551,000-452,049）/452,049=21.9%",null,"（611,600-452,049）/452,049=35.3%",null,"（376,000-432,547）/432,547=-13.1%",null,"（439,659-432,547）/432,547=1.6%",null,"-",null,"（499,900-432,547）/432,547=15.6%",null,"（420,400-432,547）/432,547=-2.8%",null,"（545,967-432,547）/432,547=26.2%",null,"（220,000-432,547）/432,547=-49.1%",null,"-",null,"（417,871-323,919）/323,919=29.0%",null,"（480,000-323,919）/323,919=48.2%",null,"（650,000-432,547）/432,547=50.3%",null,"（463,100-452,049）/452,049=2.4%",null,"（640,000-432,547）/432,547=48.0%",null,"（572,480-432,547）/432,547=32.4%",null,"（572,480-432,547）/432,547=32.4%",null,"（1,248,500-452,049）/452,049=176.2%",null,"（586,756-323,919）/323,919=81.1%",null,"（345,400-432,547）/432,547=-20.1%",null,"（626,100-452,049）/452,049=38.5%",null,"（515,100-432,547）/432,547=19.1%",null,"（514,100-452,049）/452,049=13.7%",null,"-",null,"（468,900-432,547）/432,547=8.4%",null,"-",null,"（594,800-432,547）/432,547=37.5%",null,"（393,416-452,049）/452,049=-13.0%",null,"（428,469-452,049）/452,049=-5.2%",null,"（390,000-432,547）/432,547=-9.8%",null,"（446,200-432,547）/432,547=3.2%",null,"（718,440-432,547）/432,547=66.1%",null,"（465,200-432,547）/432,547=7.5%",null,"（407,300-323,919）/323,919=25.7%",null,"（944,700-452,049）/452,049=109.0%",null,"（560,000-432,547）/432,547=29.5%",null,"（430,800-432,547）/432,547=-0.4%",null,"（449,350-432,547）/432,547=3.9%",null,"（515,100-452,049）/452,049=13.9%",null,"（366,400-432,547）/432,547=-15.3%",null,"-",null,"（320,990-452,049）/452,049=-29.0%",null,"（418,240-452,049）/452,049=-7.5%",null,"／",null,"（581,000-452,049）/452,049=28.5%",null,"（265,000-323,919）/323,919=-18.2%",null,"（320,000-323,919）/323,919=-1.2%",null,"（419,900-452,049）/452,049=-7.1%"]
[null,null,"比較式",null,null,"（2.000-1.870）/1.870=7.0%",null,{"$f":"I42","v":"（1.170-1.870）/1.870=-37.4%"},null,"（1.870-1.870）/1.870=0.0%",null,"（1.710-1.870）/1.870=-8.6%",null,"（1.870-1.870）/1.870=0.0%",null,"（1.000-1.870）/1.870=-46.5%",null,"（2.180-1.870）/1.870=16.6%",null,"（1.870-1.870）/1.870=0.0%",null,"（1.870-1.870）/1.870=0.0%",null,"-",null,"（2.050-1.870）/1.870=9.6%",null,"（1.510-1.870）/1.870=-19.3%",null,"（1.850-1.870）/1.870=-1.1%",null,"（0.870-1.870）/1.870=-53.5%",null,"-",null,"（1.340-1.870）/1.870=-28.3%",null,"（3.000-1.870）/1.870=60.4%",null,"（2.470-1.870）/1.870=32.1%",null,"（1.890-1.870）/1.870=1.1%",null,"（2.470-1.870）/1.870=32.1%",null,"（2.180-1.870）/1.870=16.6%",null,"（2.180-1.870）/1.870=16.6%",null,"（2.510-1.870）/1.870=34.2%",null,"（1.680-1.870）/1.870=-10.2%",null,"（2.180-1.870）/1.870=16.6%",null,"（2.000-1.870）/1.870=7.0%",null,"（1.510-1.870）/1.870=-19.3%",null,"（1.740-1.870）/1.870=-7.0%",null,"-",null,"（1.510-1.870）/1.870=-19.3%",null,"-",null,"（1.100-1.870）/1.870=-41.2%",null,"（1.670-1.870）/1.870=-10.7%",null,"（1.670-1.870）/1.870=-10.7%",null,"（0.660-1.870）/1.870=-64.7%",null,"（1.000-1.870）/1.870=-46.5%",null,"（1.100-1.870）/1.870=-41.2%",null,"（2.180-1.870）/1.870=16.6%",null,"（1.500-1.870）/1.870=-19.8%",null,"（4.200-1.870）/1.870=124.6%",null,"（3.000-1.870）/1.870=60.4%",null,"（1.510-1.870）/1.870=-19.3%",null,"（1.680-1.870）/1.870=-10.2%",null,"（1.510-1.870）/1.870=-19.3%",null,"（1.870-1.870）/1.870=0.0%",null,"-",null,"（3.000-1.870）/1.870=60.4%",null,"（1.870-1.870）/1.870=0.0%",null,"／",null,"（1.740-1.870）/1.870=-7.0%",null,"（0.680-1.870）/1.870=-63.6%",null,"（1.000-1.870）/1.870=-46.5%",null,"（1.930-1.870）/1.870=3.2%"]
[null,null,"品質・出来形",null,null,{"$f":"LEFT(F43,1)","v":"-"},null,{"$f":"LEFT(H43,1)","v":"-"},null,{"$f":"LEFT(J43,1)","v":"-"},null,{"$f":"LEFT(L43,1)","v":"-"},null,{"$f":"LEFT(N43,1)","v":"-"},null,{"$f":"LEFT(P43,1)","v":"-"},null,{"$f":"LEFT(R43,1)","v":"-"},null,{"$f":"LEFT(T43,1)","v":"-"},null,{"$f":"LEFT(V43,1)","v":"-"},null,{"$f":"LEFT(X43,1)","v":"-"},null,{"$f":"LEFT(Z43,1)","v":"-"},null,{"$f":"LEFT(AB43,1)","v":"-"},null,{"$f":"LEFT(AD43,1)","v":"-"},null,{"$f":"LEFT(AF43,1)","v":"-"},null,{"$f":"LEFT(AH43,1)","v":"-"},null,{"$f":"LEFT(AJ43,1)","v":"-"},null,{"$f":"LEFT(AL43,1)","v":"-"},null,{"$f":"LEFT(AN43,1)","v":"-"},null,{"$f":"LEFT(AP43,1)","v":"-"},null,{"$f":"LEFT(AR43,1)","v":"-"},null,{"$f":"LEFT(AT43,1)","v":"-"},null,{"$f":"LEFT(AV43,1)","v":"-"},null,{"$f":"LEFT(AX43,1)","v":"-"},null,{"$f":"LEFT(AZ43,1)","v":"-"},null,{"$f":"LEFT(BB43,1)","v":"-"},null,{"$f":"LEFT(BD43,1)","v":"-"},null,{"$f":"LEFT(BF43,1)","v":"-"},null,{"$f":"LEFT(BH43,1)","v":"-"},null,{"$f":"LEFT(BJ43,1)","v":"-"},null,{"$f":"LEFT(BL43,1)","v":"-"},null,{"$f":"LEFT(BN43,1)","v":"-"},null,{"$f":"LEFT(BP43,1)","v":"-"},null,{"$f":"LEFT(BR43,1)","v":"-"},null,{"$f":"LEFT(BT43,1)","v":"-"},null,{"$f":"LEFT(BV43,1)","v":"-"},null,{"$f":"LEFT(BX43,1)","v":"-"},null,{"$f":"LEFT(BZ43,1)","v":"-"},null,{"$f":"LEFT(CB43,1)","v":"-"},null,{"$f":"LEFT(CD43,1)","v":"-"},null,{"$f":"LEFT(CF43,1)","v":"-"},null,{"$f":"LEFT(CH43,1)","v":"-"},null,{"$f":"LEFT(CJ43,1)","v":"-"},null,{"$f":"LEFT(CL43,1)","v":"-"},null,{"$f":"LEFT(CN43,1)","v":"-"},null,{"$f":"LEFT(CP43,1)","v":"-"},null,{"$f":"LEFT(CR43,1)","v":"-"},null,{"$f":"LEFT(CT43,1)","v":"-"},null,{"$f":"LEFT(CV43,1)","v":"/"},null,{"$f":"LEFT(CX43,1)","v":"／"},null,{"$f":"LEFT(CZ43,1)","v":"/"},null,{"$f":"LEFT(DB43,1)","v":"/"},null,{"$f":"LEFT(DD43,1)","v":"/"},null,{"$f":"LEFT(DF43,1)","v":"/"}]
[null,null,"安全性",null,null,{"$f":"LEFT(F44,1)","v":"△"},null,"△",null,"△",null,"△",null,"△",null,"△",null,"△",null,"△",null,"△",null,"△",null,"△",null,"△",null,"△",null,"△",null,"△",null,"△",null,"△",null,"△",null,"△",null,"△",null,"△",null,"△",null,"△",null,"△",null,"△",null,"△",null,"△",null,"△",null,"△",null,"△",null,"△",null,"△",null,"△",null,"△",null,"△",null,"△",null,"△",null,"△",null,"△",null,"△",null,"△",null,"△",null,"△",null,"△",null,"△",null,"△",null,"△",null,"△",null,"／",null,"△",null,"△",null,"△",null,"△"]
[null,null,"施工性",null,null,"△",null,{"$f":"LEFT(H45,1)","v":"-"},null,"○",null,"○",null,"○",null,"○",null,"△",null,"○",null,"○",null,"△",null,"△",null,"△",null,"△",null,"○",null,"△",null,"△",null,"-",null,"△",null,"○",null,"△",null,"△",null,"△",null,"△",null,"-",null,"○",null,"○",null,"△",null,"○",null,"△",null,"○",null,"△",null,"△",null,"○",null,"○",null,"○",null,"○",null,"△",null,"○",null,"○",null,"△",null,"△",null,"○",null,"○",null,"○",null,"△",null,"△",null,"△",null,"○",null,"／",null,"○",null,"○",null,"○",null,"○"]
[null,null,"環境",null,null,"△",null,"△",null,"△",null,"△",null,"△",null,"△",null,"△",null,"△",null,"△",null,"△",null,"△",null,"△",null,"△",null,"△",null,"△",null,"△",null,"△",null,"△",null,"△",null,"△",null,"△",null,"△",null,"△",null,"△",null,"△",null,"△",null,"△",null,"△",null,"△",null,"△",null,"△",null,"△",null,"△",null,"△",null,"△",null,"△",null,"△",null,"△",null,"△",null,"△",null,"△",null,"△",null,"△",null,"△",null,"△",null,"-",null,"△",null,"△",null,"／",null,"△",null,"△",null,"△",null,"△"]
[null,null,"試験項目",null,null,{"$f":"G47","v":"JSCE-K571（公的機関）"},null,{"$f":"I47","v":"JSCE-K571（公的機関）"},null,{"$f":"K47","v":"JSCE-K571（自社試験）"},null,{"$f":"M47","v":"JSCE-K572（公的機関）"},null,{"$f":"O47","v":"JSCE-K571（自社試験）"},null,{"$f":"Q47","v":"JSCE-K571（公的機関）"},null,{"$f":"S47","v":"JSCE-K571（公的機関）"},null,{"$f":"U47","v":"JSCE-K572（自社試験）"},null,{"$f":"W47","v":"JSCE-K572（公的機関）"},null,{"$f":"Y47","v":"JSCE-K572（公的機関）"},null,{"$f":"AA47","v":"JSCE-K572（公的機関・自社試験）"},null,{"$f":"AC47","v":"JSCE-K571（公的機関）"},null,{"$f":"AE47","v":"JSCE-K571（公的機関）"},null,{"$f":"AG47","v":"JSCE-K572（公的機関）"},null,{"$f":"AI47","v":"JSCE-K572（公的機関）"},null,{"$f":"AK47","v":"JSCE-K571（公的機関）"},null,{"$f":"AM47","v":"JSCE-K571、572（公的機関）"},null,{"$f":"AO47","v":"JSCE-K572（公的機関）"},null,{"$f":"AQ47","v":"JSCE-K571（公的機関）"},null,{"$f":"AS47","v":"JSCE-K572（公的機関）"},null,{"$f":"AU47","v":"JSCE-K572（公的試験）（けい酸ナトリウム、けい酸カリウム配合製品の試験結果（1回塗布））"},null,{"$f":"AW47","v":"JSCE-K572（公的試験）（けい酸ナトリウム配合製品の試験結果（1回塗布））"},null,{"$f":"AY47","v":"JSCE-K571（公的機関）"},null,{"$f":"BA47","v":"JSCE-K571他（公的機関）"},null,{"$f":"BC47","v":"JSCE-K571（自社試験）"},null,{"$f":"BE47","v":"JSCE-K571（公的機関）"},null,{"$f":"BG47","v":"JSCE-K572（自社試験）"},null,{"$f":"BI47","v":"JSCE-K571（公的機関）"},null,{"$f":"BK47","v":"JSCE-K572（公的機関）"},null,{"$f":"BM47","v":"JSCE-K571（自社試験）"},null,{"$f":"BO47","v":"JSCE-K571（自社試験） （含浸材+表面塗布材）"},null,{"$f":"BQ47","v":"JSCE-K572（自社試験）"},null,{"$f":"BS47","v":"JSCE-K571（公的機関）"},null,{"$f":"BU47","v":"JSCE-K571（公的機関）"},null,{"$f":"BW47","v":"JSCE-K572（公的機関）"},null,{"$f":"BY47","v":"JSCE-K572（公的機関）"},null,{"$f":"CA47","v":"-"},null,{"$f":"CC47","v":"JSCE-K572（公的機関）"},null,{"$f":"CE47","v":"JSCE-K571（公的機関）"},null,{"$f":"CG47","v":"JSCE-K 571（民間委託）"},null,{"$f":"CI47","v":"JSCE-K 572（民間委託）"},null,{"$f":"CK47","v":"JSCE-K 572（公的機関）"},null,{"$f":"CM47","v":"JSCE-K 572（公的機関）"},null,{"$f":"CO47","v":"JSCE-K 571（公的機関）"},null,{"$f":"CQ47","v":"JSCE-K 572（公的機関）"},null,{"$f":"CS47","v":"JSCE-K 572（民間委託）"},null,{"$f":"CU47","v":"JSCE-K 571（自社試験）"},null,{"$f":"CW47","v":"JSCE-K 571（公的機関）"},null,{"$f":"CY47","v":"JSCE-K571（公的機関）"},null,{"$f":"DA47","v":"JSCE-K 571（民間委託）"},null,{"$f":"DC47","v":"JSCE-K 571/JSCE-K 572（自社試験）"},null,{"$f":"DE47","v":"-"},null,{"$f":"DG47","v":"JSCE-K 571（公的機関）"}]
[null,null,"含浸深さ（ｍｍ）",null,null,{"$f":"G48","v":"0.96mm"},null,"-",null,"2.2mm",null,"-",null,"2.3mm",null,"4.4mm",null,"6.1mm",null,"0～2mm",null,"3.2mm",null,"-",null,"3.2mm",null,"-",null,"-",null,"4.2mm",null,"-",null,"-",null,"Sクリートガード（JSCE-K571）：1.1mm",null,"4.4mm",null,"4.1mm",null,"1.8mm",null,"1.3mm ",null,"1.6mm",null,"7.6mm",null,"-",null,"3.04mm",null,"8.4mm",null,"6mm",null,"7.2mm",null,"4～6mm",null,"　-　(参考：実構造物でのリチウム浸透深さ50mm）",null,"3.8㎜",null,"15mm",null,"4.8mm",null,"4.2mm",null,"2.6mm",null,"4.0mm",null,"-",null,"-",null,"6.5mm",null,"16.2mm",null,"3～5mm",null,"1.6mm",null,"4mm",null,"1.7mm",null,"3.1mm",null,"-",null,"4.4mm",null,"5.5mm",null,"／",null,"6.0mm",null,"3.7mm/10.5mm",null,"-",null,"5.7mm"]
[null,null,"中性化抑制率（％）",null,null,"Ａ（88.7％）",null,{"$f":"I49","v":"A(38.6％)"},null,"Ａ（65％）",null,"A（68％）",null,"Ａ（74％）",null,"Ａ（100％）",null,"B（18％）",null,"A（35％）",null,"A（56％）",null,"B（27％）",null,"A（70％）",null,"A（93.2％）",null,"A（55.2％）",null,"B（16％）",null,"普通ポルトランドセメント：A（52.0％）、高炉セメントB種：A（50.4％）",null,"A(54.8％）",null,"Sクリートガード（JSCE-K571）：A（45％）",null,"B（17％）",null,"Ａ（33％）",null,"A（33％）",null,"B（23％）",null,"C（8％）",null,"Ａ（38％）",null,"-",null,"A（70％）",null,"B（15％）",null,"B（24％）",null,"Ａ（100％）",null,"A（42％）",null,"A（100%）",null,"A（83％）",null,"A（50％）",null,"A（93％）",null,"A（96％）",null,"C（8％）",null,"Ａ（73％）",null,"-",null,"Ａ（40％）",null,"Ｂ（22％）",null,"Ａ（100％）",null,"Ａ（48％）",null,"C（8％）",null,"Ａ（61.8％）",null,"Ａ（82％）",null,"-",null,"Ａ（45％）",null,"Ａ（100％）",null,"A（32％）",null,"／",null,"A（100％）",null,"A（62%）/A（62%）",null,"-",null,"A（100％）"]
[null,null,"Cl-浸透抑制率（％）",null,null,"Ａ（100％）",null,"C（13％）",null,"Ａ（94％）",null,"C（41％）",null,"Ａ（87％）",null,"Ａ（100％）",null,"Ａ（100％）",null,"C（24％）",null,"C（43％）",null,"B（62％）",null,"Ｂ（73％）",null,"C（19.3％）",null,"C（35.2％）",null,"C（16％）",null,"普通ポルトランドセメント：C（29.4％）、高炉セメントB種：C（35.0％）",null,"-",null,"Sクリートガード（JSCE-K571）：A（100％）",null,"C（4％）",null,"Ａ（100％）",null,"C（11％）",null,"未実施",null,"未実施",null,"Ａ（100％）",null,"C(36％)",null,"A（80％）",null,"Ａ（100％）",null,"C（25％）",null,"Ａ（100％）",null,"C（26％）",null,"C(15%)",null,"B（73％）",null,"C（21％）",null,"A（100％）",null,"A（100％）",null,"C（3％）",null,"Ａ（85％）",null,"-",null,"C（31％）",null,"Ａ（98％）",null,"Ａ（100％）",null,"Ｃ（22％）",null,"C（50％）",null,"Ｃ（45.9％）",null,"Ａ（91％）",null,"-",null,"-",null,"Ａ（100％）",null,"A（90％）",null,"／",null,"A（100％）",null,"A（93%）/A（93%）",null,"-",null,"A（100％）"]
[null,null,"透水抑制率（％）",null,null,"Ａ（95％）",null,"B(77％)",null,"Ａ（88％）",null,"C（46％）",null,"Ａ（98％）",null,"Ａ（96％）",null,"Ａ（85％）",null,"C（55％）",null,"B（67％）",null,"B（62％）",null,"Ａ（80％）",null,"B（72.0％）",null,"A（90.5％）",null,"-",null,"-",null,"-",null,"Sクリー卜アップ（JSCE-K572）：C（29％）、Sクリートガード（JSCE-K571）：A（85％）",null,"-",null,"Ａ（95％）",null,"C（39％）",null,"C（20％）",null,"C（23％）",null,"Ａ（84％）",null,"-",null,"A（81％）",null,"Ａ（97％）",null,"B（62％）",null,"Ａ（89％）",null,"C（35％）",null,"C(65%)",null,"A(90％）",null,"C（39％）",null,"A（90％）",null,"A（90％）",null,"C（12％）",null,"Ｂ（73％）",null,"-",null,"B（67％）",null,"Ａ（96％）",null,"Ａ（84％）",null,"Ａ（82％）",null,"C（23％）",null,"B（75.4％）",null,"Ａ（91％）",null,"Ｃ（50%）",null,"Ｂ（68％）",null,"Ａ（85％）",null,"A（96％）",null,"／",null,"A（90％）",null,"A（90%）/A（90%）",null,"-",null,"A（93％）"]
[null,null,"吸水抑制率（％）",null,null,"Ａ（88％）",null,"-",null,"Ａ（87％）",null,"C（75％）",null,"Ａ（94％）",null,"Ａ（93％）",null,"Ａ（92％）",null,"C（10％）",null,"C（55％）",null,"A（87％）",null,"Ａ（81％）",null,"-",null,"-",null,"C（34％）",null,"-",null,"-",null,"Sクリー卜アップ（JSCE-K572）：C（0％）、Sクリートガード（JSCE-K571）：A（91％）",null,"C（24％）",null,"Ａ（90％）",null,"C（22％）",null,"C（14％）",null,"C（14％）",null,"Ａ（83％）",null,"-",null,"A（82％）",null,"Ａ（96％）",null,"C（18％）",null,"Ａ（86％）",null,"C（45％）",null,"C(30%)",null,"B（78％）",null,"C（52％）",null,"A（91％）",null,"A（92％）",null,"C（15％）",null,"Ｂ（62％）",null,"-",null,"C（45％）",null,"Ａ（91％）",null,"Ａ（86％）",null,"Ｂ（60％）",null,"C（14％）",null,"Ｃ（17.8％）",null,"Ａ（93％）",null,"Ａ（88%）",null,"-",null,"Ａ（85％）",null,"A（91％）",null,"／",null,"A（92％）",null,"A（94%）/A（94%）",null,"-",null,"A（93％）"]
[null,null,"透湿比（％）",null,null,"Ａ（95％）",null,"-",null,"Ｃ（60％）",null,"-",null,"Ａ（92％）",null,"Ａ（100％）",null,"Ａ（92％）",null,"-",null,"-",null,"A（95％）（JSCE-K571）",null,"-",null,"-",null,"-",null,"-",null,"-",null,"-",null,"Sクリー卜アップ（JSCE-K571）：A（106％）、Sクリートガード（JSCE-K571）：A（96％）",null,"-",null,"Ａ（86％）",null,"-",null,"-",null,"-",null,"A（92％）",null,"-",null,"A（85％）",null,"Ａ（82％）",null,"-",null,"Ａ（110％）",null,"-",null,"A（100%）",null,"-",null,"-",null,"A（100％）",null,"A（82％）",null,"-",null,"-",null,"-",null,"-",null,"Ｂ（76％）",null,"Ｂ（64％）",null,"-",null,"-",null,"-",null,"Ａ（87％）",null,"-",null,"-",null,"Ａ（90％）",null,"A（93％）",null,"／",null,"A（86％）",null,"A（87%）/-",null,"-",null,"A（100％）"]

{"sheet":"仕様の整理","index":5,"n_rows":56,"n_cols":39,"rows_kept":56,"cut":false,"hidden":false,"merged":[[0,21,0,24],[1,9,2,9],[1,20,2,20],[1,13,2,13],[1,12,2,12],[1,11,2,11],[1,10,2,10],[1,14,1,15],[1,16,1,17],[1,18,1,19]]}
[null," 対象工種の仕様の整理",null,null,"登録技術：",{"$f":"SUMPRODUCT((E4:E1000<>\"\")/COUNTIF(E4:E1000,E4:E1000&\"\"))&\"技術\"&MAX(B:B)&\"仕様\"","v":"50技術53仕様"},"検索結果：",{"$f":"\"\"&SUM(IF((A4:A1000<>\"\")*(A4:A1000<>\"-\")*(E4:E1000<>\"\"),1/COUNTIFS(A4:A1000,\"<>\",A4:A1000,\"<>-\",E4:E1000,E4:E1000)))&\"技術\"&COUNT(A:A)&\"仕様\"","v":"50技術53仕様"},null,null,null,null,null,null,null,null,null,null,null,null,"→検索結果","中性化・塩害・その他；◎〇△-が該当\nARS；◎○△が該当、-/非該当",null,null,null,null,null,null,"→絶対順位"]
[null,"基本情報",null,null,null,null,null,null,null,"評価基準","中性化","塩害","ASR","その他","素地（着工前）",null,"本塗り",null,"後養生",null,"条件一致","中性化","塩害","ARS","その他","素地","本塗り","後養生"]
["検索順位","番号","技術\n番号","技術名","NETIS登録番号","技術の種類","審議終了技術","更新日","種類",null,null,null,null,null,"乾燥状態","湿潤状態","乾燥させることが可能","乾燥させることが不可能","乾燥養生させることが可能","乾燥養生させることが不可能\n（常時湿った状態）",null,{"$f":"IF(検索!R5=TRUE,\"○\",\"\")","v":""},{"$f":"IF(検索!R6=TRUE,\"○\",\"\")","v":""},{"$f":"IF(検索!R7=TRUE,\"○\",\"\")","v":""},{"$f":"IF(検索!R8=TRUE,\"○\",\"\")","v":""},{"$f":"検索!S9","v":"特に指定しない"},{"$f":"検索!S10","v":"特に指定しない"},{"$f":"検索!S11","v":"特に指定しない"},"九州本社","Aの技術","九州でA","記号","登録年度","登録番号","審議終了","仕様","地整","重み付け","絶対順位"]
[{"$f":"IF(検索!$U$1=\"条件検索\", IF(U4=\"○\", COUNTIFS(U:U,\"○\",AM:AM,\"<\"&AM4)+1, \"-\"), IF(検索!$U$1=\"技術名検索\", IF(検索!$B$30=E4, AM4, \"-\"), \"-\"))","v":45},1,"2-1","コンクリート表面保護材「パーミエイトHS-300」","CB-090033-VG","NETIS掲載期間終了技術","○","令和7年10月","シラン系","シラン系評価基準評価基準","◎","△","△","／","○","○","○","-","○","-",{"$f":"IF(COUNTIF(V4:Y4,\"×\")>0,\"×\",IF(COUNTIF(Z4:AB4,\"○\")=3,\"○\",\"×\"))","v":"○"},{"$f":"IF(V$3=\"○\",IF(OR(K4=\"◎\",K4=\"○\",K4=\"△\",K4=\"-\"),\"○\",\"×\"),\"\")","v":""},{"$f":"IF(W$3=\"○\",IF(OR(L4=\"◎\",L4=\"○\",L4=\"△\",L4=\"-\"),\"○\",\"×\"),\"\")","v":""},{"$f":"IF(X$3=\"○\",IF(OR(M4=\"◎\",M4=\"○\",M4=\"△\"),\"○\",\"×\"),\"\")","v":""},"",{"$f":"IF($Z$3=\"特に指定しない\",\"○\",IF($Z$3=\"乾燥状態\",O4,IF($Z$3=\"湿潤状態\",P4)))","v":"○"},{"$f":"IF($AA$3=\"特に指定しない\",\"○\",IF($AA$3=\"乾燥させることが可能\",Q4,IF($AA$3=\"乾燥させることが不可能\",R4)))","v":"○"},{"$f":"IF($AB$3=\"特に指定しない\",\"○\",IF($AB$3=\"乾燥させることが可能\",S4,IF($AB$3=\"乾燥させることが不可能\",T4)))","v":"○"},{"$f":"HLOOKUP($C4,DB!$1:$1048576,9,0)","v":"-"},{"$f":"RIGHT(E4,LEN(E4)-FIND(\"-\",E4,FIND(\"-\",E4)+1))","v":"VG"},{"$f":"IF(AND(AC4=\"◎\",AD4=\"A\"),1,2)","v":2},{"$f":"VLOOKUP(AD4,条件!D:E,2,0)","v":2},{"$f":"IFERROR(IF(VALUE(LEFT(MID(E4,FIND(\"-\",E4)+1,FIND(\"-\",E4,FIND(\"-\",E4)+1)-FIND(\"-\",E4)-1),2))>=90,\"19\"&LEFT(MID(E4,FIND(\"-\",E4)+1,FIND(\"-\",E4,FIND(\"-\",E4)+1)-FIND(\"-\",E4)-1),2),\"20\"&LEFT(MID(E4,FIND(\"-\",E4)+1,FIND(\"-\",E4,FIND(\"-\",E4)+1)-FIND(\"-\",E4)-1),2)),\"\")","v":"2009"},{"$f":"MID(E4, FIND(\"-\", E4) + 3, FIND(\"-\", E4, FIND(\"-\", E4) + 1) - FIND(\"-\", E4) - 3)","v":"0033"},{"$f":"IF(G4=\"\",2,1)","v":1},{"$f":"MID(C4,FIND(\"-\",C4)+1,LEN(C4))","v":"1"},{"$f":"VLOOKUP(LEFT(E4,2),条件!A:B,2,0)","v":"06"},{"$f":"(AE4&AF4&AG4&AH4&AI4&TEXT(AJ4,\"00\")&AK4)*1","v":222009003310106},{"$f":"_xlfn.RANK.EQ(AL4,AL:AL,1)","v":45}]
[{"$f":"IF(検索!$U$1=\"条件検索\", IF(U5=\"○\", COUNTIFS(U:U,\"○\",AM:AM,\"<\"&AM5)+1, \"-\"), IF(検索!$U$1=\"技術名検索\", IF(検索!$B$30=E5, AM5, \"-\"), \"-\"))","v":46},2,"3-1","高浸透性コンクリート改質剤 【リバコン・リキッド】","KT-090067-VG","NETIS掲載期間終了技術","○","令和7年10月","その他表面保護材","その他表面保護材評価基準","○","／","△","／","○","○","○","-","○","-","○",{"$f":"IF(V$3=\"○\",IF(OR(K5=\"◎\",K5=\"○\",K5=\"△\",K5=\"-\"),\"○\",\"×\"),\"\")","v":""},{"$f":"IF(W$3=\"○\",IF(OR(L5=\"◎\",L5=\"○\",L5=\"△\",L5=\"-\"),\"○\",\"×\"),\"\")","v":""},{"$f":"IF(X$3=\"○\",IF(OR(M5=\"◎\",M5=\"○\",M5=\"△\"),\"○\",\"×\"),\"\")","v":""},{"$f":"IF(Y$3=\"○\",IF(OR(N5=\"◎\",N5=\"○\",N5=\"△\",N5=\"-\"),\"○\",\"×\"),\"\")","v":""},"○","○","○",{"$f":"HLOOKUP($C5,DB!$1:$1048576,9,0)","v":"-"},"VG",{"$f":"IF(AND(AC5=\"◎\",AD5=\"A\"),1,2)","v":2},{"$f":"VLOOKUP(AD5,条件!D:E,2,0)","v":2},"2009","0067",{"$f":"IF(G5=\"\",2,1)","v":1},"1",{"$f":"VLOOKUP(LEFT(E5,2),条件!A:B,2,0)","v":"08"},{"$f":"(AE5&AF5&AG5&AH5&AI5&TEXT(AJ5,\"00\")&AK5)*1","v":222009006710108},{"$f":"_xlfn.RANK.EQ(AL5,AL:AL,1)","v":46}]
[{"$f":"IF(検索!$U$1=\"条件検索\", IF(U6=\"○\", COUNTIFS(U:U,\"○\",AM:AM,\"<\"&AM6)+1, \"-\"), IF(検索!$U$1=\"技術名検索\", IF(検索!$B$30=E6, AM6, \"-\"), \"-\"))","v":47},3,"4-1","ニュースパンガード","QS-100008-VG","NETIS掲載期間終了技術","○","令和7年10月","シラン系","シラン系評価基準評価基準","◎","△","△","△","○","○","○","-","○","-","○","","","","","○","○","○",{"$f":"HLOOKUP($C6,DB!$1:$1048576,9,0)","v":"-"},"VG",2,{"$f":"VLOOKUP(AD6,条件!D:E,2,0)","v":2},"2010","0008",1,"1",{"$f":"VLOOKUP(LEFT(E6,2),条件!A:B,2,0)","v":"01"},222010000810101,47]
[{"$f":"IF(検索!$U$1=\"条件検索\", IF(U7=\"○\", COUNTIFS(U:U,\"○\",AM:AM,\"<\"&AM7)+1, \"-\"), IF(検索!$U$1=\"技術名検索\", IF(検索!$B$30=E7, AM7, \"-\"), \"-\"))","v":48},4,"5-1","RCGインナーシリカ","KK-100013-VG","NETIS掲載期間終了技術","○","令和7年10月","ケイ酸塩系","ケイ酸塩系ASR適用可評価基準","○","△","-","△","○","○","○","○","○","○","○","","","","","○","○","○",{"$f":"HLOOKUP($C7,DB!$1:$1048576,9,0)","v":"-"},"VG",2,{"$f":"VLOOKUP(AD7,条件!D:E,2,0)","v":2},"2010","0013",1,"1",{"$f":"VLOOKUP(LEFT(E7,2),条件!A:B,2,0)","v":"05"},222010001310105,48]
[{"$f":"IF(検索!$U$1=\"条件検索\", IF(U8=\"○\", COUNTIFS(U:U,\"○\",AM:AM,\"<\"&AM8)+1, \"-\"), IF(検索!$U$1=\"技術名検索\", IF(検索!$B$30=E8, AM8, \"-\"), \"-\"))","v":49},5,"6-1","無機系コンクリート浸透改質材「リフレパセットD70」","KK-100025-VG","NETIS掲載期間終了技術","○","令和7年10月","シラン系","シラン系評価基準評価基準","◎","△","△","／","○","○","○","-","○","-","○","","","","","○","○","○",{"$f":"HLOOKUP($C8,DB!$1:$1048576,9,0)","v":"-"},"VG",2,{"$f":"VLOOKUP(AD8,条件!D:E,2,0)","v":2},"2010","0025",1,"1",{"$f":"VLOOKUP(LEFT(E8,2),条件!A:B,2,0)","v":"05"},222010002510105,49]
[{"$f":"IF(検索!$U$1=\"条件検索\", IF(U9=\"○\", COUNTIFS(U:U,\"○\",AM:AM,\"<\"&AM9)+1, \"-\"), IF(検索!$U$1=\"技術名検索\", IF(検索!$B$30=E9, AM9, \"-\"), \"-\"))","v":50},6,"10-1","浸透性吸水防止材「レジソークType1」","CG-120004-VG","NETIS掲載期間終了技術","○","令和7年10月","シラン系","シラン系評価基準評価基準","◎","△","△","-","○","○","○","-","○","-","○","","","","","○","○","○",{"$f":"HLOOKUP($C9,DB!$1:$1048576,9,0)","v":"-"},"VG",2,{"$f":"VLOOKUP(AD9,条件!D:E,2,0)","v":2},"2012","0004",1,"1",{"$f":"VLOOKUP(LEFT(E9,2),条件!A:B,2,0)","v":"04"},222012000410104,50]
[{"$f":"IF(検索!$U$1=\"条件検索\", IF(U10=\"○\", COUNTIFS(U:U,\"○\",AM:AM,\"<\"&AM10)+1, \"-\"), IF(検索!$U$1=\"技術名検索\", IF(検索!$B$30=E10, AM10, \"-\"), \"-\"))","v":51},7,"11-1","含浸系表面保護材「プロテクトシルBH N」","KK-120047-VG","NETIS掲載期間終了技術","○","令和7年10月","シラン系","シラン系評価基準評価基準","○","△","△","-","○","○","○","-","○","-","○","","","","","○","○","○",{"$f":"HLOOKUP($C10,DB!$1:$1048576,9,0)","v":"-"},"VG",2,{"$f":"VLOOKUP(AD10,条件!D:E,2,0)","v":2},"2012","0047",1,"1",{"$f":"VLOOKUP(LEFT(E10,2),条件!A:B,2,0)","v":"05"},222012004710105,51]
[{"$f":"IF(検索!$U$1=\"条件検索\", IF(U11=\"○\", COUNTIFS(U:U,\"○\",AM:AM,\"<\"&AM11)+1, \"-\"), IF(検索!$U$1=\"技術名検索\", IF(検索!$B$30=E11, AM11, \"-\"), \"-\"))","v":52},8,"14-1","シリケートガード","KT-130009-VG","NETIS掲載期間終了技術","○","令和7年10月","ケイ酸塩系","ケイ酸塩系ASR適用不可評価基準","○","△","／","△","○","○","○","○","○","-","○","","","","","○","○","○",{"$f":"HLOOKUP($C11,DB!$1:$1048576,9,0)","v":"-"},"VG",2,{"$f":"VLOOKUP(AD11,条件!D:E,2,0)","v":2},"2013","0009",1,"1",{"$f":"VLOOKUP(LEFT(E11,2),条件!A:B,2,0)","v":"08"},222013000910108,52]
[{"$f":"IF(検索!$U$1=\"条件検索\", IF(U12=\"○\", COUNTIFS(U:U,\"○\",AM:AM,\"<\"&AM12)+1, \"-\"), IF(検索!$U$1=\"技術名検索\", IF(検索!$B$30=E12, AM12, \"-\"), \"-\"))","v":53},9,"17-1","無機質ケイ酸塩含浸コンクリート保護材 「ポルトガード・プレクサス」","KT-130065-VG","NETIS掲載期間終了技術","○","令和7年10月","ケイ酸塩系","ケイ酸塩系ASR適用不可評価基準","○","△","／","△","○","○","○","○","○","-","○","","","","","○","○","○",{"$f":"HLOOKUP($C12,DB!$1:$1048576,9,0)","v":"-"},"VG",2,{"$f":"VLOOKUP(AD12,条件!D:E,2,0)","v":2},"2013","0065",1,"1",{"$f":"VLOOKUP(LEFT(E12,2),条件!A:B,2,0)","v":"08"},222013006510108,53]
[{"$f":"IF(検索!$U$1=\"条件検索\", IF(U13=\"○\", COUNTIFS(U:U,\"○\",AM:AM,\"<\"&AM13)+1, \"-\"), IF(検索!$U$1=\"技術名検索\", IF(検索!$B$30=E13, AM13, \"-\"), \"-\"))","v":1},10,"22-1","コンクリート劣化防止工法 ファインクリスタルS&TOP","CB-150008-VR","事後評価済技術","○","令和7年10月","その他表面保護材","その他表面保護材評価基準","△","-","△","△","○","○","○","-","○","-","○","","","","","○","○","○",{"$f":"HLOOKUP($C13,DB!$1:$1048576,9,0)","v":"-"},"VR",2,{"$f":"VLOOKUP(AD13,条件!D:E,2,0)","v":1},"2015","0008",1,"1",{"$f":"VLOOKUP(LEFT(E13,2),条件!A:B,2,0)","v":"06"},212015000810106,1]
[{"$f":"IF(検索!$U$1=\"条件検索\", IF(U14=\"○\", COUNTIFS(U:U,\"○\",AM:AM,\"<\"&AM14)+1, \"-\"), IF(検索!$U$1=\"技術名検索\", IF(検索!$B$30=E14, AM14, \"-\"), \"-\"))","v":2},11,"23-1","けい酸塩系コンクリート含浸材「SUPER SHIELD」","QS-150019-VE","有用な新技術","○","令和7年10月","ケイ酸塩系","ケイ酸塩系ASR適用不可評価基準","○","○","／","／","○","○","○","○","○","○","○","","","","","○","○","○",{"$f":"HLOOKUP($C14,DB!$1:$1048576,9,0)","v":"◎"},"VE",2,{"$f":"VLOOKUP(AD14,条件!D:E,2,0)","v":1},"2015","0019",1,"1",{"$f":"VLOOKUP(LEFT(E14,2),条件!A:B,2,0)","v":"01"},212015001910101,2]
[{"$f":"IF(検索!$U$1=\"条件検索\", IF(U15=\"○\", COUNTIFS(U:U,\"○\",AM:AM,\"<\"&AM15)+1, \"-\"), IF(検索!$U$1=\"技術名検索\", IF(検索!$B$30=E15, AM15, \"-\"), \"-\"))","v":3},12,"25-1","コンクリート改質・劣化防止剤 「カルサプリ」、「リアクトライズ」（リアクトライズ単独使用時）","SK-160004-VR","事後評価済技術","○","令和7年10月","ケイ酸塩系","ケイ酸塩系ASR適用不可評価基準","○","△","／","／","○","○","○","-","○","-","○","","","","","○","○","○",{"$f":"HLOOKUP($C15,DB!$1:$1048576,9,0)","v":"-"},"VR",2,{"$f":"VLOOKUP(AD15,条件!D:E,2,0)","v":1},"2016","0004",1,"1",{"$f":"VLOOKUP(LEFT(E15,2),条件!A:B,2,0)","v":"03"},212016000410103,3]
[{"$f":"IF(検索!$U$1=\"条件検索\", IF(U16=\"○\", COUNTIFS(U:U,\"○\",AM:AM,\"<\"&AM16)+1, \"-\"), IF(検索!$U$1=\"技術名検索\", IF(検索!$B$30=E16, AM16, \"-\"), \"-\"))","v":4},13,"25-2","コンクリート改質・劣化防止剤 「カルサプリ」、「リアクトライズ」（カルサプリ、リアクトライズ併用時）","SK-160004-VR","事後評価済技術","○","令和7年10月","ケイ酸塩系","ケイ酸塩系ASR適用不可評価基準","○","△","／","／","○","○","○","-","○","-","○","","","","","○","○","○",{"$f":"HLOOKUP($C16,DB!$1:$1048576,9,0)","v":"-"},"VR",2,{"$f":"VLOOKUP(AD16,条件!D:E,2,0)","v":1},"2016","0004",1,"2",{"$f":"VLOOKUP(LEFT(E16,2),条件!A:B,2,0)","v":"03"},212016000410203,4]
[{"$f":"IF(検索!$U$1=\"条件検索\", IF(U17=\"○\", COUNTIFS(U:U,\"○\",AM:AM,\"<\"&AM17)+1, \"-\"), IF(検索!$U$1=\"技術名検索\", IF(検索!$B$30=E17, AM17, \"-\"), \"-\"))","v":5},14,"26-1","けい酸塩系表面含浸材CS-21ネオ","CG-160013-VE","有用な新技術","○","令和7年10月","ケイ酸塩系","ケイ酸塩系ASR適用不可評価基準","△","△","／","△","○","○","○","○","○","○","○","","","","","○","○","○",{"$f":"HLOOKUP($C17,DB!$1:$1048576,9,0)","v":"-"},"VE",2,{"$f":"VLOOKUP(AD17,条件!D:E,2,0)","v":1},"2016","0013",1,"1",{"$f":"VLOOKUP(LEFT(E17,2),条件!A:B,2,0)","v":"04"},212016001310104,5]
[{"$f":"IF(検索!$U$1=\"条件検索\", IF(U18=\"○\", COUNTIFS(U:U,\"○\",AM:AM,\"<\"&AM18)+1, \"-\"), IF(検索!$U$1=\"技術名検索\", IF(検索!$B$30=E18, AM18, \"-\"), \"-\"))","v":6},15,"27-1","コンクリート劣化抑制表面含浸工 ジルコンパーミエイト　","QS-160027-VR","事後評価済技術","○","令和7年10月","ケイ酸塩系","ケイ酸塩系ASR適用不可評価基準","○","△","／","／","○","○","○","-","○","-","○","","","","","○","○","○",{"$f":"HLOOKUP($C18,DB!$1:$1048576,9,0)","v":"△（九州に共同開発者有り）"},"VR",2,{"$f":"VLOOKUP(AD18,条件!D:E,2,0)","v":1},"2016","0027",1,"1",{"$f":"VLOOKUP(LEFT(E18,2),条件!A:B,2,0)","v":"01"},212016002710101,6]
[{"$f":"IF(検索!$U$1=\"条件検索\", IF(U19=\"○\", COUNTIFS(U:U,\"○\",AM:AM,\"<\"&AM19)+1, \"-\"), IF(検索!$U$1=\"技術名検索\", IF(検索!$B$30=E19, AM19, \"-\"), \"-\"))","v":7},16,"28-1","ザイペックス・液体タイプ 塗布・吹付工法","KT-160039-VR","事後評価済技術","○","令和7年10月","その他表面保護材","その他表面保護材評価基準","○","△","／","△","○","○","○","○","○","○","○","","","","","○","○","○",{"$f":"HLOOKUP($C19,DB!$1:$1048576,9,0)","v":"-"},"VR",2,{"$f":"VLOOKUP(AD19,条件!D:E,2,0)","v":1},"2016","0039",1,"1",{"$f":"VLOOKUP(LEFT(E19,2),条件!A:B,2,0)","v":"08"},212016003910108,7]
[{"$f":"IF(検索!$U$1=\"条件検索\", IF(U20=\"○\", COUNTIFS(U:U,\"○\",AM:AM,\"<\"&AM20)+1, \"-\"), IF(検索!$U$1=\"技術名検索\", IF(検索!$B$30=E20, AM20, \"-\"), \"-\"))","v":8},17,"29-1","Sクリート工法","KT-160122-VR","事後評価済技術","○","令和7年10月","その他表面保護材","その他表面保護材評価基準","○","◎","△","△","○","○","○","○","○","-","○","","","","","○","○","○",{"$f":"HLOOKUP($C20,DB!$1:$1048576,9,0)","v":"-"},"VR",2,{"$f":"VLOOKUP(AD20,条件!D:E,2,0)","v":1},"2016","0122",1,"1",{"$f":"VLOOKUP(LEFT(E20,2),条件!A:B,2,0)","v":"08"},212016012210108,8]
[{"$f":"IF(検索!$U$1=\"条件検索\", IF(U21=\"○\", COUNTIFS(U:U,\"○\",AM:AM,\"<\"&AM21)+1, \"-\"), IF(検索!$U$1=\"技術名検索\", IF(検索!$B$30=E21, AM21, \"-\"), \"-\"))","v":9},18,"31-1","2液混合型けい酸塩系表面含浸材CS-21ビルダー","CG-170009-A","事後評価未実施技術","○","令和7年10月","ケイ酸塩系","ケイ酸塩系ASR適用不可評価基準","△","△","／","△","○","○","○","○","○","○","○","","","","","○","○","○",{"$f":"HLOOKUP($C21,DB!$1:$1048576,9,0)","v":"-"},"A",2,{"$f":"VLOOKUP(AD21,条件!D:E,2,0)","v":1},"2017","0009",1,"1",{"$f":"VLOOKUP(LEFT(E21,2),条件!A:B,2,0)","v":"04"},212017000910104,9]
[{"$f":"IF(検索!$U$1=\"条件検索\", IF(U22=\"○\", COUNTIFS(U:U,\"○\",AM:AM,\"<\"&AM22)+1, \"-\"), IF(検索!$U$1=\"技術名検索\", IF(検索!$B$30=E22, AM22, \"-\"), \"-\"))","v":35},19,"33-1","浸透性吸水防止材「マジカルリペラー」「マジカルリペラーHV」　","TS-030006-VG","NETIS掲載期間終了技術","○","令和7年10月","シラン系","シラン系評価基準評価基準","◎","△","△","△","○","○","○","-","○","-","○","","","","","○","○","○",{"$f":"HLOOKUP($C22,DB!$1:$1048576,9,0)","v":"-"},"VG",2,{"$f":"VLOOKUP(AD22,条件!D:E,2,0)","v":2},"2003","0006",1,"1",{"$f":"VLOOKUP(LEFT(E22,2),条件!A:B,2,0)","v":11},222003000610111,35]
[{"$f":"IF(検索!$U$1=\"条件検索\", IF(U23=\"○\", COUNTIFS(U:U,\"○\",AM:AM,\"<\"&AM23)+1, \"-\"), IF(検索!$U$1=\"技術名検索\", IF(検索!$B$30=E23, AM23, \"-\"), \"-\"))","v":34},20,"34-1","コンクリート改質剤CS-21","CB-020055-VG","NETIS掲載期間終了技術","○","令和7年10月","ケイ酸塩系","ケイ酸塩系ASR適用不可評価基準","○","△","／","△","○","○","○","○","○","○","○","","","","","○","○","○",{"$f":"HLOOKUP($C23,DB!$1:$1048576,9,0)","v":"-"},"VG",2,{"$f":"VLOOKUP(AD23,条件!D:E,2,0)","v":2},"2002","0055",1,"1",{"$f":"VLOOKUP(LEFT(E23,2),条件!A:B,2,0)","v":"06"},222002005510106,34]
[{"$f":"IF(検索!$U$1=\"条件検索\", IF(U24=\"○\", COUNTIFS(U:U,\"○\",AM:AM,\"<\"&AM24)+1, \"-\"), IF(検索!$U$1=\"技術名検索\", IF(検索!$B$30=E24, AM24, \"-\"), \"-\"))","v":38},21,"35-1","コンクリート浸透性改質材[RCガーデックス]（製品仕様：防水用、養生用、塩害用、タイル外壁用、CV（土木構造物向け））","KT-060075-VG","NETIS掲載期間終了技術","○","令和7年10月","ケイ酸塩系","ケイ酸塩系ASR適用不可評価基準","△","△","／","△","○","○","○","○","○","○","○","","","","","○","○","○",{"$f":"HLOOKUP($C24,DB!$1:$1048576,9,0)","v":"-"},"VG",2,{"$f":"VLOOKUP(AD24,条件!D:E,2,0)","v":2},"2006","0075",1,"1",{"$f":"VLOOKUP(LEFT(E24,2),条件!A:B,2,0)","v":"08"},222006007510108,38]
[{"$f":"IF(検索!$U$1=\"条件検索\", IF(U25=\"○\", COUNTIFS(U:U,\"○\",AM:AM,\"<\"&AM25)+1, \"-\"), IF(検索!$U$1=\"技術名検索\", IF(検索!$B$30=E25, AM25, \"-\"), \"-\"))","v":39},22,"35-2","コンクリート浸透性改質材[RCガーデックス]（製品仕様：高炉用）","KT-060075-VG","NETIS掲載期間終了技術","○","令和7年10月","ケイ酸塩系","ケイ酸塩系ASR適用不可評価基準","△","△","／","△","○","○","○","○","○","○","○","","","","","○","○","○",{"$f":"HLOOKUP($C25,DB!$1:$1048576,9,0)","v":"-"},"VG",2,{"$f":"VLOOKUP(AD25,条件!D:E,2,0)","v":2},"2006","0075",1,"2",{"$f":"VLOOKUP(LEFT(E25,2),条件!A:B,2,0)","v":"08"},222006007510208,39]
[{"$f":"IF(検索!$U$1=\"条件検索\", IF(U26=\"○\", COUNTIFS(U:U,\"○\",AM:AM,\"<\"&AM26)+1, \"-\"), IF(検索!$U$1=\"技術名検索\", IF(検索!$B$30=E26, AM26, \"-\"), \"-\"))","v":37},23,"36-1","鉄筋腐食抑制工法 「プロテクトシル CIT」","HR-060004-VG","NETIS掲載期間終了技術","○","令和7年10月","シラン系","シラン系評価基準評価基準","◎","△","△","／","○","○","○","-","○","-","○","","","","","○","○","○",{"$f":"HLOOKUP($C26,DB!$1:$1048576,9,0)","v":"-"},"VG",2,{"$f":"VLOOKUP(AD26,条件!D:E,2,0)","v":2},"2006","0004",1,"1",{"$f":"VLOOKUP(LEFT(E26,2),条件!A:B,2,0)","v":"07"},222006000410107,37]
[{"$f":"IF(検索!$U$1=\"条件検索\", IF(U27=\"○\", COUNTIFS(U:U,\"○\",AM:AM,\"<\"&AM27)+1, \"-\"), IF(検索!$U$1=\"技術名検索\", IF(検索!$B$30=E27, AM27, \"-\"), \"-\"))","v":33},24,"37-1","ザイペックス工法","QS-000011-VG","NETIS掲載期間終了技術","○","令和7年10月","その他表面保護材","その他表面保護材評価基準","△","-","△","△","○","○","○","○","○","○","○","","","","","○","○","○",{"$f":"HLOOKUP($C27,DB!$1:$1048576,9,0)","v":"-"},"VG",2,{"$f":"VLOOKUP(AD27,条件!D:E,2,0)","v":2},"2000","0011",1,"1",{"$f":"VLOOKUP(LEFT(E27,2),条件!A:B,2,0)","v":"01"},222000001110101,33]
[{"$f":"IF(検索!$U$1=\"条件検索\", IF(U28=\"○\", COUNTIFS(U:U,\"○\",AM:AM,\"<\"&AM28)+1, \"-\"), IF(検索!$U$1=\"技術名検索\", IF(検索!$B$30=E28, AM28, \"-\"), \"-\"))","v":36},25,"38-1","マクサム工法","QS-040013-VG","NETIS掲載期間終了技術","○","令和7年10月","ケイ酸塩系","ケイ酸塩系ASR適用可評価基準","○","◎","△","-","○","○","○","-","○","-","○","","","","","○","○","○",{"$f":"HLOOKUP($C28,DB!$1:$1048576,9,0)","v":"-"},"VG",2,{"$f":"VLOOKUP(AD28,条件!D:E,2,0)","v":2},"2004","0013",1,"1",{"$f":"VLOOKUP(LEFT(E28,2),条件!A:B,2,0)","v":"01"},222004001310101,36]
[{"$f":"IF(検索!$U$1=\"条件検索\", IF(U29=\"○\", COUNTIFS(U:U,\"○\",AM:AM,\"<\"&AM29)+1, \"-\"), IF(検索!$U$1=\"技術名検索\", IF(検索!$B$30=E29, AM29, \"-\"), \"-\"))","v":40},26,"39-1","高粘性浸透性吸水防止材","KT-060094-VG","NETIS掲載期間終了技術","○","令和7年10月","シラン系","シラン系評価基準評価基準","○","△","△","△","○","○","○","-","○","-","○","","","","","○","○","○",{"$f":"HLOOKUP($C29,DB!$1:$1048576,9,0)","v":"-"},"VG",2,{"$f":"VLOOKUP(AD29,条件!D:E,2,0)","v":2},"2006","0094",1,"1",{"$f":"VLOOKUP(LEFT(E29,2),条件!A:B,2,0)","v":"08"},222006009410108,40]
[{"$f":"IF(検索!$U$1=\"条件検索\", IF(U30=\"○\", COUNTIFS(U:U,\"○\",AM:AM,\"<\"&AM30)+1, \"-\"), IF(検索!$U$1=\"技術名検索\", IF(検索!$B$30=E30, AM30, \"-\"), \"-\"))","v":41},27,"40-1","ケイ酸質リチウム系コンクリート改質剤「L-OSMO反応型SG」","HK-070015-VG","NETIS掲載期間終了技術","○","令和7年10月","ケイ酸塩系","ケイ酸塩系ASR適用不可評価基準","△","△","／","△","○","○","○","○","○","○","○","","","","","○","○","○",{"$f":"HLOOKUP($C30,DB!$1:$1048576,9,0)","v":"-"},"VG",2,{"$f":"VLOOKUP(AD30,条件!D:E,2,0)","v":2},"2007","0015",1,"1",{"$f":"VLOOKUP(LEFT(E30,2),条件!A:B,2,0)","v":10},222007001510110,41]
[{"$f":"IF(検索!$U$1=\"条件検索\", IF(U31=\"○\", COUNTIFS(U:U,\"○\",AM:AM,\"<\"&AM31)+1, \"-\"), IF(検索!$U$1=\"技術名検索\", IF(検索!$B$30=E31, AM31, \"-\"), \"-\"))","v":42},28,"41-1","無溶剤タイプジェル状シラン系表面含浸材","KT-070047-VG","NETIS掲載期間終了技術","○","令和7年10月","シラン系","シラン系評価基準評価基準","◎","△","△","△","○","○","○","-","○","-","○","","","","","○","○","○",{"$f":"HLOOKUP($C31,DB!$1:$1048576,9,0)","v":"-"},"VG",2,{"$f":"VLOOKUP(AD31,条件!D:E,2,0)","v":2},"2007","0047",1,"1",{"$f":"VLOOKUP(LEFT(E31,2),条件!A:B,2,0)","v":"08"},222007004710108,42]
[{"$f":"IF(検索!$U$1=\"条件検索\", IF(U32=\"○\", COUNTIFS(U:U,\"○\",AM:AM,\"<\"&AM32)+1, \"-\"), IF(検索!$U$1=\"技術名検索\", IF(検索!$B$30=E32, AM32, \"-\"), \"-\"))","v":43},29,"42-1","珪酸塩系含浸コンクリート保護材","KT-080005-VG","NETIS掲載期間終了技術","○","令和7年10月","ケイ酸塩系","ケイ酸塩系ASR適用可評価基準","○","△","△","△","○","○","○","○","○","○","○","","","","","○","○","○",{"$f":"HLOOKUP($C32,DB!$1:$1048576,9,0)","v":"-"},"VG",2,{"$f":"VLOOKUP(AD32,条件!D:E,2,0)","v":2},"2008","0005",1,"1",{"$f":"VLOOKUP(LEFT(E32,2),条件!A:B,2,0)","v":"08"},222008000510108,43]
[{"$f":"IF(検索!$U$1=\"条件検索\", IF(U33=\"○\", COUNTIFS(U:U,\"○\",AM:AM,\"<\"&AM33)+1, \"-\"), IF(検索!$U$1=\"技術名検索\", IF(検索!$B$30=E33, AM33, \"-\"), \"-\"))","v":44},30,"43-1","省力施工型コンクリート改質・劣化防止剤「リアル・メンテ」","KT-080018-VG","NETIS掲載期間終了技術","○","令和7年10月","ケイ酸塩系","ケイ酸塩系ASR適用不可評価基準","○","△","／","△","○","○","○","○","○","○","○","","","","","○","○","○",{"$f":"HLOOKUP($C33,DB!$1:$1048576,9,0)","v":"-"},"VG",2,{"$f":"VLOOKUP(AD33,条件!D:E,2,0)","v":2},"2008","0018",1,"1",{"$f":"VLOOKUP(LEFT(E33,2),条件!A:B,2,0)","v":"08"},222008001810108,44]
[{"$f":"IF(検索!$U$1=\"条件検索\", IF(U34=\"○\", COUNTIFS(U:U,\"○\",AM:AM,\"<\"&AM34)+1, \"-\"), IF(検索!$U$1=\"技術名検索\", IF(検索!$B$30=E34, AM34, \"-\"), \"-\"))","v":10},31,"46-1","シラン系含浸材とシラン・シロキサン系表面塗布材を併用した、コンクリート表面処理材","KT-180004-A","事後評価未実施技術","○","令和7年10月","シラン系","シラン系評価基準評価基準","◎","／","／","△","○","○","○","-","○","-","○","","","","","○","○","○",{"$f":"HLOOKUP($C34,DB!$1:$1048576,9,0)","v":"-"},"A",2,{"$f":"VLOOKUP(AD34,条件!D:E,2,0)","v":1},"2018","0004",1,"1",{"$f":"VLOOKUP(LEFT(E34,2),条件!A:B,2,0)","v":"08"},212018000410108,10]
[{"$f":"IF(検索!$U$1=\"条件検索\", IF(U35=\"○\", COUNTIFS(U:U,\"○\",AM:AM,\"<\"&AM35)+1, \"-\"), IF(検索!$U$1=\"技術名検索\", IF(検索!$B$30=E35, AM35, \"-\"), \"-\"))","v":13},32,"47-1","けい酸リチウム系混合型表面含浸材「RCガードCE TYPE-Li」","KT-180024-A","事後評価未実施技術","○","令和7年10月","ケイ酸塩系","ケイ酸塩系ASR適用不可評価基準","○","△","／","△","○","○","○","○","○","○","○","","","","","○","○","○",{"$f":"HLOOKUP($C35,DB!$1:$1048576,9,0)","v":"-"},"A",2,{"$f":"VLOOKUP(AD35,条件!D:E,2,0)","v":1},"2018","0024",1,"1",{"$f":"VLOOKUP(LEFT(E35,2),条件!A:B,2,0)","v":"08"},212018002410108,13]
[{"$f":"IF(検索!$U$1=\"条件検索\", IF(U36=\"○\", COUNTIFS(U:U,\"○\",AM:AM,\"<\"&AM36)+1, \"-\"), IF(検索!$U$1=\"技術名検索\", IF(検索!$B$30=E36, AM36, \"-\"), \"-\"))","v":11},33,"48-1","高性能シラン系含浸工法 「エルシーセイバー工法(RSⅡ)」 ","QS-180010-A","事後評価未実施技術","○","令和7年10月","シラン系","シラン系評価基準評価基準","◎","△","△","／","○","○","○","-","○","-",{"$f":"IF(COUNTIF(V36:Y36,\"×\")>0,\"×\",IF(COUNTIF(Z36:AB36,\"○\")=3,\"○\",\"×\"))","v":"○"},"","","","",{"$f":"IF($Z$3=\"特に指定しない\",\"○\",IF($Z$3=\"乾燥状態\",O36,IF($Z$3=\"湿潤状態\",P36)))","v":"○"},{"$f":"IF($AA$3=\"特に指定しない\",\"○\",IF($AA$3=\"乾燥させることが可能\",Q36,IF($AA$3=\"乾燥させることが不可能\",R36)))","v":"○"},{"$f":"IF($AB$3=\"特に指定しない\",\"○\",IF($AB$3=\"乾燥させることが可能\",S36,IF($AB$3=\"乾燥させることが不可能\",T36)))","v":"○"},{"$f":"HLOOKUP($C36,DB!$1:$1048576,9,0)","v":"-"},{"$f":"RIGHT(E36,LEN(E36)-FIND(\"-\",E36,FIND(\"-\",E36)+1))","v":"A"},2,{"$f":"VLOOKUP(AD36,条件!D:E,2,0)","v":1},{"$f":"IFERROR(IF(VALUE(LEFT(MID(E36,FIND(\"-\",E36)+1,FIND(\"-\",E36,FIND(\"-\",E36)+1)-FIND(\"-\",E36)-1),2))>=90,\"19\"&LEFT(MID(E36,FIND(\"-\",E36)+1,FIND(\"-\",E36,FIND(\"-\",E36)+1)-FIND(\"-\",E36)-1),2),\"20\"&LEFT(MID(E36,FIND(\"-\",E36)+1,FIND(\"-\",E36,FIND(\"-\",E36)+1)-FIND(\"-\",E36)-1),2)),\"\")","v":"2018"},{"$f":"MID(E36, FIND(\"-\", E36) + 3, FIND(\"-\", E36, FIND(\"-\", E36) + 1) - FIND(\"-\", E36) - 3)","v":"0010"},1,{"$f":"MID(C36,FIND(\"-\",C36)+1,LEN(C36))","v":"1"},{"$f":"VLOOKUP(LEFT(E36,2),条件!A:B,2,0)","v":"01"},212018001010101,11]
[{"$f":"IF(検索!$U$1=\"条件検索\", IF(U37=\"○\", COUNTIFS(U:U,\"○\",AM:AM,\"<\"&AM37)+1, \"-\"), IF(検索!$U$1=\"技術名検索\", IF(検索!$B$30=E37, AM37, \"-\"), \"-\"))","v":12},34,"48-2","高性能シラン系含浸工法 「エルシーセイバー工法(SFⅡ)」 ","QS-180010-A","事後評価未実施技術","○","令和7年10月","シラン系","シラン系評価基準評価基準","◎","△","△","／","○","○","○","-","○","-","○","","","","","○","○","○",{"$f":"HLOOKUP($C37,DB!$1:$1048576,9,0)","v":"-"},"A",2,{"$f":"VLOOKUP(AD37,条件!D:E,2,0)","v":1},"2018","0010",1,"2",{"$f":"VLOOKUP(LEFT(E37,2),条件!A:B,2,0)","v":"01"},212018001010201,12]
[{"$f":"IF(検索!$U$1=\"条件検索\", IF(U38=\"○\", COUNTIFS(U:U,\"○\",AM:AM,\"<\"&AM38)+1, \"-\"), IF(検索!$U$1=\"技術名検索\", IF(検索!$B$30=E38, AM38, \"-\"), \"-\"))","v":14},35,"49-1","けい酸カリウムを主成分としたけい酸塩系表面含浸材(シリカリ)","CB-180026-A","事後評価未実施技術","○","令和7年10月","ケイ酸塩系","ケイ酸塩系ASR適用不可評価基準","-","△","／","○","○","○","○","-","○","-","○","","","","","○","○","○",{"$f":"HLOOKUP($C38,DB!$1:$1048576,9,0)","v":"-"},"A",2,{"$f":"VLOOKUP(AD38,条件!D:E,2,0)","v":1},"2018","0026",1,"1",{"$f":"VLOOKUP(LEFT(E38,2),条件!A:B,2,0)","v":"06"},212018002610106,14]
[{"$f":"IF(検索!$U$1=\"条件検索\", IF(U39=\"○\", COUNTIFS(U:U,\"○\",AM:AM,\"<\"&AM39)+1, \"-\"), IF(検索!$U$1=\"技術名検索\", IF(検索!$B$30=E39, AM39, \"-\"), \"-\"))","v":15},36,"50-1","けい酸塩系含浸コンクリート防水保護材「エバープロロング」","KT-180083-A","事後評価未実施技術","○","令和7年10月","ケイ酸塩系","ケイ酸塩系ASR適用可評価基準","○","◎","○","○","○","○","○","○","○","○","○","","","","","○","○","○",{"$f":"HLOOKUP($C39,DB!$1:$1048576,9,0)","v":"-"},"A",2,{"$f":"VLOOKUP(AD39,条件!D:E,2,0)","v":1},"2018","0083",1,"1",{"$f":"VLOOKUP(LEFT(E39,2),条件!A:B,2,0)","v":"08"},212018008310108,15]
[{"$f":"IF(検索!$U$1=\"条件検索\", IF(U40=\"○\", COUNTIFS(U:U,\"○\",AM:AM,\"<\"&AM40)+1, \"-\"), IF(検索!$U$1=\"技術名検索\", IF(検索!$B$30=E40, AM40, \"-\"), \"-\"))","v":16},37,"51-1","カルシウム付与剤併用型表面含浸工法「プラスCa」","KT-180101-A","事後評価未実施技術","○","令和7年10月","ケイ酸塩系","ケイ酸塩系ASR適用不可評価基準","△","△","-","△","○","○","○","○","○","○","○","","","","","○","○","○",{"$f":"HLOOKUP($C40,DB!$1:$1048576,9,0)","v":"-"},"A",2,{"$f":"VLOOKUP(AD40,条件!D:E,2,0)","v":1},"2018","0101",1,"1",{"$f":"VLOOKUP(LEFT(E40,2),条件!A:B,2,0)","v":"08"},212018010110108,16]
[{"$f":"IF(検索!$U$1=\"条件検索\", IF(U41=\"○\", COUNTIFS(U:U,\"○\",AM:AM,\"<\"&AM41)+1, \"-\"), IF(検索!$U$1=\"技術名検索\", IF(検索!$B$30=E41, AM41, \"-\"), \"-\"))","v":17},38,"52-1","ポルトグラスⅡ工法","CB-190016-VE","有用な新技術","○","令和7年10月","ケイ酸塩系","ケイ酸塩系ASR適用不可評価基準","○","△","／","-","○","○","○","-","○","○","○","","","","","○","○","○",{"$f":"HLOOKUP($C41,DB!$1:$1048576,9,0)","v":"-"},"VE",2,{"$f":"VLOOKUP(AD41,条件!D:E,2,0)","v":1},"2019","0016",1,"1",{"$f":"VLOOKUP(LEFT(E41,2),条件!A:B,2,0)","v":"06"},212019001610106,17]
[{"$f":"IF(検索!$U$1=\"条件検索\", IF(U42=\"○\", COUNTIFS(U:U,\"○\",AM:AM,\"<\"&AM42)+1, \"-\"), IF(検索!$U$1=\"技術名検索\", IF(検索!$B$30=E42, AM42, \"-\"), \"-\"))","v":18},39,"53-1","シラン系とケイ酸塩系の特長を併せ持つハイブリッド型表面含浸材(サンハイドロックL2)","CB-190021-VE","事後評価済技術","○","令和7年10月","その他表面保護材","その他表面保護材評価基準","○","△","△","○","○","○","○","-","○","-","○","","","","","○","○","○",{"$f":"HLOOKUP($C42,DB!$1:$1048576,9,0)","v":"-"},"VE",2,{"$f":"VLOOKUP(AD42,条件!D:E,2,0)","v":1},"2019","0021",1,"1",{"$f":"VLOOKUP(LEFT(E42,2),条件!A:B,2,0)","v":"06"},212019002110106,18]
[{"$f":"IF(検索!$U$1=\"条件検索\", IF(U43=\"○\", COUNTIFS(U:U,\"○\",AM:AM,\"<\"&AM43)+1, \"-\"), IF(検索!$U$1=\"技術名検索\", IF(検索!$B$30=E43, AM43, \"-\"), \"-\"))","v":19},40,"54-1","亜硝酸リチウム併用型表面含浸工法 「プロコンガードシステムS」","CG-190024-A","事後評価未実施技術","○","令和7年10月","シラン系","シラン系評価基準評価基準","◎","△","△","-","○","○","○","-","○","-","○","","","","","○","○","○",{"$f":"HLOOKUP($C43,DB!$1:$1048576,9,0)","v":"-"},"A",2,{"$f":"VLOOKUP(AD43,条件!D:E,2,0)","v":1},"2019","0024",1,"1",{"$f":"VLOOKUP(LEFT(E43,2),条件!A:B,2,0)","v":"04"},212019002410104,19]
[{"$f":"IF(検索!$U$1=\"条件検索\", IF(U44=\"○\", COUNTIFS(U:U,\"○\",AM:AM,\"<\"&AM44)+1, \"-\"), IF(検索!$U$1=\"技術名検索\", IF(検索!$B$30=E44, AM44, \"-\"), \"-\"))","v":20},41,"55-1","セラグリーンNK","KT-190081-A","事後評価未実施技術","○","令和7年10月","ケイ酸塩系","ケイ酸塩系ASR適用可評価基準","○","△","○","○","○","○","○","-","○","-","○","","","","","○","○","○",{"$f":"HLOOKUP($C44,DB!$1:$1048576,9,0)","v":"-"},"A",2,{"$f":"VLOOKUP(AD44,条件!D:E,2,0)","v":1},"2019","0081",1,"1",{"$f":"VLOOKUP(LEFT(E44,2),条件!A:B,2,0)","v":"08"},212019008110108,20]
[{"$f":"IF(検索!$U$1=\"条件検索\", IF(U45=\"○\", COUNTIFS(U:U,\"○\",AM:AM,\"<\"&AM45)+1, \"-\"), IF(検索!$U$1=\"技術名検索\", IF(検索!$B$30=E45, AM45, \"-\"), \"-\"))","v":21},42,"56-1","施工省力化けい酸塩系表面含浸材RCガーデックス土木用","KT-190107-VE","有用な新技術","○","令和7年10月","ケイ酸塩系","ケイ酸塩系ASR適用不可評価基準","-","△","／","○","○","○","○","-","○","-","○","","","","","○","○","○",{"$f":"HLOOKUP($C45,DB!$1:$1048576,9,0)","v":"-"},"VE",2,{"$f":"VLOOKUP(AD45,条件!D:E,2,0)","v":1},"2019","0107",1,"1",{"$f":"VLOOKUP(LEFT(E45,2),条件!A:B,2,0)","v":"08"},212019010710108,21]
[{"$f":"IF(検索!$U$1=\"条件検索\", IF(U46=\"○\", COUNTIFS(U:U,\"○\",AM:AM,\"<\"&AM46)+1, \"-\"), IF(検索!$U$1=\"技術名検索\", IF(検索!$B$30=E46, AM46, \"-\"), \"-\"))","v":23},43,"57-1","撥水作用を付与したオールインワンのコンクリート表面含浸剤","SK-200001-VR","事後評価済技術","○","令和7年10月","ケイ酸塩系","ケイ酸塩系ASR適用可評価基準","○","○","-","-","○","○","○","○","○","-","○","","","","","○","○","○",{"$f":"HLOOKUP($C46,DB!$1:$1048576,9,0)","v":"-"},"VR",2,{"$f":"VLOOKUP(AD46,条件!D:E,2,0)","v":1},"2020","0001",1,"1",{"$f":"VLOOKUP(LEFT(E46,2),条件!A:B,2,0)","v":"03"},212020000110103,23]
[{"$f":"IF(検索!$U$1=\"条件検索\", IF(U47=\"○\", COUNTIFS(U:U,\"○\",AM:AM,\"<\"&AM47)+1, \"-\"), IF(検索!$U$1=\"技術名検索\", IF(検索!$B$30=E47, AM47, \"-\"), \"-\"))","v":24},44,"58-1","IZW.Shield（塗布後の養生時間が2時間のシラン系表面含浸材）","CB-200002-A","事後評価未実施技術","○","令和7年10月","シラン系","シラン系評価基準評価基準","◎","△","△","-","○","○","○","-","○","-","○","","","","","○","○","○",{"$f":"HLOOKUP($C47,DB!$1:$1048576,9,0)","v":"-"},"A",2,{"$f":"VLOOKUP(AD47,条件!D:E,2,0)","v":1},"2020","0002",1,"1",{"$f":"VLOOKUP(LEFT(E47,2),条件!A:B,2,0)","v":"06"},212020000210106,24]
[{"$f":"IF(検索!$U$1=\"条件検索\", IF(U48=\"○\", COUNTIFS(U:U,\"○\",AM:AM,\"<\"&AM48)+1, \"-\"), IF(検索!$U$1=\"技術名検索\", IF(検索!$B$30=E48, AM48, \"-\"), \"-\"))","v":22},45,"59-1","ケイ酸塩系表面浸透材 エバークリート ベトロフルード","OK-200001-A","事後評価未実施技術","○","令和7年10月","ケイ酸塩系","ケイ酸塩系ASR適用不可評価基準","△","△","／","△","○","○","○","-","○","-","○","","","","","○","○","○",{"$f":"HLOOKUP($C48,DB!$1:$1048576,9,0)","v":"-"},"A",2,{"$f":"VLOOKUP(AD48,条件!D:E,2,0)","v":1},"2020","0001",1,"1",{"$f":"VLOOKUP(LEFT(E48,2),条件!A:B,2,0)","v":"02"},212020000110102,22]
[{"$f":"IF(検索!$U$1=\"条件検索\", IF(U49=\"○\", COUNTIFS(U:U,\"○\",AM:AM,\"<\"&AM49)+1, \"-\"), IF(検索!$U$1=\"技術名検索\", IF(検索!$B$30=E49, AM49, \"-\"), \"-\"))","v":25},46,"60-1","けい酸塩系表面含浸材を塗布した表面被覆材を用いた表面処理工法《インフララップ》","TH-200005-A","事後評価未実施技術","○","令和7年10月","ケイ酸塩系","ケイ酸塩系ASR適用不可評価基準","○","-","／","○","○","○","○","○","○","○","○","","","","","○","○","○",{"$f":"HLOOKUP($C49,DB!$1:$1048576,9,0)","v":"-"},"A",2,{"$f":"VLOOKUP(AD49,条件!D:E,2,0)","v":1},"2020","0005",1,"1",{"$f":"VLOOKUP(LEFT(E49,2),条件!A:B,2,0)","v":"09"},212020000510109,25]
[{"$f":"IF(検索!$U$1=\"条件検索\", IF(U50=\"○\", COUNTIFS(U:U,\"○\",AM:AM,\"<\"&AM50)+1, \"-\"), IF(検索!$U$1=\"技術名検索\", IF(検索!$B$30=E50, AM50, \"-\"), \"-\"))","v":26},47,"61-1","シラン・シロキサン系複合超高濃度含浸材を用いた親水性工法","KK-220004-A","事後評価未実施技術","○","令和7年10月","シラン系","シラン系評価基準評価基準","○","○","○","○","○","○","○","-","○","-","○","","","","","○","○","○",{"$f":"HLOOKUP($C50,DB!$1:$1048576,9,0)","v":"-"},"A",2,{"$f":"VLOOKUP(AD50,条件!D:E,2,0)","v":1},"2022","0004",1,"1",{"$f":"VLOOKUP(LEFT(E50,2),条件!A:B,2,0)","v":"05"},212022000410105,26]
[{"$f":"IF(検索!$U$1=\"条件検索\", IF(U51=\"○\", COUNTIFS(U:U,\"○\",AM:AM,\"<\"&AM51)+1, \"-\"), IF(検索!$U$1=\"技術名検索\", IF(検索!$B$30=E51, AM51, \"-\"), \"-\"))","v":27},48,"62-1","含浸系吸水防止材「ペネトラントシラン」","KT-220204-A","事後評価未実施技術","○","令和7年10月","シラン系","シラン系評価基準評価基準","○","○","△","○","○","-","○","-","○","-","○","","","","","○","○","○",{"$f":"HLOOKUP($C51,DB!$1:$1048576,9,0)","v":"-"},"A",2,{"$f":"VLOOKUP(AD51,条件!D:E,2,0)","v":1},"2022","0204",1,"1",{"$f":"VLOOKUP(LEFT(E51,2),条件!A:B,2,0)","v":"08"},212022020410108,27]
[{"$f":"IF(検索!$U$1=\"条件検索\", IF(U52=\"○\", COUNTIFS(U:U,\"○\",AM:AM,\"<\"&AM52)+1, \"-\"), IF(検索!$U$1=\"技術名検索\", IF(検索!$B$30=E52, AM52, \"-\"), \"-\"))","v":28},49,"63-1","ナノシリカ系表面含浸材　コンクリートリバイブ　CPT-2000","KT-220245-A","事後評価未実施技術",null,"令和7年10月","その他表面保護材","その他表面保護材評価基準","○","○","／","-","○","○","○","-","○","-","○","","","","","○","○","○",{"$f":"HLOOKUP($C52,DB!$1:$1048576,9,0)","v":"-"},"A",2,{"$f":"VLOOKUP(AD52,条件!D:E,2,0)","v":1},"2022","0245",2,"1",{"$f":"VLOOKUP(LEFT(E52,2),条件!A:B,2,0)","v":"08"},212022024520108,28]
[{"$f":"IF(検索!$U$1=\"条件検索\", IF(U53=\"○\", COUNTIFS(U:U,\"○\",AM:AM,\"<\"&AM53)+1, \"-\"), IF(検索!$U$1=\"技術名検索\", IF(検索!$B$30=E53, AM53, \"-\"), \"-\"))","v":30},50,"64-1","鉄筋腐食抑制型シラン系表面含浸材「アクアシール1400AR」","KK-230014-A","事後評価未実施技術","○","令和7年10月","シラン系","シラン系評価基準評価基準","○","○","○","○","○","○","○","-","○","-","○","","","","","○","○","○",{"$f":"HLOOKUP($C53,DB!$1:$1048576,9,0)","v":"-"},"A",2,{"$f":"VLOOKUP(AD53,条件!D:E,2,0)","v":1},"2023","0014",1,"1",{"$f":"VLOOKUP(LEFT(E53,2),条件!A:B,2,0)","v":"05"},212023001410105,30]
[{"$f":"IF(検索!$U$1=\"条件検索\", IF(U54=\"○\", COUNTIFS(U:U,\"○\",AM:AM,\"<\"&AM54)+1, \"-\"), IF(検索!$U$1=\"技術名検索\", IF(検索!$B$30=E54, AM54, \"-\"), \"-\"))","v":29},51,"65-1","シラン系けい酸リチウムハイブリット型表面含侵材ドライプロテクト","HK-230010-A","事後評価未実施技術","○","令和7年10月","その他表面保護材","その他表面保護材評価基準","○","○","○","○","○","○","○","-","○","-","○","","","","","○","○","○",{"$f":"HLOOKUP($C54,DB!$1:$1048576,9,0)","v":"-"},"A",2,{"$f":"VLOOKUP(AD54,条件!D:E,2,0)","v":1},"2023","0010",1,"1",{"$f":"VLOOKUP(LEFT(E54,2),条件!A:B,2,0)","v":10},{"$f":"(AE54&AF54&AG54&AH54&AI54&TEXT(AJ54,\"00\")&AK54)*1","v":212023001010110},29]
[{"$f":"IF(検索!$U$1=\"条件検索\", IF(U55=\"○\", COUNTIFS(U:U,\"○\",AM:AM,\"<\"&AM55)+1, \"-\"), IF(検索!$U$1=\"技術名検索\", IF(検索!$B$30=E55, AM55, \"-\"), \"-\"))","v":31},52,"66-1","Protec No.1 高分子系コンクリート劣化防止剤","KT-230139-A","事後評価未実施技術","○","令和7年10月","その他表面保護材","その他表面保護材評価基準","△","△","△","△","○","-","○","-","○","-","○","","","","","○","○","○",{"$f":"HLOOKUP($C55,DB!$1:$1048576,9,0)","v":"-"},"A",2,{"$f":"VLOOKUP(AD55,条件!D:E,2,0)","v":1},"2023","0139",1,"1",{"$f":"VLOOKUP(LEFT(E55,2),条件!A:B,2,0)","v":"08"},212023013910108,31]
[{"$f":"IF(検索!$U$1=\"条件検索\", IF(U56=\"○\", COUNTIFS(U:U,\"○\",AM:AM,\"<\"&AM56)+1, \"-\"), IF(検索!$U$1=\"技術名検索\", IF(検索!$B$30=E56, AM56, \"-\"), \"-\"))","v":32},53,"67-1","高機能表面含浸材　Jシールド","KT-230268-A","事後評価未実施技術","○","令和7年12月","シラン系","シラン系評価基準評価基準","○","○","○","○","○","-","○","-","○","-","○","","","","","○","○","○",{"$f":"HLOOKUP($C56,DB!$1:$1048576,9,0)","v":"-"},"A",2,{"$f":"VLOOKUP(AD56,条件!D:E,2,0)","v":1},"2023","0268",1,"1",{"$f":"VLOOKUP(LEFT(E56,2),条件!A:B,2,0)","v":"08"},212023026810108,32]

{"sheet":"条件","index":6,"n_rows":51,"n_cols":9,"rows_kept":51,"cut":false,"hidden":false,"merged":[]}
[null,null,null,null,null,"検索用",null,null,"※技術名に仕様が追記されているので、調整すること"]
["QS","01",null,"VR",1,null,"CB-090033-VG","コンクリート表面保護材「パーミエイトHS-300」",{"$f":"IF(LEN(G2)-LEN(SUBSTITUTE(G2,\"-\",\"\"))>=2,LEFT(G2,FIND(\"-\",G2,FIND(\"-\",G2)+1)-1),G2)","v":"CB-090033"}]
["QSK","01",null,"VE",1,null,"KT-090067-VG","高浸透性コンクリート改質剤 【リバコン・リキッド】",{"$f":"IF(LEN(G3)-LEN(SUBSTITUTE(G3,\"-\",\"\"))>=2,LEFT(G3,FIND(\"-\",G3,FIND(\"-\",G3)+1)-1),G3)","v":"KT-090067"}]
["OK","02",null,"AE",1,null,"QS-100008-VG","ニュースパンガード","QS-100008"]
["SK","03",null,"A",1,null,"KK-100013-VG","RCGインナーシリカ","KK-100013"]
["SKK","03",null,"VG",2,null,"KK-100025-VG","無機系コンクリート浸透改質材「リフレパセットD70」","KK-100025"]
["CG","04",null,null,null,null,"CG-120004-VG","浸透性吸水防止材「レジソークType1」","CG-120004"]
["CGK","04",null,null,null,null,"KK-120047-VG","含浸系表面保護材「プロテクトシルBH N」","KK-120047"]
["KK","05",null,null,null,null,"KT-130009-VG","シリケートガード","KT-130009"]
["KKK","05",null,null,null,null,"KT-130065-VG","無機質ケイ酸塩含浸コンクリート保護材 「ポルトガード・プレクサス」","KT-130065"]
["CB","06",null,null,null,null,"CB-150008-VR","コンクリート劣化防止工法 ファインクリスタルS&TOP","CB-150008"]
["CBK","06",null,null,null,null,"QS-150019-VE","けい酸塩系コンクリート含浸材「SUPER SHIELD」","QS-150019"]
["HR","07",null,null,null,null,"SK-160004-VR","コンクリート改質・劣化防止剤 「カルサプリ」、「リアクトライズ」（リアクトライズ単独使用時）","SK-160004"]
["HRK","07",null,null,null,null,"CG-160013-VE","けい酸塩系表面含浸材CS-21ネオ","CG-160013"]
["KT","08",null,null,null,null,"QS-160027-VR","コンクリート劣化抑制表面含浸工 ジルコンパーミエイト","QS-160027"]
["KTK","08",null,null,null,null,"KT-160039-VR","ザイペックス・液体タイプ 塗布・吹付工法","KT-160039"]
["TH","09",null,null,null,null,"KT-160122-VR","Sクリート工法","KT-160122"]
["THK","09",null,null,null,null,"CG-170009-A","2液混合型けい酸塩系表面含浸材CS-21ビルダー","CG-170009"]
["HK",10,null,null,null,null,"TS-030006-VG","浸透性吸水防止材「マジカルリペラー」「マジカルリペラーHV」","TS-030006"]
["HKK",10,null,null,null,null,"CB-020055-VG","コンクリート改質剤CS-21","CB-020055"]
["TS",11,null,null,null,null,"KT-060075-VG","コンクリート浸透性改質材[RCガーデックス]（製品仕様：防水用、養生用、塩害用、タイル外壁用、CV（土木構造物向け））","KT-060075"]
[null,null,null,null,null,null,"HR-060004-VG","鉄筋腐食抑制工法 「プロテクトシル CIT」","HR-060004"]
[null,null,null,null,null,null,"QS-000011-VG","ザイペックス工法","QS-000011"]
[null,null,null,null,null,null,"QS-040013-VG","マクサム工法","QS-040013"]
[null,null,null,null,null,null,"KT-060094-VG","高粘性浸透性吸水防止材","KT-060094"]
[null,null,null,null,null,null,"HK-070015-VG","ケイ酸質リチウム系コンクリート改質剤「L-OSMO反応型SG」","HK-070015"]
[null,null,null,null,null,null,"KT-070047-VG","無溶剤タイプジェル状シラン系表面含浸材","KT-070047"]
[null,null,null,null,null,null,"KT-080005-VG","珪酸塩系含浸コンクリート保護材","KT-080005"]
[null,null,null,null,null,null,"KT-080018-VG","省力施工型コンクリート改質・劣化防止剤「リアル・メンテ」","KT-080018"]
[null,null,null,null,null,null,"KT-180004-A","シラン系含浸材とシラン・シロキサン系表面塗布材を併用した、コンクリート表面処理材","KT-180004"]
[null,null,null,null,null,null,"KT-180024-A","けい酸リチウム系混合型表面含浸材「RCガードCE TYPE-Li」","KT-180024"]
[null,null,null,null,null,null,"QS-180010-A","高性能シラン系含浸工法 「エルシーセイバー工法(RSⅡ)」 ","QS-180010"]
[null,null,null,null,null,null,"CB-180026-A","けい酸カリウムを主成分としたけい酸塩系表面含浸材(シリカリ)","CB-180026"]
[null,null,null,null,null,null,"KT-180083-A","けい酸塩系含浸コンクリート防水保護材「エバープロロング」","KT-180083"]
[null,null,null,null,null,null,"KT-180101-A","カルシウム付与剤併用型表面含浸工法「プラスCa」","KT-180101"]
[null,null,null,null,null,null,"CB-190016-VE","ポルトグラスⅡ工法","CB-190016"]
[null,null,null,null,null,null,"CB-190021-VE","シラン系とケイ酸塩系の特長を併せ持つハイブリッド型表面含浸材(サンハイドロックL2)","CB-190021"]
[null,null,null,null,null,null,"CG-190024-A","亜硝酸リチウム併用型表面含浸工法 「プロコンガードシステムS」","CG-190024"]
[null,null,null,null,null,null,"KT-190081-A","セラグリーンNK","KT-190081"]
[null,null,null,null,null,null,"KT-190107-VE","施工省力化けい酸塩系表面含浸材RCガーデックス土木用","KT-190107"]
[null,null,null,null,null,null,"SK-200001-VR","撥水作用を付与したオールインワンのコンクリート表面含浸剤","SK-200001"]
[null,null,null,null,null,null,"CB-200002-A","IZW.Shield（塗布後の養生時間が2時間のシラン系表面含浸材）","CB-200002"]
[null,null,null,null,null,null,"OK-200001-A","ケイ酸塩系表面浸透材 エバークリート ベトロフルード","OK-200001"]
[null,null,null,null,null,null,"TH-200005-A","けい酸塩系表面含浸材を塗布した表面被覆材を用いた表面処理工法《インフララップ》","TH-200005"]
[null,null,null,null,null,null,"KK-220004-A","シラン・シロキサン系複合超高濃度含浸材を用いた親水性工法","KK-220004"]
[null,null,null,null,null,null,"KT-220204-A","含浸系吸水防止材「ペネトラントシラン」","KT-220204"]
[null,null,null,null,null,null,"KT-220245-A","ナノシリカ系表面含浸材　コンクリートリバイブ　CPT-2000","KT-220245"]
[null,null,null,null,null,null,"KK-230014-A","鉄筋腐食抑制型シラン系表面含浸材「アクアシール1400AR」","KK-230014"]
[null,null,null,null,null,null,"HK-230010-A","シラン系けい酸リチウムハイブリット型表面含侵材ドライプロテクト","HK-230010"]
[null,null,null,null,null,null,"KT-230139-A","Protec No.1 高分子系コンクリート劣化防止剤","KT-230139"]
[null,null,null,null,null,null,"KT-230268-A","高機能表面含浸材　Jシールド","KT-230268"]

{"sheet":"同意書","index":7,"n_rows":22,"n_cols":3,"rows_kept":22,"cut":false,"hidden":false,"merged":[[3,2,3,18],[4,2,4,18],[5,2,5,18]]}
[]
[null,"工法比較表データベース借用同意書"]
[]
[null,"業務名・工事名"]
[null,"会社名"]
[null,"氏名"]
[]
[]
[]
[null,"借用者は、工法比較法データベース（以下「DB」と称する）を九州技術事務所から借用する場合に際し、以下の事項を遵守することを同意いたします。 "]
[null,"（使用目的）","1).借用者は、DBを借用申請書に記載された業務・工事にのみ使用します。なお、DBのリバースエンジニアリング、配布及び公衆送信等はいかなる目的においても行いません。"]
[null,"（使用範囲)","2).DBの使用は、九州地方整備局管内の業務・工事における関係者に限定します。"]
[null,"（データの複製）","3).借用者は、九州技術事務所から借用したデータの複製は行いません。"]
[null,"（権利関係）","4).DB及びDBを利用したものに係わる権利は、いずれも借用者に帰属しないことを確認します。"]
[null,"（守秘義務）","5).借用者は、DBによって知り得た情報を他に漏らしません。"]
[null,"（免責事項）","6).借用者は、DBの使用によって損害及び紛争等が生じても、九州技術事務所が一切責任を負わないことに同意します。 "]
[null,"（同意内容の変更）","7).借用者は、この同意書の内容に変更が生じた場合、その変更が生じた日から２週間以内に九州技術事務所（qsr-kyugi-netis@ki.mlit.go.jp）へ報告します。"]
[null,"（利用実態調査の記入）","8).借用者は、利用実態調査を正確かつ誠実に記入し、利用期限内に提出することを同意します。"]
[null,"（協議事項）","9).借用者は、本同意書に定めのない事項及び本同意書に関して疑義が生じた事項に関しては、九州技術事務所（qsr-kyugi-netis@ki.mlit.go.jp）と協議します。  "]
[]
[]
[null,"同意"]