{"text_format":"1","workbook":"xlsx","n_sheets":8,"sheets":["検索","更新履歴","詳細版","簡易版","DB","仕様の整理","条件","同意書"],"not_rendered":{"charts":0,"images":32,"macros":1,"external_links":0,"defined_names":12,"comments":0,"pivot_tables":0},"unopened":[],"bounds":{"document_bytes":16777216,"sheet_cells":100000,"rows_first":2000,"rows_last":500,"rows_between":2000,"halvings":0,"cell_chars":16384,"cell_head_chars":4096},"cells_cut":0,"cells_raw":0,"read":"whole","date_system":"1900"}

{"sheet":"検索","index":0,"n_rows":28,"n_cols":21,"rows_kept":28,"cut":false,"hidden":false,"merged":[[29,1,29,3],[29,6,29,12],[3,13,3,14]]}
[null,null,null,null,null,null,null,null,null,null,null,null,"ver.",4.8499999999999996,null,"借用同意書：",null,"問い合わせ先："," kouhouhikakuhyou-db@kyugikyo.or.jp",null,"条件検索"]
[null,null,null,null,null,null,null,null,null,null,null,null,null,null,null,"ご利用期間：","2026-02-10","～",{"$f":"IF(Q2=\"\",\"\",EOMONTH(Q2, 0))","v":"2026-02-28"}]
[null,null,null,null,null,null,null,null,null,null,null,null,null,null,null,{"$f":"仕様の整理!F1","v":"29技術44仕様"},{"$f":"仕様の整理!H1","v":"29技術44仕様"},{"$f":"\"検索結果：全\"&$P$3&\"仕様の内、\"&$Q$3&\"が検索されました。\"","v":"検索結果：全29技術44仕様仕様の内、29技術44仕様が検索されました。"},{"$f":"\"修復規模：\"&_xlfn.TEXTJOIN(\",\",,T6,T7,T8,T9)&\"／劣化機構：\"&_xlfn.TEXTJOIN(\",\",,T10,T11,T12,T13)&\"／現場で必要とされる性能：\"&_xlfn.TEXTJOIN(\",\",,T14,T15,T16,T17)&\"／施工の方向：\"&_xlfn.TEXTJOIN(\",\",,T18,T19,T20,T21)","v":"修復規模：／劣化機構：／現場で必要とされる性能：／施工の方向："}]
["本システムは、毎月NETIS情報を確認し、追加があれば更新していきますので、最新版を入手してお使いください。",null,null,null,null,null,null,null,null,null,null,null,null,"令和8年1月現在",null,null,null,null,{"$f":"\"工法比較表検索結果[\"&$P$3&\"の内、\"&$Q$3&\"]\"","v":"工法比較表検索結果[29技術44仕様の内、29技術44仕様]"}]
[]
[null,null,null,null,null,null,null,null,null,null,null,null,null,null,null,null,"修復規模","特に指定しない",false,{"$f":"IF(S6=TRUE,R6,\"\")","v":""}]
[null,null,null,null,null,null,null,null,null,null,null,null,null,null,null,null,null,"小規模",false,{"$f":"IF(S7=TRUE,R7,\"\")","v":""}]
[null,null,null,null,null,null,null,null,null,null,null,null,null,null,null,null,null,"中規模",false,""]
[null,null,null,null,null,null,null,null,null,null,null,null,null,null,null,null,null,"大規模",false,""]
[null,null,null,null,null,null,null,null,null,null,null,null,null,null,null,null,"劣化機構","特に指定しない",false,""]
[null,null,null,null,null,null,null,null,null,null,null,null,null,null,null,null,null,"中性化",false,""]
[null,null,null,null,null,null,null,null,null,null,null,null,null,null,null,null,null,"塩害",false,""]
[null,null,null,null,null,null,null,null,null,null,null,null,null,null,null,null,null,"凍害",false,""]
[null,null,null,null,null,null,null,null,null,null,null,null,null,null,null,null,"現場","特に指定しない",false,""]
[null,null,null,null,null,null,null,null,null,null,null,null,null,null,null,null,null,"防錆化",false,""]
[null,null,null,null,null,null,null,null,null,null,null,null,null,null,null,null,null,"速乾性",false,""]
[null,null,null,null,null,null,null,null,null,null,null,null,null,null,null,null,null,"その他",false,""]
[null,null,null,null,null,null,null,null,null,null,null,null,null,null,null,null,"施工の方法","特に指定しない",false,""]
[null,null,null,null,null,null,null,null,null,null,null,null,null,null,null,null,null,"上向き施工",false,""]
[null,null,null,null,null,null,null,null,null,null,null,null,null,null,null,null,null,"横向き施工",false,""]
[null,null,null,null,null,null,null,null,null,null,null,null,null,null,null,null,null,"下向き施工",false,""]
[]
[]
[]
[]
[]
[]
["新技術の検索"]

{"sheet":"更新履歴","index":1,"n_rows":298,"n_cols":2,"rows_kept":298,"cut":false,"hidden":false,"merged":[]}
[null,"■更新履歴"]
[null,"2016/04/01＜Ver1.00＞"]
[null,"・Ver1.00アップロード"]
[null,"2017/6/20\n＜Ver1.00からVer2.00への変更点について＞"]
[null,"・平成28年10月までにNETIS登録技術された3技術を追加し、「平成27年11月現在」を「平成28年10月現在」に変更しました。"]
[]
[null,"・各技術の工法比較表作成日及び、新技術の単価の年月及び地域を記載しました。"]
[null,"・NETIS掲載期間終了技術（有用な新技術、活用の多い技術）を工法比較表検索結果の後尾にNETIS登録番号を削除し、グレーの背景で掲載しました。"]
[null,"・NETIS掲載期間終了技術（有用な新技術、活用の多い技術以外）を3技術削除しました。"]
[]
[null,"2018/3/15\n＜Ver2.00からVer3.00への変更点について＞"]
[null,"・平成29年10月までにNETIS登録技術された2技術を追加し、「平成28年10月現在」を「平成29年10月現在」に変更しました。"]
[]
[null,"・NETIS掲載期間終了技術（有用な新技術、活用の多い技術以外）を2技術削除しました。"]
[]
[null,"2018/04/27\n＜Ver3.04＞"]
[null,"・ＮＥＴＩＳ登録状況を確認し3技術を新規登録しました（NETIS申請情報のみ）。"]
[]
[null,"2018/05/29\n＜Ver3.05＞"]
[null,"・ＮＥＴＩＳ登録状況を確認し1技術を新規登録しました（NETIS申請情報のみ）。"]
[]
[null,"2018/06/28\n＜Ver3.06＞"]
[null,"・新規登録は無し。"]
[]
[null,"2018/07/31\n＜Ver3.07＞"]
[null,"・新規登録は無し。"]
[]
[null,"2018/08/31\n＜Ver3.08＞"]
[null,"・新規登録は無し。"]
[]
[null,"2018/09/28\n＜Ver3.09＞"]
[null,"・新規登録は無し。"]
[]
[null,"2018/10/31\n＜Ver3.10＞"]
[null,"・新規登録は無し。"]
[]
[null,"2018/11/30\n＜Ver3.11＞"]
[null,"・新規登録は無し。"]
[]
[null,"2018/12/25\n＜Ver3.12＞"]
[null,"・ＮＥＴＩＳ登録状況を確認し2技術を新規登録しました（NETIS申請情報のみ）。"]
[]
[null,"2019/1/31\n＜Ver3.13＞"]
[null,"・NETIS掲載期間終了技術（有用な新技術、活用の多い技術以外）を3技術削除しました。"]
[]
[null,"2019/2/28\n＜Ver3.14＞"]
[null,"・新規登録は無し。"]
[]
[null,"2019/3/29\n＜Ver3.15＞"]
[null,"・新規登録は無し。"]
[]
[null,"2019/4/26\n＜Ver4.04＞"]
[null,"・NETIS登録状況を確認し1技術を新規登録しました（NETIS申請情報のみ）。"]
[]
[null,"2019/5/31\n＜Ver4.05＞"]
[null,"・新規登録は無し。"]
[]
[null,"2019/6/28\n＜Ver4.06＞"]
[null,"・新規登録は無し。"]
[]
[null,"2019/7/31\n＜Ver4.07＞"]
[null,"・NETIS登録状況を確認し1技術を新規登録しました（NETIS申請情報のみ）。"]
[]
[null,"2019/8/30\n＜Ver4.08＞"]
[null,"・新規登録は無し。"]
[]
[null,"2019/9/30\n＜Ver4.09＞"]
[null,"・新規登録は無し。"]
[]
[null,"2019/10/31\n＜Ver4.10＞"]
[null,"・新規登録は無し。"]
[]
[null,"2019/11/29\n＜Ver4.11＞"]
[null,"・新規登録は無し。"]
[]
[null,"2019/12/31\n＜Ver4.012＞"]
[null,"・NETIS登録状況を確認し1技術を新規登録しました（NETIS申請情報のみ）。"]
[]
[null,"2020/01/31\n＜Ver4.13＞"]
[null,"・新規登録は無し。"]
[]
[null,"2020/02/28\n＜Ver4.14＞"]
[null,"・新規登録は無し。"]
[]
[null,"2020/03/31\n＜Ver4.15＞"]
[null,"・新規登録は無し。"]
[]
[null,"2020/04/30\n＜Ver4.16＞"]
[null,"・新規登録は無し。"]
[]
[null,"2020/05/29\n＜Ver4.17＞"]
[null,"・新規登録は無し。"]
[]
[null,"2020/06/30\n＜Ver4.18＞"]
[null,"・新規登録は無し。"]
[]
[null,"2020/07/31\n＜Ver4.19＞"]
[null,"・新規登録は無し。"]
[]
[null,"2020/08/31\n＜Ver4.20＞"]
[null,"・新規登録は無し。"]
[]
[null,"2020/09/30\n＜Ver4.21＞"]
[null,"・新規登録は無し。"]
[]
[null,"2020/10/31\n＜Ver4.22＞"]
[null,"・新規登録は無し。"]
[]
[null,"2020/11/30\n＜Ver4.23＞"]
[null,"・新規登録は無し。"]
[]
[null,"2020/12/31\n＜Ver4.24＞"]
[null,"・新規登録は無し。"]
[]
[null,"2021/1/31\n＜Ver4.25＞"]
[null,"・NETIS登録状況を確認し1技術を新規登録しました（NETIS申請情報のみ）。"]
[]
[null,"2021/2/26\n＜Ver4.26＞"]
[null,"・新規登録は無し。"]
[]
[null,"2021/3/31\n＜Ver4.27＞"]
[null,"・新規登録は無し。"]
[]
[null,"2021/4/30\n＜Ver4.28＞"]
[null,"・新規登録は無し。"]
[]
[null,"2021/5/31\n＜Ver4.29＞"]
[null,"・新規登録は無し。"]
[]
[null,"2021/6/30\n＜Ver4.30＞"]
[null,"・新規登録は無し。"]
[]
[null,"2021/7/31\n＜Ver4.31＞"]
[null,"・新規登録は無し。"]
[]
[null,"2021/8/31\n＜Ver4.32＞"]
[null,"・新規登録は無し。"]
[]
[null,"2021/9/30\n＜Ver4.33＞"]
[null,"・新規登録は無し。"]
[]
[null,"2021/10/31\n＜Ver4.34＞"]
[null,"・新規登録は無し。"]
[]
[null,"2021/11/30\n＜Ver4.35＞"]
[null,"・新規登録は無し。"]
[]
[null,"2021/12/31\n＜Ver4.36＞"]
[null,"・新規登録は無し。"]
[]
[null,"2022/1/31\n＜Ver4.37＞"]
[null,"・新規登録は無し。"]
[]
[null,"2022/2/28\n＜Ver4.38＞"]
[null,"・新規登録は無し。"]
[]
[null,"2022/3/31\n＜Ver4.39＞"]
[null,"・新規登録は無し。"]
[]
[null,"2022/4/30\n＜Ver4.40＞"]
[null,"・新規登録は無し。"]
[]
[null,"2022/5/31\n＜Ver4.41＞"]
[null,"・NETIS登録状況を確認し1技術を新規登録しました（NETIS申請情報のみ）。"]
[]
[null,"2022/6/30\n＜Ver4.42＞"]
[null,"・新規登録は無し。"]
[]
[null,"2022/7/31\n＜Ver4.43＞"]
[null,"・新規登録は無し。"]
[]
[null,"2022/8/31\n＜Ver4.44＞"]
[null,"・新規登録は無し。"]
[]
[null,"2022/9/30\n＜Ver4.45＞"]
[null,"・新規登録は無し。"]
[]
[null,"2022/10/31\n＜Ver4.46＞"]
[null,"・新規登録は無し。"]
[]
[null,"2022/11/30\n＜Ver4.47＞"]
[null,"・新規登録は無し。"]
[]
[null,"2022/12/31\n＜Ver4.48＞"]
[null,"・NETIS登録状況を確認し2技術を新規登録しました（NETIS申請情報のみ）。"]
[]
[null,"2023/1/31\n＜Ver4.49＞"]
[null,"・新規登録は無し。"]
[]
[null,"2023/2/28\n＜Ver4.50＞"]
[null,"・新規登録は無し。"]
[]
[null,"2023/3/31\n＜Ver4.51＞"]
[null,"・NETIS登録状況を確認し1技術を新規登録しました（NETIS申請情報のみ）。"]
[]
[null,"2023/4/30\n＜Ver4.52＞"]
[null,"・新規登録は無し。"]
[]
[null,"2023/5/31\n＜Ver4.53＞"]
[null,"・新規登録は無し。"]
[]
[null,"2023/6/30\n＜Ver4.54＞"]
[null,"・新規登録は無し。"]
[]
[null,"2023/7/31\n＜Ver4.55＞"]
[null,"・新規登録は無し。"]
[]
[null,"2023/8/31\n＜Ver4.56＞"]
[null,"・新規登録は無し。"]
[]
[null,"2023/9/30\n＜Ver4.57＞"]
[null,"・NETIS登録状況を確認し1技術を新規登録しました（NETIS申請情報のみ）。"]
[]
[null,"2023/10/31\n＜Ver4.58＞"]
[null,"・新規登録は無し。"]
[]
[null,"2023/11/30\n＜Ver4.59＞"]
[null,"・新規登録は無し。"]
[]
[null,"2023/12/31\n＜Ver4.60＞"]
[null,"・NETIS登録状況を確認し1技術を新規登録しました（NETIS申請情報のみ）。"]
[]
[null,"2024/1/31\n＜Ver4.61＞"]
[null,"・新規登録は無し。"]
[]
[null,"2024/2/29\n＜Ver4.62＞"]
[null,"・NETIS登録状況を確認し1技術を新規登録しました（NETIS申請情報のみ）。"]
[]
[null,"2024/3/31\n＜Ver4.63＞"]
[null,"・NETIS登録状況を確認し1技術を新規登録しました（NETIS申請情報のみ）。"]
[]
[null,"2024/4/30\n＜Ver4.64＞"]
[null,"・新規登録は無し。"]
[]
[null,"2024/5/31\n＜Ver4.65＞"]
[null,"・NETIS登録状況を確認し1技術を新規登録しました（NETIS申請情報のみ）。"]
[]
[null,"2024/6/30\n＜Ver4.66＞"]
[null,"・NETIS登録状況を確認し1技術を新規登録しました（NETIS申請情報のみ）。"]
[]
[null,"2024/7/31\n＜Ver4.67＞"]
[null,"・NETIS登録状況を確認し1技術を新規登録しました（NETIS申請情報のみ）。"]
[]
[null,"2024/8/31\n＜Ver4.68＞"]
[null,"・新規登録は無し。"]
[]
[null,"2024/9/30\n＜Ver4.69＞"]
[null,"・新規登録は無し。"]
[]
[null,"2024/10/31\n＜Ver4.70＞"]
[null,"・NETIS登録状況を確認し1技術を新規登録しました（NETIS申請情報のみ）。"]
[]
[null,"2024/11/30\n＜Ver4.71＞"]
[null,"・新規登録は無し。"]
[null,"・施工費用および施工日数等を令和6年度の情報に更新"]
[]
[null,"2024/12/31\n＜Ver4.72＞"]
[null,"・新規登録は無し。"]
[]
[null,"2025/1/31\n＜Ver4.73＞"]
[null,"・新規登録は無し。"]
[]
[null,"2025/2/28\n＜Ver4.74＞"]
[null,"・新規登録は無し。"]
[]
[null,"2025/3/31\n＜Ver4.75＞"]
[null,"・新規登録は無し。"]
[]
[null,"2025/4/30\n＜Ver4.76＞"]
[null,"・新規登録は無し。"]
[]
[null,"2025/5/31\n＜Ver4.77＞"]
[null,"・NETIS登録状況を確認し1技術を新規登録しました（NETIS申請情報のみ）。"]
[]
[null,"2025/6/30\n＜Ver4.78＞"]
[null,"・新規登録は無し。"]
[]
[null,"2025/7/31\n＜Ver4.79＞"]
[null,"・新規登録は無し。"]
[]
[null,"2025/8/31\n＜Ver4.80＞"]
[null,"・新規登録は無し。"]
[]
[null,"2025/9/30\n＜Ver4.81＞"]
[null,"・新規登録は無し。"]
[]
[null,"2025/10/31\n＜Ver4.82＞"]
[null,"・NETIS登録状況を確認し3技術を新規登録しました（NETIS申請情報のみ）。"]
[]
[null,"2025/11/30\n＜Ver4.83＞"]
[null,"・新規登録は無し。"]
[null,"・施工費用および施工日数等を令和7年度の情報に更新"]
[]
[null,"2025/12/31\n＜Ver4.84＞"]
[null,"・新規登録は無し。"]
[]
[null,"2026/1/31＜Ver4.85＞"]
[null,"・新規登録は無し。"]

{"sheet":"詳細版","index":2,"n_rows":83,"n_cols":5,"rows_kept":83,"cut":false,"hidden":false,"merged":[[45,2,45,3],[45,6,45,7],[46,1,51,1],[46,2,47,3],[46,6,46,7],[47,6,47,7],[48,2,51,3],[48,5,48,7],[79,140,79,142],[80,140,80,142],[81,140,81,142],[45,141,45,142],[46,141,46,142],[47,141,47,142],[48,140,48,142],[49,140,49,142],[50,140,50,142],[51,140,51,142],[69,140,69,142],[70,140,70,142],[71,140,71,142],[72,140,72,142],[73,140,73,142],[74,140,74,142],[75,140,75,142],[76,140,76,142],[77,140,77,142],[78,140,78,142],[49,5,49,7],[50,5,50,7],[81,5,81,7],[75,1,76,1],[30,140,41,140],[30,141,30,142],[31,141,31,142],[32,141,32,142],[33,141,33,142],[34,141,34,142],[35,141,35,142],[36,141,36,142],[37,141,37,142],[38,141,38,142],[39,141,39,142],[40,141,40,142],[41,141,41,142],[42,140,44,140],[42,141,42,142],[43,141,43,142],[44,141,44,142],[19,140,19,142],[20,140,20,142],[21,140,21,142],[22,140,22,142],[23,140,23,142],[24,140,24,142],[25,140,25,142],[26,140,26,142],[27,140,27,142],[28,140,28,142],[29,141,29,142],[30,8,41,8],[30,11,41,11],[30,14,41,14],[30,17,41,17],[30,20,41,20],[30,23,41,23],[30,26,41,26],[30,29,41,29],[30,32,41,32],[30,35,41,35],[30,38,41,38],[30,41,41,41],[30,44,41,44],[30,47,41,47],[30,50,41,50],[30,53,41,53],[30,56,41,56],[30,59,41,59],[30,62,41,62],[31,36,31,37],[31,39,31,40],[2,140,2,142],[3,140,3,142],[4,140,4,142],[5,140,5,142],[6,140,6,142],[7,140,7,142],[8,140,8,142],[9,140,9,142],[10,140,10,142],[11,140,11,142],[12,140,12,142],[13,140,13,142],[14,140,14,142],[15,140,15,142],[16,140,16,142],[17,140,17,142],[18,140,18,142],[3,0,3,4],[30,5,41,5],[22,5,22,7],[23,5,23,7],[24,5,24,7],[25,5,25,7],[26,5,26,7],[27,5,27,7],[18,3,18,4],[18,5,18,7],[19,2,19,4],[19,5,19,7],[20,0,27,0],[20,1,27,1],[20,2,20,3],[20,5,20,7],[21,2,27,3],[21,5,21,7],[15,3,15,4],[15,5,15,7],[16,3,16,4],[16,5,16,7],[17,3,17,4],[17,5,17,7],[4,0,19,0],[4,1,4,4],[4,5,4,7],[5,2,5,4],[5,5,5,7],[6,2,6,4],[6,5,6,7],[11,2,11,4],[11,5,11,7],[12,1,18,1],[12,2,18,2],[12,3,12,4],[12,5,12,7],[13,3,13,4],[13,5,13,7],[14,3,14,4],[14,5,14,7],[7,5,7,7],[8,2,8,4],[8,5,8,7],[9,2,9,4],[9,5,9,7],[10,2,10,4],[10,5,10,7],[7,2,7,4],[38,3,41,3],[38,6,38,7],[39,6,39,7],[40,6,40,7],[41,6,41,7],[42,1,44,1],[42,5,44,5],[42,6,42,7],[43,6,43,7],[44,6,44,7],[33,6,33,7],[34,3,37,3],[34,6,34,7],[35,6,35,7],[36,6,36,7],[37,6,37,7],[28,0,28,4],[28,5,28,7],[29,0,78,0],[29,6,29,7],[30,1,41,1],[30,2,41,2],[30,3,33,3],[30,6,30,7],[31,6,31,7],[32,6,32,7],[51,5,51,7],[52,1,69,1],[52,2,54,2],[52,3,52,4],[53,3,53,4],[54,3,54,4],[75,2,76,3],[75,5,75,7],[76,5,76,7],[77,2,77,4],[77,5,77,7],[69,5,69,7],[70,2,70,4],[70,5,70,7],[71,2,71,4],[71,5,71,7],[72,1,74,1],[72,2,74,3],[72,5,72,7],[73,5,73,7],[74,5,74,7],[62,3,64,3],[65,3,65,4],[66,3,66,4],[67,3,67,4],[68,3,68,4],[69,3,69,4],[55,2,69,2],[55,3,55,4],[56,3,56,4],[57,3,61,3],[2,35,2,37],[2,38,2,40],[2,41,2,43],[2,44,2,46],[2,47,2,49],[2,50,2,52],[2,17,2,19],[2,20,2,22],[2,23,2,25],[2,26,2,28],[2,29,2,31],[2,32,2,34],[2,5,2,7],[3,5,3,7],[2,8,2,10],[2,11,2,13],[2,14,2,16],[3,41,3,43],[3,44,3,46],[3,47,3,49],[3,50,3,52],[3,23,3,25],[3,26,3,28],[3,29,3,31],[3,32,3,34],[3,35,3,37],[3,38,3,40],[42,15,42,16],[47,9,47,10],[47,12,47,13],[47,15,47,16],[78,2,78,4],[78,5,78,7],[79,0,81,0],[79,2,79,4],[79,5,79,7],[80,2,80,4],[80,5,80,7],[81,2,81,4],[2,125,2,127],[2,128,2,130],[2,131,2,133],[2,134,2,136],[2,137,2,139],[3,8,3,10],[3,11,3,13],[3,14,3,16],[3,17,3,19],[3,20,3,22],[2,107,2,109],[2,110,2,112],[2,113,2,115],[2,116,2,118],[2,119,2,121],[2,122,2,124],[2,89,2,91],[2,92,2,94],[2,95,2,97],[2,98,2,100],[2,101,2,103],[2,104,2,106],[2,71,2,73],[2,74,2,76],[2,77,2,79],[2,80,2,82],[2,83,2,85],[2,86,2,88],[2,53,2,55],[2,56,2,58],[2,59,2,61],[2,62,2,64],[3,89,3,91],[3,92,3,94],[3,59,3,61],[3,62,3,64],[3,65,3,67],[3,68,3,70],[3,71,3,73],[3,74,3,76],[3,53,3,55],[3,56,3,58],[2,65,2,67],[2,68,2,70],[4,29,4,31],[4,32,4,34],[4,35,4,37],[4,38,4,40],[4,41,4,43],[4,44,4,46],[3,131,3,133],[3,134,3,136],[3,137,3,139],[4,8,4,10],[4,11,4,13],[4,14,4,16],[4,17,4,19],[4,20,4,22],[4,23,4,25],[4,26,4,28],[3,113,3,115],[3,116,3,118],[3,119,3,121],[3,122,3,124],[3,125,3,127],[3,128,3,130],[3,95,3,97],[3,98,3,100],[3,101,3,103],[3,104,3,106],[3,107,3,109],[3,110,3,112],[3,77,3,79],[3,80,3,82],[3,83,3,85],[3,86,3,88],[4,107,4,109],[4,110,4,112],[4,113,4,115],[4,116,4,118],[4,83,4,85],[4,86,4,88],[4,89,4,91],[4,92,4,94],[4,95,4,97],[4,98,4,100],[4,65,4,67],[4,68,4,70],[4,71,4,73],[4,74,4,76],[4,77,4,79],[4,80,4,82],[4,47,4,49],[4,50,4,52],[4,53,4,55],[4,56,4,58],[4,59,4,61],[4,62,4,64],[5,83,5,85],[5,86,5,88],[5,53,5,55],[5,56,5,58],[5,59,5,61],[5,62,5,64],[5,65,5,67],[5,68,5,70],[5,35,5,37],[5,38,5,40],[5,41,5,43],[5,44,5,46],[5,47,5,49],[5,50,5,52],[4,137,4,139],[5,8,5,10],[5,11,5,13],[5,14,5,16],[5,17,5,19],[5,20,5,22],[5,23,5,25],[5,26,5,28],[5,29,5,31],[5,32,5,34],[4,119,4,121],[4,122,4,124],[4,125,4,127],[4,128,4,130],[4,131,4,133],[4,134,4,136],[4,101,4,103],[4,104,4,106],[6,23,6,25],[6,26,6,28],[6,29,6,31],[6,32,6,34],[6,35,6,37],[6,38,6,40],[5,125,5,127],[5,128,5,130],[5,131,5,133],[5,134,5,136],[5,137,5,139],[6,8,6,10],[6,11,6,13],[6,14,6,16],[6,17,6,19],[6,20,6,22],[5,107,5,109],[5,110,5,112],[5,113,5,115],[5,116,5,118],[5,119,5,121],[5,122,5,124],[5,89,5,91],[5,92,5,94],[5,95,5,97],[5,98,5,100],[5,101,5,103],[5,104,5,106],[5,71,5,73],[5,74,5,76],[5,77,5,79],[5,80,5,82],[7,8,7,10],[7,11,7,13],[7,14,7,16],[7,17,7,19],[7,20,7,22],[7,23,7,25],[7,26,7,28],[6,113,6,115],[6,116,6,118],[6,119,6,121],[6,122,6,124],[6,125,6,127],[6,128,6,130],[6,95,6,97],[6,98,6,100],[6,101,6,103],[6,104,6,106],[6,107,6,109],[6,110,6,112],[6,77,6,79],[6,80,6,82],[6,83,6,85],[6,86,6,88],[6,89,6,91],[6,92,6,94],[6,59,6,61],[6,62,6,64],[6,65,6,67],[6,68,6,70],[6,71,6,73],[6,74,6,76],[6,41,6,43],[7,77,7,79],[7,80,7,82],[7,47,7,49],[7,50,7,52],[7,53,7,55],[7,56,7,58],[7,59,7,61],[7,62,7,64],[7,29,7,31],[7,32,7,34],[7,35,7,37],[7,38,7,40],[7,41,7,43],[7,44,7,46],[6,131,6,133],[6,134,6,136],[6,137,6,139],[6,44,6,46],[6,47,6,49],[6,50,6,52],[6,53,6,55],[6,56,6,58],[7,137,7,139],[8,8,8,10],[8,11,8,13],[8,14,8,16],[8,17,8,19],[8,20,8,22],[8,23,8,25],[8,26,8,28],[8,29,8,31],[8,32,8,34],[7,119,7,121],[7,122,7,124],[7,125,7,127],[7,128,7,130],[7,131,7,133],[7,134,7,136],[7,101,7,103],[7,104,7,106],[7,107,7,109],[7,110,7,112],[7,113,7,115],[7,116,7,118],[7,83,7,85],[7,86,7,88],[7,89,7,91],[7,92,7,94],[7,95,7,97],[7,98,7,100],[7,65,7,67],[7,68,7,70],[7,71,7,73],[7,74,7,76],[8,134,8,136],[8,137,8,139],[9,8,9,10],[9,11,9,13],[9,14,9,16],[9,17,9,19],[9,20,9,22],[8,107,8,109],[8,110,8,112],[8,113,8,115],[8,116,8,118],[8,119,8,121],[8,122,8,124],[8,89,8,91],[8,92,8,94],[8,95,8,97],[8,98,8,100],[8,101,8,103],[8,104,8,106],[8,71,8,73],[8,74,8,76],[8,77,8,79],[8,80,8,82],[8,83,8,85],[8,86,8,88],[8,53,8,55],[8,56,8,58],[8,59,8,61],[8,62,8,64],[8,65,8,67],[8,68,8,70],[8,35,8,37],[9,71,9,73],[9,74,9,76],[9,41,9,43],[9,44,9,46],[9,47,9,49],[9,50,9,52],[9,53,9,55],[9,56,9,58],[9,23,9,25],[9,26,9,28],[9,29,9,31],[9,32,9,34],[9,35,9,37],[9,38,9,40],[8,125,8,127],[8,128,8,130],[8,131,8,133],[8,38,8,40],[8,41,8,43],[8,44,8,46],[8,47,8,49],[8,50,8,52],[9,131,9,133],[9,134,9,136],[9,137,9,139],[10,8,10,10],[10,11,10,13],[10,14,10,16],[10,17,10,19],[10,20,10,22],[10,23,10,25],[10,26,10,28],[9,113,9,115],[9,116,9,118],[9,119,9,121],[9,122,9,124],[9,125,9,127],[9,128,9,130],[9,95,9,97],[9,98,9,100],[9,101,9,103],[9,104,9,106],[9,107,9,109],[9,110,9,112],[9,77,9,79],[9,80,9,82],[9,83,9,85],[9,86,9,88],[9,89,9,91],[9,92,9,94],[9,59,9,61],[9,62,9,64],[9,65,9,67],[9,68,9,70],[10,89,10,91],[10,92,10,94],[10,95,10,97],[10,98,10,100],[10,65,10,67],[10,68,10,70],[10,71,10,73],[10,74,10,76],[10,77,10,79],[10,80,10,82],[10,47,10,49],[10,50,10,52],[10,53,10,55],[10,56,10,58],[10,59,10,61],[10,62,10,64],[10,29,10,31],[10,32,10,34],[10,35,10,37],[10,38,10,40],[10,41,10,43],[10,44,10,46],[11,65,11,67],[11,68,11,70],[11,35,11,37],[11,38,11,40],[11,41,11,43],[11,44,11,46],[11,47,11,49],[11,50,11,52],[10,137,10,139],[11,8,11,10],[11,11,11,13],[11,14,11,16],[11,17,11,19],[11,20,11,22],[11,23,11,25],[11,26,11,28],[11,29,11,31],[11,32,11,34],[10,119,10,121],[10,122,10,124],[10,125,10,127],[10,128,10,130],[10,131,10,133],[10,134,10,136],[10,101,10,103],[10,104,10,106],[10,107,10,109],[10,110,10,112],[10,113,10,115],[10,116,10,118],[10,83,10,85],[10,86,10,88],[11,125,11,127],[11,128,11,130],[11,131,11,133],[11,134,11,136],[11,137,11,139],[12,8,12,10],[12,11,12,13],[12,14,12,16],[12,17,12,19],[12,20,12,22],[11,107,11,109],[11,110,11,112],[11,113,11,115],[11,116,11,118],[11,119,11,121],[11,122,11,124],[11,89,11,91],[11,92,11,94],[11,95,11,97],[11,98,11,100],[11,101,11,103],[11,104,11,106],[11,71,11,73],[11,74,11,76],[11,77,11,79],[11,80,11,82],[11,83,11,85],[11,86,11,88],[11,53,11,55],[11,56,11,58],[11,59,11,61],[11,62,11,64],[12,89,12,91],[12,92,12,94],[12,59,12,61],[12,62,12,64],[12,65,12,67],[12,68,12,70],[12,71,12,73],[12,74,12,76],[12,41,12,43],[12,44,12,46],[12,47,12,49],[12,50,12,52],[12,53,12,55],[12,56,12,58],[12,23,12,25],[12,26,12,28],[12,29,12,31],[12,32,12,34],[12,35,12,37],[12,38,12,40],[13,29,13,31],[13,32,13,34],[13,35,13,37],[13,38,13,40],[13,41,13,43],[13,44,13,46],[12,131,12,133],[12,134,12,136],[12,137,12,139],[13,8,13,10],[13,11,13,13],[13,14,13,16],[13,17,13,19],[13,20,13,22],[13,23,13,25],[13,26,13,28],[12,113,12,115],[12,116,12,118],[12,119,12,121],[12,122,12,124],[12,125,12,127],[12,128,12,130],[12,95,12,97],[12,98,12,100],[12,101,12,103],[12,104,12,106],[12,107,12,109],[12,110,12,112],[12,77,12,79],[12,80,12,82],[12,83,12,85],[12,86,12,88],[13,107,13,109],[13,110,13,112],[13,113,13,115],[13,116,13,118],[13,83,13,85],[13,86,13,88],[13,89,13,91],[13,92,13,94],[13,95,13,97],[13,98,13,100],[13,65,13,67],[13,68,13,70],[13,71,13,73],[13,74,13,76],[13,77,13,79],[13,80,13,82],[13,47,13,49],[13,50,13,52],[13,53,13,55],[13,56,13,58],[13,59,13,61],[13,62,13,64],[14,83,14,85],[14,86,14,88],[14,53,14,55],[14,56,14,58],[14,59,14,61],[14,62,14,64],[14,65,14,67],[14,68,14,70],[14,35,14,37],[14,38,14,40],[14,41,14,43],[14,44,14,46],[14,47,14,49],[14,50,14,52],[13,137,13,139],[14,8,14,10],[14,11,14,13],[14,14,14,16],[14,17,14,19],[14,20,14,22],[14,23,14,25],[14,26,14,28],[14,29,14,31],[14,32,14,34],[13,119,13,121],[13,122,13,124],[13,125,13,127],[13,128,13,130],[13,131,13,133],[13,134,13,136],[13,101,13,103],[13,104,13,106],[15,23,15,25],[15,26,15,28],[15,29,15,31],[15,32,15,34],[15,35,15,37],[15,38,15,40],[14,125,14,127],[14,128,14,130],[14,131,14,133],[14,134,14,136],[14,137,14,139],[15,8,15,10],[15,11,15,13],[15,14,15,16],[15,17,15,19],[15,20,15,22],[14,107,14,109],[14,110,14,112],[14,113,14,115],[14,116,14,118],[14,119,14,121],[14,122,14,124],[14,89,14,91],[14,92,14,94],[14,95,14,97],[14,98,14,100],[14,101,14,103],[14,104,14,106],[14,71,14,73],[14,74,14,76],[14,77,14,79],[14,80,14,82],[16,8,16,10],[16,11,16,13],[16,14,16,16],[16,17,16,19],[16,20,16,22],[16,23,16,25],[16,26,16,28],[15,113,15,115],[15,116,15,118],[15,119,15,121],[15,122,15,124],[15,125,15,127],[15,128,15,130],[15,95,15,97],[15,98,15,100],[15,101,15,103],[15,104,15,106],[15,107,15,109],[15,110,15,112],[15,77,15,79],[15,80,15,82],[15,83,15,85],[15,86,15,88],[15,89,15,91],[15,92,15,94],[15,59,15,61],[15,62,15,64],[15,65,15,67],[15,68,15,70],[15,71,15,73],[15,74,15,76],[15,41,15,43],[16,77,16,79],[16,80,16,82],[16,47,16,49],[16,50,16,52],[16,53,16,55],[16,56,16,58],[16,59,16,61],[16,62,16,64],[16,29,16,31],[16,32,16,34],[16,35,16,37],[16,38,16,40],[16,41,16,43],[16,44,16,46],[15,131,15,133],[15,134,15,136],[15,137,15,139],[15,44,15,46],[15,47,15,49],[15,50,15,52],[15,53,15,55],[15,56,15,58],[16,137,16,139],[17,8,17,10],[17,11,17,13],[17,14,17,16],[17,17,17,19],[17,20,17,22],[17,23,17,25],[17,26,17,28],[17,29,17,31],[17,32,17,34],[16,119,16,121],[16,122,16,124],[16,125,16,127],[16,128,16,130],[16,131,16,133],[16,134,16,136],[16,101,16,103],[16,104,16,106],[16,107,16,109],[16,110,16,112],[16,113,16,115],[16,116,16,118],[16,83,16,85],[16,86,16,88],[16,89,16,91],[16,92,16,94],[16,95,16,97],[16,98,16,100],[16,65,16,67],[16,68,16,70],[16,71,16,73],[16,74,16,76],[17,134,17,136],[17,137,17,139],[18,8,18,10],[18,11,18,13],[18,14,18,16],[18,17,18,19],[18,20,18,22],[17,107,17,109],[17,110,17,112],[17,113,17,115],[17,116,17,118],[17,119,17,121],[17,122,17,124],[17,89,17,91],[17,92,17,94],[17,95,17,97],[17,98,17,100],[17,101,17,103],[17,104,17,106],[17,71,17,73],[17,74,17,76],[17,77,17,79],[17,80,17,82],[17,83,17,85],[17,86,17,88],[17,53,17,55],[17,56,17,58],[17,59,17,61],[17,62,17,64],[17,65,17,67],[17,68,17,70],[17,35,17,37],[18,71,18,73],[18,74,18,76],[18,41,18,43],[18,44,18,46],[18,47,18,49],[18,50,18,52],[18,53,18,55],[18,56,18,58],[18,23,18,25],[18,26,18,28],[18,29,18,31],[18,32,18,34],[18,35,18,37],[18,38,18,40],[17,125,17,127],[17,128,17,130],[17,131,17,133],[17,38,17,40],[17,41,17,43],[17,44,17,46],[17,47,17,49],[17,50,17,52],[18,131,18,133],[18,134,18,136],[18,137,18,139],[19,8,19,10],[19,11,19,13],[19,14,19,16],[19,17,19,19],[19,20,19,22],[19,23,19,25],[19,26,19,28],[18,113,18,115],[18,116,18,118],[18,119,18,121],[18,122,18,124],[18,125,18,127],[18,128,18,130],[18,95,18,97],[18,98,18,100],[18,101,18,103],[18,104,18,106],[18,107,18,109],[18,110,18,112],[18,77,18,79],[18,80,18,82],[18,83,18,85],[18,86,18,88],[18,89,18,91],[18,92,18,94],[18,59,18,61],[18,62,18,64],[18,65,18,67],[18,68,18,70],[19,89,19,91],[19,92,19,94],[19,95,19,97],[19,98,19,100],[19,65,19,67],[19,68,19,70],[19,71,19,73],[19,74,19,76],[19,77,19,79],[19,80,19,82],[19,47,19,49],[19,50,19,52],[19,53,19,55],[19,56,19,58],[19,59,19,61],[19,62,19,64],[19,29,19,31],[19,32,19,34],[19,35,19,37],[19,38,19,40],[19,41,19,43],[19,44,19,46],[20,65,20,67],[20,68,20,70],[20,35,20,37],[20,38,20,40],[20,41,20,43]],"merged_total":3053,"flags":["merged_cut"]}
[]
["コンクリート構造物補修工（断面修復工法）"]
[{"$f":"検索!S4","v":"工法比較表検索結果[29技術44仕様の内、29技術44仕様]"}]
[]
["ＮＥＴＩＳ情報","技術名"]
[null,"①","ＮＥＴＩＳ登録番号"]
[null,"②","技術の位置付け（有用な新技術）"]
[null,"③","開発者（本社が存在する都道府県）"]
[null,"④","開発者における九州地方との関連性（九州登録九州本社：◎、九州外登録九州本社：○、九州に共同開発者有り：△、その他：－）"]
[null,"⑤","九州地方への機能性（九州地方に支店等を有する場合：○、その他：－）"]
[null,"⑥","技術概要"]
[null,"⑦","概要図"]
[null,"⑧","施工条件・適用条件等","施工方法"]
[null,null,null,"補修材料"]
[null,null,null,"適用範囲"]
[null,null,null,"1回あたりの施工厚さ"]
[null,null,null,"施工中の気温"]
[null,null,null,"施工中の水分"]
[null,null,null,"作業空間"]
[null,"⑨","比較する従来技術"]
["評価情報 ","⑩","評価基準",null,"項目"]
[null,null,"・A：従来技術より極めて優れる\n・B：従来技術より優れる\n・C：従来技術と同等\n・D：従来技術より劣る",null,"経済性"]
[null,null,null,null,"工程"]
[null,null,null,null,"品質・出来形"]
[null,null,null,null,"安全性"]
[null,null,null,null,"施工性"]
[null,null,null,null,"環境"]
[null,null,null,null,"総合評価"]
["統一した従来技術"]
[null,null,null,"施工する方向"]
[null,"⑪","概算施工費用\n注1）","上向き施工","断面修復厚"]
[null,null,null,null,"施工費"]
[null,null,null,null,"材料費"]
[null,null,null,null,"合計"]
[null,null,null,"横向き施工","断面修復厚"]
[null,null,null,null,"施工費"]
[null,null,null,null,"材料費"]
[null,null,null,null,"合計"]
[null,null,null,"下向き施工","断面修復厚"]
[null,null,null,null,"施工費"]
[null,null,null,null,"材料費"]
[null,null,null,null,"合計"]
[null,"⑫","概算施工日数","上向き施工"]
[null,null,null,"横向き施工"]
[null,null,null,"下向き施工"]
[null,null,null,null,"備考"]
[null,"⑬","統一した従来技術との比較",null,"経済性"]
[null,null,null,null,"工程"]
[null,null,"判定の凡例 \n  ○：従来技術より優れる\n  △：従来技術と同程度\n  －：上記以外",null,"品質・出来形"]
[null,null,null,null,"安全性"]
[null,null,null,null,"施工性"]
[null,null,null,null,"環境"]
[null,"⑭","試験項目","断面修復材料"]
[null,null,null,"施工方法"]
[null,null,null,"試験規格"]
[null,null,"補修材料の性能","フロー"]
[null,null,null,"硬化時間（時間）"]
[null,null,null,"圧縮強度\n（N/mm2）","材齢3ｈ"]
[null,null,null,null,"材齢1ｄ"]
[null,null,null,null,"材齢7ｄ"]
[null,null,null,null,"材齢28ｄ"]
[null,null,null,null,"その他"]
[null,null,null,"付着強度\n（N/mm2）","標準"]
[null,null,null,null,"温冷繰返し"]
[null,null,null,null,"その他"]
[null,null,null,"弾性係数（kN/mm2）"]
[null,null,null,"引張強度（N/mm2）"]
[null,null,null,"収縮率（×10^-6）"]
[null,null,null,"熱膨張率（×10^-6/℃）"]
[null,null,null,"その他の試験"]
[null,"⑮","実施している性能評価試験"]
[null,"⑯","耐用年数"]
[null,"⑰","施工実績\n（過去３年）",null,"国土交通省：活用効果調査表数"]
[null,null,null,null,"地方自治体：開発者ヒアリング"]
[null,null,null,null,"その他：開発者ヒアリング"]
[null,"⑱","特許等",null,"特許"]
[null,null,null,null,"建設技術審査証明"]
[null,"⑲","生産供給体制（機械保有台数等）"]
[null,"⑳","備考"]
["総括","㉑","耐久性"]
[null,"㉒","施工性\n(留意事項含む）"]
[null,"㉓","その他（留意事項含む）"]
["注1）施工費用：2025年4月福岡県久留米市 注2）「土木学会コンクリートライブラリー119　表面保護工法　設計施工指針（案）［工種別マニュアル編］、p199、解説表2.3.1.1　セメントモルタルの性能例、p202、解説表2.3.2.1　ポリマーセメントモルタルの性能例」 注3）／：補完調査未実施"]

{"sheet":"簡易版","index":3,"n_rows":6,"n_cols":32,"rows_kept":6,"cut":false,"hidden":false,"merged":[[4,25,4,30],[4,31,5,31],[4,3,5,3],[4,4,5,4],[4,5,5,5],[4,6,5,6],[4,7,4,8],[4,9,4,18],[4,19,4,20],[4,21,4,22],[4,23,4,24]]}
[null,null,null,"コンクリート構造物補修工（断面修復工法）"]
[null,null,null,{"$f":"検索!S4","v":"工法比較表検索結果[29技術44仕様の内、29技術44仕様]"}]
[]
[]
[null,null,null,"番号","技術名","NETIS番号","開発者","施工条件・適用条件等",null,"補修材料の性能",null,null,null,null,null,null,null,null,null,"上向き",null,"横向き",null,"下向き",null,"統一した従来技術との比較",null,null,null,null,null,"概要"]
[null,null,null,null,null,null,null,"施工方法","補修材料","断面修復材料","施工方法","フロー","硬化時間\n（時間）","圧縮強度（N/mm2）\n材齢28ｄ","付着強度（N/mm2）\n標準","弾性係数\n（ｋN/mm2)","引張強度\n（N/mm2)","収縮率\n（×10＾-6）","熱膨張率\n（×10＾-6/℃）","対象体積当り\n概算施工費","対象体積当り\n概算施工日数","対象体積当り\n概算施工費","対象体積当り\n概算施工日数","対象体積当り\n概算施工費","対象体積当り\n概算施工日数","経済性","工程","品質・出来形","安全性","施工性","環境"]

{"sheet":"DB","index":4,"n_rows":146,"n_cols":137,"rows_kept":146,"cut":false,"hidden":false,"merged":[[79,5,79,7],[80,5,80,7],[81,5,81,7],[70,5,70,7],[71,5,71,7],[72,5,72,7],[73,5,73,7],[74,5,74,7],[75,5,75,7],[76,5,76,7],[77,5,77,7],[78,5,78,7],[30,5,41,5],[32,6,32,7],[33,6,33,7],[34,6,34,7],[22,5,22,7],[15,5,15,7],[16,5,16,7],[17,5,17,7],[18,5,18,7],[19,5,19,7],[20,5,20,7],[21,5,21,7],[23,5,23,7],[52,3,52,4],[54,3,54,4],[52,2,54,2],[19,2,19,4],[18,3,18,4],[17,3,17,4],[28,0,28,4],[21,2,27,3],[4,0,19,0],[4,1,4,4],[5,2,5,4],[6,2,6,4],[12,1,18,1],[24,5,24,7],[25,5,25,7],[26,5,26,7],[27,5,27,7],[14,3,14,4],[15,3,15,4],[16,3,16,4],[35,6,35,7],[9,5,9,7],[12,5,12,7],[28,5,28,7],[82,0,82,4],[81,2,81,4],[80,2,80,4],[77,2,77,4],[55,3,55,4],[70,2,70,4],[65,3,65,4],[66,3,66,4],[67,3,67,4],[68,3,68,4],[57,3,61,3],[62,3,64,3],[56,3,56,4],[79,0,81,0],[79,2,79,4],[78,2,78,4],[29,0,78,0],[75,1,76,1],[72,1,74,1],[72,2,74,3],[71,2,71,4],[48,2,51,3],[30,2,41,2],[30,1,41,1],[30,3,33,3],[34,3,37,3],[38,3,41,3],[42,1,44,1],[13,5,13,7],[14,5,14,7],[46,1,51,1],[52,1,69,1],[75,2,76,3],[53,3,53,4],[48,5,48,7],[49,5,49,7],[50,5,50,7],[51,5,51,7],[45,6,45,7],[46,6,46,7],[47,6,47,7],[69,3,69,4],[62,2,69,2],[46,2,47,3],[69,5,69,7],[42,5,44,5],[29,6,29,7],[30,6,30,7],[31,6,31,7],[45,1,45,4],[55,2,61,2],[36,6,36,7],[37,6,37,7],[38,6,38,7],[39,6,39,7],[40,6,40,7],[41,6,41,7],[42,6,42,7],[43,6,43,7],[44,6,44,7],[4,44,4,46],[4,47,4,49],[4,50,4,52],[4,53,4,55],[4,56,4,58],[20,0,27,0],[20,1,27,1],[20,2,20,3],[4,8,4,10],[5,8,5,10],[4,11,4,13],[4,14,4,16],[4,17,4,19],[4,20,4,22],[4,23,4,25],[4,26,4,28],[4,29,4,31],[12,3,12,4],[11,2,11,4],[10,2,10,4],[9,2,9,4],[8,2,8,4],[7,2,7,4],[13,3,13,4],[12,2,18,2],[4,5,4,7],[5,5,5,7],[6,5,6,7],[7,5,7,7],[8,5,8,7],[10,5,10,7],[11,5,11,7],[5,68,5,70],[5,11,5,13],[5,14,5,16],[5,17,5,19],[5,20,5,22],[5,23,5,25],[5,26,5,28],[5,29,5,31],[5,32,5,34],[4,113,4,115],[4,116,4,118],[4,119,4,121],[4,122,4,124],[4,125,4,127],[4,128,4,130],[5,86,5,88],[5,89,5,91],[5,92,5,94],[5,95,5,97],[4,59,4,61],[4,62,4,64],[4,65,4,67],[4,68,4,70],[4,71,4,73],[4,74,4,76],[4,77,4,79],[4,80,4,82],[4,83,4,85],[4,32,4,34],[4,35,4,37],[4,38,4,40],[4,41,4,43],[4,131,4,133],[4,134,4,136],[4,86,4,88],[4,89,4,91],[4,92,4,94],[4,95,4,97],[4,98,4,100],[4,101,4,103],[4,104,4,106],[4,107,4,109],[4,110,4,112],[5,59,5,61],[5,125,5,127],[5,128,5,130],[5,131,5,133],[5,134,5,136],[5,98,5,100],[5,101,5,103],[5,104,5,106],[5,107,5,109],[5,110,5,112],[5,113,5,115],[5,116,5,118],[5,119,5,121],[5,122,5,124],[5,71,5,73],[5,74,5,76],[5,77,5,79],[5,80,5,82],[5,83,5,85],[5,62,5,64],[5,65,5,67],[6,8,6,10],[6,11,6,13],[6,14,6,16],[6,17,6,19],[6,20,6,22],[6,23,6,25],[6,26,6,28],[6,29,6,31],[6,32,6,34],[5,35,5,37],[5,38,5,40],[5,41,5,43],[5,44,5,46],[5,47,5,49],[5,50,5,52],[5,53,5,55],[5,56,5,58],[6,74,6,76],[6,77,6,79],[6,80,6,82],[6,83,6,85],[6,86,6,88],[7,125,7,127],[7,128,7,130],[6,35,6,37],[6,38,6,40],[6,41,6,43],[6,44,6,46],[6,47,6,49],[6,50,6,52],[6,53,6,55],[6,56,6,58],[6,59,6,61],[7,65,7,67],[7,68,7,70],[6,116,6,118],[6,119,6,121],[6,122,6,124],[6,125,6,127],[6,128,6,130],[6,131,6,133],[6,134,6,136],[6,89,6,91],[6,92,6,94],[6,95,6,97],[6,98,6,100],[6,101,6,103],[6,104,6,106],[6,107,6,109],[6,110,6,112],[6,113,6,115],[7,14,7,16],[7,17,7,19],[7,20,7,22],[7,23,7,25],[7,26,7,28],[7,29,7,31],[7,32,7,34],[7,35,7,37],[7,38,7,40],[7,41,7,43],[7,44,7,46],[7,47,7,49],[7,50,7,52],[7,53,7,55],[7,56,7,58],[7,59,7,61],[7,62,7,64],[6,62,6,64],[6,65,6,67],[6,68,6,70],[6,71,6,73],[8,8,8,10],[8,11,8,13],[8,14,8,16],[8,17,8,19],[8,20,8,22],[8,23,8,25],[8,26,8,28],[8,29,8,31],[8,32,8,34],[7,131,7,133],[7,134,7,136],[7,98,7,100],[7,101,7,103],[7,104,7,106],[7,107,7,109],[7,110,7,112],[7,113,7,115],[7,116,7,118],[7,119,7,121],[7,122,7,124],[7,71,7,73],[7,74,7,76],[7,77,7,79],[7,80,7,82],[7,83,7,85],[7,86,7,88],[7,89,7,91],[7,92,7,94],[7,95,7,97],[7,8,7,10],[7,11,7,13],[8,74,8,76],[8,77,8,79],[8,80,8,82],[8,83,8,85],[8,86,8,88],[9,125,9,127],[9,128,9,130],[8,35,8,37],[8,38,8,40],[8,41,8,43],[8,44,8,46],[8,47,8,49],[8,50,8,52],[8,53,8,55],[8,56,8,58],[8,59,8,61],[9,65,9,67],[9,68,9,70],[8,116,8,118],[8,119,8,121],[8,122,8,124],[8,125,8,127],[8,128,8,130],[8,131,8,133],[8,134,8,136],[8,89,8,91],[8,92,8,94],[8,95,8,97],[8,98,8,100],[8,101,8,103],[8,104,8,106],[8,107,8,109],[8,110,8,112],[8,113,8,115],[9,14,9,16],[9,17,9,19],[9,20,9,22],[9,23,9,25],[9,26,9,28],[9,29,9,31],[9,32,9,34],[9,35,9,37],[9,38,9,40],[9,41,9,43],[9,44,9,46],[9,47,9,49],[9,50,9,52],[9,53,9,55],[9,56,9,58],[9,59,9,61],[9,62,9,64],[8,62,8,64],[8,65,8,67],[8,68,8,70],[8,71,8,73],[10,8,10,10],[10,11,10,13],[10,14,10,16],[10,17,10,19],[10,20,10,22],[10,23,10,25],[10,26,10,28],[10,29,10,31],[10,32,10,34],[9,131,9,133],[9,134,9,136],[9,98,9,100],[9,101,9,103],[9,104,9,106],[9,107,9,109],[9,110,9,112],[9,113,9,115],[9,116,9,118],[9,119,9,121],[9,122,9,124],[9,71,9,73],[9,74,9,76],[9,77,9,79],[9,80,9,82],[9,83,9,85],[9,86,9,88],[9,89,9,91],[9,92,9,94],[9,95,9,97],[9,8,9,10],[9,11,9,13],[10,74,10,76],[10,77,10,79],[10,80,10,82],[10,83,10,85],[10,86,10,88],[11,125,11,127],[11,128,11,130],[10,35,10,37],[10,38,10,40],[10,41,10,43],[10,44,10,46],[10,47,10,49],[10,50,10,52],[10,53,10,55],[10,56,10,58],[10,59,10,61],[11,65,11,67],[11,68,11,70],[10,116,10,118],[10,119,10,121],[10,122,10,124],[10,125,10,127],[10,128,10,130],[10,131,10,133],[10,134,10,136],[10,89,10,91],[10,92,10,94],[10,95,10,97],[10,98,10,100],[10,101,10,103],[10,104,10,106],[10,107,10,109],[10,110,10,112],[10,113,10,115],[11,14,11,16],[11,17,11,19],[11,20,11,22],[11,23,11,25],[11,26,11,28],[11,29,11,31],[11,32,11,34],[11,35,11,37],[11,38,11,40],[11,41,11,43],[11,44,11,46],[11,47,11,49],[11,50,11,52],[11,53,11,55],[11,56,11,58],[11,59,11,61],[11,62,11,64],[10,62,10,64],[10,65,10,67],[10,68,10,70],[10,71,10,73],[12,8,12,10],[12,11,12,13],[12,14,12,16],[12,17,12,19],[12,20,12,22],[12,23,12,25],[12,26,12,28],[12,29,12,31],[12,32,12,34],[11,131,11,133],[11,134,11,136],[11,98,11,100],[11,101,11,103],[11,104,11,106],[11,107,11,109],[11,110,11,112],[11,113,11,115],[11,116,11,118],[11,119,11,121],[11,122,11,124],[11,71,11,73],[11,74,11,76],[11,77,11,79],[11,80,11,82],[11,83,11,85],[11,86,11,88],[11,89,11,91],[11,92,11,94],[11,95,11,97],[11,8,11,10],[11,11,11,13],[12,74,12,76],[12,77,12,79],[12,80,12,82],[12,83,12,85],[12,86,12,88],[13,125,13,127],[13,128,13,130],[12,35,12,37],[12,38,12,40],[12,41,12,43],[12,44,12,46],[12,47,12,49],[12,50,12,52],[12,53,12,55],[12,56,12,58],[12,59,12,61],[13,65,13,67],[13,68,13,70],[12,116,12,118],[12,119,12,121],[12,122,12,124],[12,125,12,127],[12,128,12,130],[12,131,12,133],[12,134,12,136],[12,89,12,91],[12,92,12,94],[12,95,12,97],[12,98,12,100],[12,101,12,103],[12,104,12,106],[12,107,12,109],[12,110,12,112],[12,113,12,115],[13,14,13,16],[13,17,13,19],[13,20,13,22],[13,23,13,25],[13,26,13,28],[13,29,13,31],[13,32,13,34],[13,35,13,37],[13,38,13,40],[13,41,13,43],[13,44,13,46],[13,47,13,49],[13,50,13,52],[13,53,13,55],[13,56,13,58],[13,59,13,61],[13,62,13,64],[12,62,12,64],[12,65,12,67],[12,68,12,70],[12,71,12,73],[14,8,14,10],[14,11,14,13],[14,14,14,16],[14,17,14,19],[14,20,14,22],[14,23,14,25],[14,26,14,28],[14,29,14,31],[14,32,14,34],[13,131,13,133],[13,134,13,136],[13,98,13,100],[13,101,13,103],[13,104,13,106],[13,107,13,109],[13,110,13,112],[13,113,13,115],[13,116,13,118],[13,119,13,121],[13,122,13,124],[13,71,13,73],[13,74,13,76],[13,77,13,79],[13,80,13,82],[13,83,13,85],[13,86,13,88],[13,89,13,91],[13,92,13,94],[13,95,13,97],[13,8,13,10],[13,11,13,13],[14,74,14,76],[14,77,14,79],[14,80,14,82],[14,83,14,85],[14,86,14,88],[15,125,15,127],[15,128,15,130],[14,35,14,37],[14,38,14,40],[14,41,14,43],[14,44,14,46],[14,47,14,49],[14,50,14,52],[14,53,14,55],[14,56,14,58],[14,59,14,61],[15,65,15,67],[15,68,15,70],[14,116,14,118],[14,119,14,121],[14,122,14,124],[14,125,14,127],[14,128,14,130],[14,131,14,133],[14,134,14,136],[14,89,14,91],[14,92,14,94],[14,95,14,97],[14,98,14,100],[14,101,14,103],[14,104,14,106],[14,107,14,109],[14,110,14,112],[14,113,14,115],[15,14,15,16],[15,17,15,19],[15,20,15,22],[15,23,15,25],[15,26,15,28],[15,29,15,31],[15,32,15,34],[15,35,15,37],[15,38,15,40],[15,41,15,43],[15,44,15,46],[15,47,15,49],[15,50,15,52],[15,53,15,55],[15,56,15,58],[15,59,15,61],[15,62,15,64],[14,62,14,64],[14,65,14,67],[14,68,14,70],[14,71,14,73],[16,8,16,10],[16,11,16,13],[16,14,16,16],[16,17,16,19],[16,20,16,22],[16,23,16,25],[16,26,16,28],[16,29,16,31],[16,32,16,34],[15,131,15,133],[15,134,15,136],[15,98,15,100],[15,101,15,103],[15,104,15,106],[15,107,15,109],[15,110,15,112],[15,113,15,115],[15,116,15,118],[15,119,15,121],[15,122,15,124],[15,71,15,73],[15,74,15,76],[15,77,15,79],[15,80,15,82],[15,83,15,85],[15,86,15,88],[15,89,15,91],[15,92,15,94],[15,95,15,97],[15,8,15,10],[15,11,15,13],[16,74,16,76],[16,77,16,79],[16,80,16,82],[16,83,16,85],[16,86,16,88],[17,125,17,127],[17,128,17,130],[16,35,16,37],[16,38,16,40],[16,41,16,43],[16,44,16,46],[16,47,16,49],[16,50,16,52],[16,53,16,55],[16,56,16,58],[16,59,16,61],[17,65,17,67],[17,68,17,70],[16,116,16,118],[16,119,16,121],[16,122,16,124],[16,125,16,127],[16,128,16,130],[16,131,16,133],[16,134,16,136],[16,89,16,91],[16,92,16,94],[16,95,16,97],[16,98,16,100],[16,101,16,103],[16,104,16,106],[16,107,16,109],[16,110,16,112],[16,113,16,115],[17,14,17,16],[17,17,17,19],[17,20,17,22],[17,23,17,25],[17,26,17,28],[17,29,17,31],[17,32,17,34],[17,35,17,37],[17,38,17,40],[17,41,17,43],[17,44,17,46],[17,47,17,49],[17,50,17,52],[17,53,17,55],[17,56,17,58],[17,59,17,61],[17,62,17,64],[16,62,16,64],[16,65,16,67],[16,68,16,70],[16,71,16,73],[18,8,18,10],[18,11,18,13],[18,14,18,16],[18,17,18,19],[18,20,18,22],[18,23,18,25],[18,26,18,28],[18,29,18,31],[18,32,18,34],[17,131,17,133],[17,134,17,136],[17,98,17,100],[17,101,17,103],[17,104,17,106],[17,107,17,109],[17,110,17,112],[17,113,17,115],[17,116,17,118],[17,119,17,121],[17,122,17,124],[17,71,17,73],[17,74,17,76],[17,77,17,79],[17,80,17,82],[17,83,17,85],[17,86,17,88],[17,89,17,91],[17,92,17,94],[17,95,17,97],[17,8,17,10],[17,11,17,13],[18,74,18,76],[18,77,18,79],[18,80,18,82],[18,83,18,85],[18,86,18,88],[19,125,19,127],[19,128,19,130],[18,35,18,37],[18,38,18,40],[18,41,18,43],[18,44,18,46],[18,47,18,49],[18,50,18,52],[18,53,18,55],[18,56,18,58],[18,59,18,61],[19,65,19,67],[19,68,19,70],[18,116,18,118],[18,119,18,121],[18,122,18,124],[18,125,18,127],[18,128,18,130],[18,131,18,133],[18,134,18,136],[18,89,18,91],[18,92,18,94],[18,95,18,97],[18,98,18,100],[18,101,18,103],[18,104,18,106],[18,107,18,109],[18,110,18,112],[18,113,18,115],[19,14,19,16],[19,17,19,19],[19,20,19,22],[19,23,19,25],[19,26,19,28],[19,29,19,31],[19,32,19,34],[19,35,19,37],[19,38,19,40],[19,41,19,43],[19,44,19,46],[19,47,19,49],[19,50,19,52],[19,53,19,55],[19,56,19,58],[19,59,19,61],[19,62,19,64],[18,62,18,64],[18,65,18,67],[18,68,18,70],[18,71,18,73],[20,8,20,10],[20,11,20,13],[20,14,20,16],[20,17,20,19],[20,20,20,22],[20,23,20,25],[20,26,20,28],[20,29,20,31],[20,32,20,34],[19,131,19,133],[19,134,19,136],[19,98,19,100],[19,101,19,103],[19,104,19,106],[19,107,19,109],[19,110,19,112],[19,113,19,115],[19,116,19,118],[19,119,19,121],[19,122,19,124],[19,71,19,73],[19,74,19,76],[19,77,19,79],[19,80,19,82],[19,83,19,85],[19,86,19,88],[19,89,19,91],[19,92,19,94],[19,95,19,97],[19,8,19,10],[19,11,19,13],[20,74,20,76],[20,77,20,79],[20,80,20,82],[20,83,20,85],[20,86,20,88],[21,125,21,127],[21,128,21,130],[20,35,20,37],[20,38,20,40],[20,41,20,43],[20,44,20,46],[20,47,20,49],[20,50,20,52],[20,53,20,55],[20,56,20,58],[20,59,20,61],[21,65,21,67],[21,68,21,70],[20,116,20,118],[20,119,20,121],[20,122,20,124],[20,125,20,127],[20,128,20,130],[20,131,20,133],[20,134,20,136],[20,89,20,91],[20,92,20,94],[20,95,20,97],[20,98,20,100],[20,101,20,103],[20,104,20,106],[20,107,20,109],[20,110,20,112],[20,113,20,115],[21,14,21,16],[21,17,21,19],[21,20,21,22],[21,23,21,25],[21,26,21,28],[21,29,21,31],[21,32,21,34],[21,35,21,37],[21,38,21,40],[21,41,21,43],[21,44,21,46],[21,47,21,49],[21,50,21,52],[21,53,21,55],[21,56,21,58],[21,59,21,61],[21,62,21,64],[20,62,20,64],[20,65,20,67],[20,68,20,70],[20,71,20,73],[22,8,22,10],[22,11,22,13],[22,14,22,16],[22,17,22,19],[22,20,22,22],[22,23,22,25],[22,26,22,28],[22,29,22,31],[22,32,22,34],[21,131,21,133],[21,134,21,136],[21,98,21,100],[21,101,21,103],[21,104,21,106],[21,107,21,109],[21,110,21,112],[21,113,21,115],[21,116,21,118],[21,119,21,121],[21,122,21,124],[21,71,21,73],[21,74,21,76],[21,77,21,79],[21,80,21,82],[21,83,21,85],[21,86,21,88],[21,89,21,91],[21,92,21,94],[21,95,21,97],[21,8,21,10],[21,11,21,13],[22,74,22,76],[22,77,22,79],[22,80,22,82],[22,83,22,85],[22,86,22,88],[23,125,23,127],[23,128,23,130],[22,35,22,37],[22,38,22,40],[22,41,22,43],[22,44,22,46],[22,47,22,49],[22,50,22,52],[22,53,22,55],[22,56,22,58],[22,59,22,61],[23,65,23,67],[23,68,23,70],[22,116,22,118],[22,119,22,121],[22,122,22,124],[22,125,22,127],[22,128,22,130],[22,131,22,133],[22,134,22,136],[22,89,22,91],[22,92,22,94],[22,95,22,97],[22,98,22,100],[22,101,22,103],[22,104,22,106],[22,107,22,109],[22,110,22,112],[22,113,22,115],[23,14,23,16],[23,17,23,19],[23,20,23,22],[23,23,23,25],[23,26,23,28],[23,29,23,31],[23,32,23,34],[23,35,23,37],[23,38,23,40],[23,41,23,43],[23,44,23,46],[23,47,23,49],[23,50,23,52],[23,53,23,55],[23,56,23,58],[23,59,23,61],[23,62,23,64],[22,62,22,64],[22,65,22,67],[22,68,22,70],[22,71,22,73],[24,8,24,10],[24,11,24,13],[24,14,24,16],[24,17,24,19],[24,20,24,22],[24,23,24,25],[24,26,24,28],[24,29,24,31],[24,32,24,34],[23,131,23,133],[23,134,23,136],[23,98,23,100],[23,101,23,103],[23,104,23,106],[23,107,23,109],[23,110,23,112],[23,113,23,115],[23,116,23,118],[23,119,23,121],[23,122,23,124],[23,71,23,73],[23,74,23,76],[23,77,23,79],[23,80,23,82],[23,83,23,85],[23,86,23,88],[23,89,23,91],[23,92,23,94],[23,95,23,97],[23,8,23,10],[23,11,23,13],[24,74,24,76],[24,77,24,79],[24,80,24,82],[24,83,24,85]],"merged_total":2956,"flags":["merged_cut"]}
[null,null,null,null,null,"1-1",null,null,"1-2",null,null,"1-3",null,null,"3-1",null,null,"3-2",null,null,"7-1",null,null,"7-2",null,null,"9-1",null,null,"9-2",null,null,"9-3",null,null,"10-1",null,null,"10-2",null,null,"13-1",null,null,"14-1",null,null,"15-1",null,null,"16-1",null,null,"17-1",null,null,"17-2",null,null,"18-1",null,null,"19-1",null,null,"19-2",null,null,"20-1",null,null,"20-2",null,null,"21-1",null,null,"22-1",null,null,"23-1",null,null,"24-1",null,null,"28-1",null,null,"29-1",null,null,"30-1",null,null,"30-2",null,null,"31-1",null,null,"31-2",null,null,"32-1",null,null,"33-1",null,null,"33-2",null,null,"33-3",null,null,"34-1",null,null,"34-2",null,null,"35-1",null,null,"36-1",null,null,"37-1",null,null,"38-1",null,null,"39-1"]
["断面修復工",null,null,null,null,{"$f":"IF(LEN(VLOOKUP(F1,仕様の整理!$C:$E,3,0))-LEN(SUBSTITUTE(VLOOKUP(F1,仕様の整理!$C:$E,3,0),\"-\",\"\"))>=2,LEFT(VLOOKUP(F1,仕様の整理!$C:$E,3,0),FIND(\"-\",VLOOKUP(F1,仕様の整理!$C:$E,3,0),FIND(\"-\",VLOOKUP(F1,仕様の整理!$C:$E,3,0))+1)-1),VLOOKUP(F1,仕様の整理!$C:$E,3,0))","v":"KK-100009"},null,null,{"$f":"IF(LEN(VLOOKUP(I1,仕様の整理!$C:$E,3,0))-LEN(SUBSTITUTE(VLOOKUP(I1,仕様の整理!$C:$E,3,0),\"-\",\"\"))>=2,LEFT(VLOOKUP(I1,仕様の整理!$C:$E,3,0),FIND(\"-\",VLOOKUP(I1,仕様の整理!$C:$E,3,0),FIND(\"-\",VLOOKUP(I1,仕様の整理!$C:$E,3,0))+1)-1),VLOOKUP(I1,仕様の整理!$C:$E,3,0))","v":"KK-100009"},null,null,{"$f":"IF(LEN(VLOOKUP(L1,仕様の整理!$C:$E,3,0))-LEN(SUBSTITUTE(VLOOKUP(L1,仕様の整理!$C:$E,3,0),\"-\",\"\"))>=2,LEFT(VLOOKUP(L1,仕様の整理!$C:$E,3,0),FIND(\"-\",VLOOKUP(L1,仕様の整理!$C:$E,3,0),FIND(\"-\",VLOOKUP(L1,仕様の整理!$C:$E,3,0))+1)-1),VLOOKUP(L1,仕様の整理!$C:$E,3,0))","v":"KK-100009"},null,null,{"$f":"IF(LEN(VLOOKUP(O1,仕様の整理!$C:$E,3,0))-LEN(SUBSTITUTE(VLOOKUP(O1,仕様の整理!$C:$E,3,0),\"-\",\"\"))>=2,LEFT(VLOOKUP(O1,仕様の整理!$C:$E,3,0),FIND(\"-\",VLOOKUP(O1,仕様の整理!$C:$E,3,0),FIND(\"-\",VLOOKUP(O1,仕様の整理!$C:$E,3,0))+1)-1),VLOOKUP(O1,仕様の整理!$C:$E,3,0))","v":"HK-110049"},null,null,{"$f":"IF(LEN(VLOOKUP(R1,仕様の整理!$C:$E,3,0))-LEN(SUBSTITUTE(VLOOKUP(R1,仕様の整理!$C:$E,3,0),\"-\",\"\"))>=2,LEFT(VLOOKUP(R1,仕様の整理!$C:$E,3,0),FIND(\"-\",VLOOKUP(R1,仕様の整理!$C:$E,3,0),FIND(\"-\",VLOOKUP(R1,仕様の整理!$C:$E,3,0))+1)-1),VLOOKUP(R1,仕様の整理!$C:$E,3,0))","v":"HK-110049"},null,null,{"$f":"IF(LEN(VLOOKUP(U1,仕様の整理!$C:$E,3,0))-LEN(SUBSTITUTE(VLOOKUP(U1,仕様の整理!$C:$E,3,0),\"-\",\"\"))>=2,LEFT(VLOOKUP(U1,仕様の整理!$C:$E,3,0),FIND(\"-\",VLOOKUP(U1,仕様の整理!$C:$E,3,0),FIND(\"-\",VLOOKUP(U1,仕様の整理!$C:$E,3,0))+1)-1),VLOOKUP(U1,仕様の整理!$C:$E,3,0))","v":"QS-150001"},null,null,{"$f":"IF(LEN(VLOOKUP(X1,仕様の整理!$C:$E,3,0))-LEN(SUBSTITUTE(VLOOKUP(X1,仕様の整理!$C:$E,3,0),\"-\",\"\"))>=2,LEFT(VLOOKUP(X1,仕様の整理!$C:$E,3,0),FIND(\"-\",VLOOKUP(X1,仕様の整理!$C:$E,3,0),FIND(\"-\",VLOOKUP(X1,仕様の整理!$C:$E,3,0))+1)-1),VLOOKUP(X1,仕様の整理!$C:$E,3,0))","v":"QS-150001"},null,null,{"$f":"IF(LEN(VLOOKUP(AA1,仕様の整理!$C:$E,3,0))-LEN(SUBSTITUTE(VLOOKUP(AA1,仕様の整理!$C:$E,3,0),\"-\",\"\"))>=2,LEFT(VLOOKUP(AA1,仕様の整理!$C:$E,3,0),FIND(\"-\",VLOOKUP(AA1,仕様の整理!$C:$E,3,0),FIND(\"-\",VLOOKUP(AA1,仕様の整理!$C:$E,3,0))+1)-1),VLOOKUP(AA1,仕様の整理!$C:$E,3,0))","v":"QS-150017"},null,null,{"$f":"IF(LEN(VLOOKUP(AD1,仕様の整理!$C:$E,3,0))-LEN(SUBSTITUTE(VLOOKUP(AD1,仕様の整理!$C:$E,3,0),\"-\",\"\"))>=2,LEFT(VLOOKUP(AD1,仕様の整理!$C:$E,3,0),FIND(\"-\",VLOOKUP(AD1,仕様の整理!$C:$E,3,0),FIND(\"-\",VLOOKUP(AD1,仕様の整理!$C:$E,3,0))+1)-1),VLOOKUP(AD1,仕様の整理!$C:$E,3,0))","v":"QS-150017"},null,null,{"$f":"IF(LEN(VLOOKUP(AG1,仕様の整理!$C:$E,3,0))-LEN(SUBSTITUTE(VLOOKUP(AG1,仕様の整理!$C:$E,3,0),\"-\",\"\"))>=2,LEFT(VLOOKUP(AG1,仕様の整理!$C:$E,3,0),FIND(\"-\",VLOOKUP(AG1,仕様の整理!$C:$E,3,0),FIND(\"-\",VLOOKUP(AG1,仕様の整理!$C:$E,3,0))+1)-1),VLOOKUP(AG1,仕様の整理!$C:$E,3,0))","v":"QS-150017"},null,null,{"$f":"IF(LEN(VLOOKUP(AJ1,仕様の整理!$C:$E,3,0))-LEN(SUBSTITUTE(VLOOKUP(AJ1,仕様の整理!$C:$E,3,0),\"-\",\"\"))>=2,LEFT(VLOOKUP(AJ1,仕様の整理!$C:$E,3,0),FIND(\"-\",VLOOKUP(AJ1,仕様の整理!$C:$E,3,0),FIND(\"-\",VLOOKUP(AJ1,仕様の整理!$C:$E,3,0))+1)-1),VLOOKUP(AJ1,仕様の整理!$C:$E,3,0))","v":"KT-150080"},null,null,{"$f":"IF(LEN(VLOOKUP(AM1,仕様の整理!$C:$E,3,0))-LEN(SUBSTITUTE(VLOOKUP(AM1,仕様の整理!$C:$E,3,0),\"-\",\"\"))>=2,LEFT(VLOOKUP(AM1,仕様の整理!$C:$E,3,0),FIND(\"-\",VLOOKUP(AM1,仕様の整理!$C:$E,3,0),FIND(\"-\",VLOOKUP(AM1,仕様の整理!$C:$E,3,0))+1)-1),VLOOKUP(AM1,仕様の整理!$C:$E,3,0))","v":"KT-150080"},null,null,{"$f":"IF(LEN(VLOOKUP(AP1,仕様の整理!$C:$E,3,0))-LEN(SUBSTITUTE(VLOOKUP(AP1,仕様の整理!$C:$E,3,0),\"-\",\"\"))>=2,LEFT(VLOOKUP(AP1,仕様の整理!$C:$E,3,0),FIND(\"-\",VLOOKUP(AP1,仕様の整理!$C:$E,3,0),FIND(\"-\",VLOOKUP(AP1,仕様の整理!$C:$E,3,0))+1)-1),VLOOKUP(AP1,仕様の整理!$C:$E,3,0))","v":"CB-020040"},null,null,{"$f":"IF(LEN(VLOOKUP(AS1,仕様の整理!$C:$E,3,0))-LEN(SUBSTITUTE(VLOOKUP(AS1,仕様の整理!$C:$E,3,0),\"-\",\"\"))>=2,LEFT(VLOOKUP(AS1,仕様の整理!$C:$E,3,0),FIND(\"-\",VLOOKUP(AS1,仕様の整理!$C:$E,3,0),FIND(\"-\",VLOOKUP(AS1,仕様の整理!$C:$E,3,0))+1)-1),VLOOKUP(AS1,仕様の整理!$C:$E,3,0))","v":"SK-170011"},null,null,{"$f":"IF(LEN(VLOOKUP(AV1,仕様の整理!$C:$E,3,0))-LEN(SUBSTITUTE(VLOOKUP(AV1,仕様の整理!$C:$E,3,0),\"-\",\"\"))>=2,LEFT(VLOOKUP(AV1,仕様の整理!$C:$E,3,0),FIND(\"-\",VLOOKUP(AV1,仕様の整理!$C:$E,3,0),FIND(\"-\",VLOOKUP(AV1,仕様の整理!$C:$E,3,0))+1)-1),VLOOKUP(AV1,仕様の整理!$C:$E,3,0))","v":"KT-170058"},null,null,{"$f":"IF(LEN(VLOOKUP(AY1,仕様の整理!$C:$E,3,0))-LEN(SUBSTITUTE(VLOOKUP(AY1,仕様の整理!$C:$E,3,0),\"-\",\"\"))>=2,LEFT(VLOOKUP(AY1,仕様の整理!$C:$E,3,0),FIND(\"-\",VLOOKUP(AY1,仕様の整理!$C:$E,3,0),FIND(\"-\",VLOOKUP(AY1,仕様の整理!$C:$E,3,0))+1)-1),VLOOKUP(AY1,仕様の整理!$C:$E,3,0))","v":"KT-170061"},null,null,{"$f":"IF(LEN(VLOOKUP(BB1,仕様の整理!$C:$E,3,0))-LEN(SUBSTITUTE(VLOOKUP(BB1,仕様の整理!$C:$E,3,0),\"-\",\"\"))>=2,LEFT(VLOOKUP(BB1,仕様の整理!$C:$E,3,0),FIND(\"-\",VLOOKUP(BB1,仕様の整理!$C:$E,3,0),FIND(\"-\",VLOOKUP(BB1,仕様の整理!$C:$E,3,0))+1)-1),VLOOKUP(BB1,仕様の整理!$C:$E,3,0))","v":"TH-180003"},null,null,{"$f":"IF(LEN(VLOOKUP(BE1,仕様の整理!$C:$E,3,0))-LEN(SUBSTITUTE(VLOOKUP(BE1,仕様の整理!$C:$E,3,0),\"-\",\"\"))>=2,LEFT(VLOOKUP(BE1,仕様の整理!$C:$E,3,0),FIND(\"-\",VLOOKUP(BE1,仕様の整理!$C:$E,3,0),FIND(\"-\",VLOOKUP(BE1,仕様の整理!$C:$E,3,0))+1)-1),VLOOKUP(BE1,仕様の整理!$C:$E,3,0))","v":"TH-180003"},null,null,{"$f":"IF(LEN(VLOOKUP(BH1,仕様の整理!$C:$E,3,0))-LEN(SUBSTITUTE(VLOOKUP(BH1,仕様の整理!$C:$E,3,0),\"-\",\"\"))>=2,LEFT(VLOOKUP(BH1,仕様の整理!$C:$E,3,0),FIND(\"-\",VLOOKUP(BH1,仕様の整理!$C:$E,3,0),FIND(\"-\",VLOOKUP(BH1,仕様の整理!$C:$E,3,0))+1)-1),VLOOKUP(BH1,仕様の整理!$C:$E,3,0))","v":"KTK-180004"},null,null,{"$f":"IF(LEN(VLOOKUP(BK1,仕様の整理!$C:$E,3,0))-LEN(SUBSTITUTE(VLOOKUP(BK1,仕様の整理!$C:$E,3,0),\"-\",\"\"))>=2,LEFT(VLOOKUP(BK1,仕様の整理!$C:$E,3,0),FIND(\"-\",VLOOKUP(BK1,仕様の整理!$C:$E,3,0),FIND(\"-\",VLOOKUP(BK1,仕様の整理!$C:$E,3,0))+1)-1),VLOOKUP(BK1,仕様の整理!$C:$E,3,0))","v":"KT-180077"},null,null,{"$f":"IF(LEN(VLOOKUP(BN1,仕様の整理!$C:$E,3,0))-LEN(SUBSTITUTE(VLOOKUP(BN1,仕様の整理!$C:$E,3,0),\"-\",\"\"))>=2,LEFT(VLOOKUP(BN1,仕様の整理!$C:$E,3,0),FIND(\"-\",VLOOKUP(BN1,仕様の整理!$C:$E,3,0),FIND(\"-\",VLOOKUP(BN1,仕様の整理!$C:$E,3,0))+1)-1),VLOOKUP(BN1,仕様の整理!$C:$E,3,0))","v":"KT-180077"},null,null,{"$f":"IF(LEN(VLOOKUP(BQ1,仕様の整理!$C:$E,3,0))-LEN(SUBSTITUTE(VLOOKUP(BQ1,仕様の整理!$C:$E,3,0),\"-\",\"\"))>=2,LEFT(VLOOKUP(BQ1,仕様の整理!$C:$E,3,0),FIND(\"-\",VLOOKUP(BQ1,仕様の整理!$C:$E,3,0),FIND(\"-\",VLOOKUP(BQ1,仕様の整理!$C:$E,3,0))+1)-1),VLOOKUP(BQ1,仕様の整理!$C:$E,3,0))","v":"QS-180044"},null,null,{"$f":"IF(LEN(VLOOKUP(BT1,仕様の整理!$C:$E,3,0))-LEN(SUBSTITUTE(VLOOKUP(BT1,仕様の整理!$C:$E,3,0),\"-\",\"\"))>=2,LEFT(VLOOKUP(BT1,仕様の整理!$C:$E,3,0),FIND(\"-\",VLOOKUP(BT1,仕様の整理!$C:$E,3,0),FIND(\"-\",VLOOKUP(BT1,仕様の整理!$C:$E,3,0))+1)-1),VLOOKUP(BT1,仕様の整理!$C:$E,3,0))","v":"QS-180044"},null,null,{"$f":"IF(LEN(VLOOKUP(BW1,仕様の整理!$C:$E,3,0))-LEN(SUBSTITUTE(VLOOKUP(BW1,仕様の整理!$C:$E,3,0),\"-\",\"\"))>=2,LEFT(VLOOKUP(BW1,仕様の整理!$C:$E,3,0),FIND(\"-\",VLOOKUP(BW1,仕様の整理!$C:$E,3,0),FIND(\"-\",VLOOKUP(BW1,仕様の整理!$C:$E,3,0))+1)-1),VLOOKUP(BW1,仕様の整理!$C:$E,3,0))","v":"KT-190023"},null,null,{"$f":"IF(LEN(VLOOKUP(BZ1,仕様の整理!$C:$E,3,0))-LEN(SUBSTITUTE(VLOOKUP(BZ1,仕様の整理!$C:$E,3,0),\"-\",\"\"))>=2,LEFT(VLOOKUP(BZ1,仕様の整理!$C:$E,3,0),FIND(\"-\",VLOOKUP(BZ1,仕様の整理!$C:$E,3,0),FIND(\"-\",VLOOKUP(BZ1,仕様の整理!$C:$E,3,0))+1)-1),VLOOKUP(BZ1,仕様の整理!$C:$E,3,0))","v":"QS-190036"},null,null,{"$f":"IF(LEN(VLOOKUP(CC1,仕様の整理!$C:$E,3,0))-LEN(SUBSTITUTE(VLOOKUP(CC1,仕様の整理!$C:$E,3,0),\"-\",\"\"))>=2,LEFT(VLOOKUP(CC1,仕様の整理!$C:$E,3,0),FIND(\"-\",VLOOKUP(CC1,仕様の整理!$C:$E,3,0),FIND(\"-\",VLOOKUP(CC1,仕様の整理!$C:$E,3,0))+1)-1),VLOOKUP(CC1,仕様の整理!$C:$E,3,0))","v":"CG-200019"},null,null,{"$f":"IF(LEN(VLOOKUP(CF1,仕様の整理!$C:$E,3,0))-LEN(SUBSTITUTE(VLOOKUP(CF1,仕様の整理!$C:$E,3,0),\"-\",\"\"))>=2,LEFT(VLOOKUP(CF1,仕様の整理!$C:$E,3,0),FIND(\"-\",VLOOKUP(CF1,仕様の整理!$C:$E,3,0),FIND(\"-\",VLOOKUP(CF1,仕様の整理!$C:$E,3,0))+1)-1),VLOOKUP(CF1,仕様の整理!$C:$E,3,0))","v":"CG-220003"},null,null,{"$f":"IF(LEN(VLOOKUP(CI1,仕様の整理!$C:$E,3,0))-LEN(SUBSTITUTE(VLOOKUP(CI1,仕様の整理!$C:$E,3,0),\"-\",\"\"))>=2,LEFT(VLOOKUP(CI1,仕様の整理!$C:$E,3,0),FIND(\"-\",VLOOKUP(CI1,仕様の整理!$C:$E,3,0),FIND(\"-\",VLOOKUP(CI1,仕様の整理!$C:$E,3,0))+1)-1),VLOOKUP(CI1,仕様の整理!$C:$E,3,0))","v":"CG-230003"},null,null,{"$f":"IF(LEN(VLOOKUP(CL1,仕様の整理!$C:$E,3,0))-LEN(SUBSTITUTE(VLOOKUP(CL1,仕様の整理!$C:$E,3,0),\"-\",\"\"))>=2,LEFT(VLOOKUP(CL1,仕様の整理!$C:$E,3,0),FIND(\"-\",VLOOKUP(CL1,仕様の整理!$C:$E,3,0),FIND(\"-\",VLOOKUP(CL1,仕様の整理!$C:$E,3,0))+1)-1),VLOOKUP(CL1,仕様の整理!$C:$E,3,0))","v":"KK-230050"},null,null,{"$f":"IF(LEN(VLOOKUP(CO1,仕様の整理!$C:$E,3,0))-LEN(SUBSTITUTE(VLOOKUP(CO1,仕様の整理!$C:$E,3,0),\"-\",\"\"))>=2,LEFT(VLOOKUP(CO1,仕様の整理!$C:$E,3,0),FIND(\"-\",VLOOKUP(CO1,仕様の整理!$C:$E,3,0),FIND(\"-\",VLOOKUP(CO1,仕様の整理!$C:$E,3,0))+1)-1),VLOOKUP(CO1,仕様の整理!$C:$E,3,0))","v":"KK-230060"},null,null,{"$f":"IF(LEN(VLOOKUP(CR1,仕様の整理!$C:$E,3,0))-LEN(SUBSTITUTE(VLOOKUP(CR1,仕様の整理!$C:$E,3,0),\"-\",\"\"))>=2,LEFT(VLOOKUP(CR1,仕様の整理!$C:$E,3,0),FIND(\"-\",VLOOKUP(CR1,仕様の整理!$C:$E,3,0),FIND(\"-\",VLOOKUP(CR1,仕様の整理!$C:$E,3,0))+1)-1),VLOOKUP(CR1,仕様の整理!$C:$E,3,0))","v":"KK-230060"},null,null,{"$f":"IF(LEN(VLOOKUP(CU1,仕様の整理!$C:$E,3,0))-LEN(SUBSTITUTE(VLOOKUP(CU1,仕様の整理!$C:$E,3,0),\"-\",\"\"))>=2,LEFT(VLOOKUP(CU1,仕様の整理!$C:$E,3,0),FIND(\"-\",VLOOKUP(CU1,仕様の整理!$C:$E,3,0),FIND(\"-\",VLOOKUP(CU1,仕様の整理!$C:$E,3,0))+1)-1),VLOOKUP(CU1,仕様の整理!$C:$E,3,0))","v":"KK-230077"},null,null,{"$f":"IF(LEN(VLOOKUP(CX1,仕様の整理!$C:$E,3,0))-LEN(SUBSTITUTE(VLOOKUP(CX1,仕様の整理!$C:$E,3,0),\"-\",\"\"))>=2,LEFT(VLOOKUP(CX1,仕様の整理!$C:$E,3,0),FIND(\"-\",VLOOKUP(CX1,仕様の整理!$C:$E,3,0),FIND(\"-\",VLOOKUP(CX1,仕様の整理!$C:$E,3,0))+1)-1),VLOOKUP(CX1,仕様の整理!$C:$E,3,0))","v":"KK-230077"},null,null,{"$f":"IF(LEN(VLOOKUP(DA1,仕様の整理!$C:$E,3,0))-LEN(SUBSTITUTE(VLOOKUP(DA1,仕様の整理!$C:$E,3,0),\"-\",\"\"))>=2,LEFT(VLOOKUP(DA1,仕様の整理!$C:$E,3,0),FIND(\"-\",VLOOKUP(DA1,仕様の整理!$C:$E,3,0),FIND(\"-\",VLOOKUP(DA1,仕様の整理!$C:$E,3,0))+1)-1),VLOOKUP(DA1,仕様の整理!$C:$E,3,0))","v":"KT-240012"},null,null,{"$f":"IF(LEN(VLOOKUP(DD1,仕様の整理!$C:$E,3,0))-LEN(SUBSTITUTE(VLOOKUP(DD1,仕様の整理!$C:$E,3,0),\"-\",\"\"))>=2,LEFT(VLOOKUP(DD1,仕様の整理!$C:$E,3,0),FIND(\"-\",VLOOKUP(DD1,仕様の整理!$C:$E,3,0),FIND(\"-\",VLOOKUP(DD1,仕様の整理!$C:$E,3,0))+1)-1),VLOOKUP(DD1,仕様の整理!$C:$E,3,0))","v":"KT-240042"},null,null,{"$f":"IF(LEN(VLOOKUP(DG1,仕様の整理!$C:$E,3,0))-LEN(SUBSTITUTE(VLOOKUP(DG1,仕様の整理!$C:$E,3,0),\"-\",\"\"))>=2,LEFT(VLOOKUP(DG1,仕様の整理!$C:$E,3,0),FIND(\"-\",VLOOKUP(DG1,仕様の整理!$C:$E,3,0),FIND(\"-\",VLOOKUP(DG1,仕様の整理!$C:$E,3,0))+1)-1),VLOOKUP(DG1,仕様の整理!$C:$E,3,0))","v":"KT-240042"},null,null,{"$f":"IF(LEN(VLOOKUP(DJ1,仕様の整理!$C:$E,3,0))-LEN(SUBSTITUTE(VLOOKUP(DJ1,仕様の整理!$C:$E,3,0),\"-\",\"\"))>=2,LEFT(VLOOKUP(DJ1,仕様の整理!$C:$E,3,0),FIND(\"-\",VLOOKUP(DJ1,仕様の整理!$C:$E,3,0),FIND(\"-\",VLOOKUP(DJ1,仕様の整理!$C:$E,3,0))+1)-1),VLOOKUP(DJ1,仕様の整理!$C:$E,3,0))","v":"KT-240042"},null,null,{"$f":"IF(LEN(VLOOKUP(DM1,仕様の整理!$C:$E,3,0))-LEN(SUBSTITUTE(VLOOKUP(DM1,仕様の整理!$C:$E,3,0),\"-\",\"\"))>=2,LEFT(VLOOKUP(DM1,仕様の整理!$C:$E,3,0),FIND(\"-\",VLOOKUP(DM1,仕様の整理!$C:$E,3,0),FIND(\"-\",VLOOKUP(DM1,仕様の整理!$C:$E,3,0))+1)-1),VLOOKUP(DM1,仕様の整理!$C:$E,3,0))","v":"KK-240029"},null,null,{"$f":"IF(LEN(VLOOKUP(DP1,仕様の整理!$C:$E,3,0))-LEN(SUBSTITUTE(VLOOKUP(DP1,仕様の整理!$C:$E,3,0),\"-\",\"\"))>=2,LEFT(VLOOKUP(DP1,仕様の整理!$C:$E,3,0),FIND(\"-\",VLOOKUP(DP1,仕様の整理!$C:$E,3,0),FIND(\"-\",VLOOKUP(DP1,仕様の整理!$C:$E,3,0))+1)-1),VLOOKUP(DP1,仕様の整理!$C:$E,3,0))","v":"KK-240029"},null,null,{"$f":"IF(LEN(VLOOKUP(DS1,仕様の整理!$C:$E,3,0))-LEN(SUBSTITUTE(VLOOKUP(DS1,仕様の整理!$C:$E,3,0),\"-\",\"\"))>=2,LEFT(VLOOKUP(DS1,仕様の整理!$C:$E,3,0),FIND(\"-\",VLOOKUP(DS1,仕様の整理!$C:$E,3,0),FIND(\"-\",VLOOKUP(DS1,仕様の整理!$C:$E,3,0))+1)-1),VLOOKUP(DS1,仕様の整理!$C:$E,3,0))","v":"KK-240067"},null,null,{"$f":"IF(LEN(VLOOKUP(DV1,仕様の整理!$C:$E,3,0))-LEN(SUBSTITUTE(VLOOKUP(DV1,仕様の整理!$C:$E,3,0),\"-\",\"\"))>=2,LEFT(VLOOKUP(DV1,仕様の整理!$C:$E,3,0),FIND(\"-\",VLOOKUP(DV1,仕様の整理!$C:$E,3,0),FIND(\"-\",VLOOKUP(DV1,仕様の整理!$C:$E,3,0))+1)-1),VLOOKUP(DV1,仕様の整理!$C:$E,3,0))","v":"KK-250012"},null,null,{"$f":"IF(LEN(VLOOKUP(DY1,仕様の整理!$C:$E,3,0))-LEN(SUBSTITUTE(VLOOKUP(DY1,仕様の整理!$C:$E,3,0),\"-\",\"\"))>=2,LEFT(VLOOKUP(DY1,仕様の整理!$C:$E,3,0),FIND(\"-\",VLOOKUP(DY1,仕様の整理!$C:$E,3,0),FIND(\"-\",VLOOKUP(DY1,仕様の整理!$C:$E,3,0))+1)-1),VLOOKUP(DY1,仕様の整理!$C:$E,3,0))","v":"KK-250043"},null,null,{"$f":"IF(LEN(VLOOKUP(EB1,仕様の整理!$C:$E,3,0))-LEN(SUBSTITUTE(VLOOKUP(EB1,仕様の整理!$C:$E,3,0),\"-\",\"\"))>=2,LEFT(VLOOKUP(EB1,仕様の整理!$C:$E,3,0),FIND(\"-\",VLOOKUP(EB1,仕様の整理!$C:$E,3,0),FIND(\"-\",VLOOKUP(EB1,仕様の整理!$C:$E,3,0))+1)-1),VLOOKUP(EB1,仕様の整理!$C:$E,3,0))","v":"KK-240019"},null,null,{"$f":"IF(LEN(VLOOKUP(EE1,仕様の整理!$C:$E,3,0))-LEN(SUBSTITUTE(VLOOKUP(EE1,仕様の整理!$C:$E,3,0),\"-\",\"\"))>=2,LEFT(VLOOKUP(EE1,仕様の整理!$C:$E,3,0),FIND(\"-\",VLOOKUP(EE1,仕様の整理!$C:$E,3,0),FIND(\"-\",VLOOKUP(EE1,仕様の整理!$C:$E,3,0))+1)-1),VLOOKUP(EE1,仕様の整理!$C:$E,3,0))","v":"CB-240020"}]
[null,null,null,null,null,{"$f":"IFERROR(\"作成日：\"&VLOOKUP(F$1,仕様の整理!$C:$S,6,0),\"-\")","v":"作成日：令和7年11月"},null,null,{"$f":"IFERROR(\"作成日：\"&VLOOKUP(I$1,仕様の整理!$C:$S,6,0),\"-\")","v":"作成日：令和7年11月"},null,null,{"$f":"IFERROR(\"作成日：\"&VLOOKUP(L$1,仕様の整理!$C:$S,6,0),\"-\")","v":"作成日：令和7年11月"},null,null,{"$f":"IFERROR(\"作成日：\"&VLOOKUP(O$1,仕様の整理!$C:$S,6,0),\"-\")","v":"作成日：令和7年11月"},null,null,{"$f":"IFERROR(\"作成日：\"&VLOOKUP(R$1,仕様の整理!$C:$S,6,0),\"-\")","v":"作成日：令和7年11月"},null,null,{"$f":"IFERROR(\"作成日：\"&VLOOKUP(U$1,仕様の整理!$C:$S,6,0),\"-\")","v":"作成日：令和7年11月"},null,null,{"$f":"IFERROR(\"作成日：\"&VLOOKUP(X$1,仕様の整理!$C:$S,6,0),\"-\")","v":"作成日：令和7年11月"},null,null,{"$f":"IFERROR(\"作成日：\"&VLOOKUP(AA$1,仕様の整理!$C:$S,6,0),\"-\")","v":"作成日：令和7年11月"},null,null,{"$f":"IFERROR(\"作成日：\"&VLOOKUP(AD$1,仕様の整理!$C:$S,6,0),\"-\")","v":"作成日：令和7年11月"},null,null,{"$f":"IFERROR(\"作成日：\"&VLOOKUP(AG$1,仕様の整理!$C:$S,6,0),\"-\")","v":"作成日：令和7年11月"},null,null,{"$f":"IFERROR(\"作成日：\"&VLOOKUP(AJ$1,仕様の整理!$C:$S,6,0),\"-\")","v":"作成日：令和7年11月"},null,null,{"$f":"IFERROR(\"作成日：\"&VLOOKUP(AM$1,仕様の整理!$C:$S,6,0),\"-\")","v":"作成日：令和7年11月"},null,null,{"$f":"IFERROR(\"作成日：\"&VLOOKUP(AP$1,仕様の整理!$C:$S,6,0),\"-\")","v":"作成日：令和7年11月"},null,null,{"$f":"IFERROR(\"作成日：\"&VLOOKUP(AS$1,仕様の整理!$C:$S,6,0),\"-\")","v":"作成日：令和7年11月"},null,null,{"$f":"IFERROR(\"作成日：\"&VLOOKUP(AV$1,仕様の整理!$C:$S,6,0),\"-\")","v":"作成日：令和7年11月"},null,null,{"$f":"IFERROR(\"作成日：\"&VLOOKUP(AY$1,仕様の整理!$C:$S,6,0),\"-\")","v":"作成日：令和7年11月"},null,null,{"$f":"IFERROR(\"作成日：\"&VLOOKUP(BB$1,仕様の整理!$C:$S,6,0),\"-\")","v":"作成日：令和7年11月"},null,null,{"$f":"IFERROR(\"作成日：\"&VLOOKUP(BE$1,仕様の整理!$C:$S,6,0),\"-\")","v":"作成日：令和7年11月"},null,null,{"$f":"IFERROR(\"作成日：\"&VLOOKUP(BH$1,仕様の整理!$C:$S,6,0),\"-\")","v":"作成日：令和7年11月"},null,null,{"$f":"IFERROR(\"作成日：\"&VLOOKUP(BK$1,仕様の整理!$C:$S,6,0),\"-\")","v":"作成日：令和7年11月"},null,null,{"$f":"IFERROR(\"作成日：\"&VLOOKUP(BN$1,仕様の整理!$C:$S,6,0),\"-\")","v":"作成日：令和7年11月"},null,null,{"$f":"IFERROR(\"作成日：\"&VLOOKUP(BQ$1,仕様の整理!$C:$S,6,0),\"-\")","v":"作成日：令和7年11月"},null,null,{"$f":"IFERROR(\"作成日：\"&VLOOKUP(BT$1,仕様の整理!$C:$S,6,0),\"-\")","v":"作成日：令和7年11月"},null,null,{"$f":"IFERROR(\"作成日：\"&VLOOKUP(BW$1,仕様の整理!$C:$S,6,0),\"-\")","v":"作成日：令和7年11月"},null,null,{"$f":"IFERROR(\"作成日：\"&VLOOKUP(BZ$1,仕様の整理!$C:$S,6,0),\"-\")","v":"作成日：令和7年11月"},null,null,{"$f":"IFERROR(\"作成日：\"&VLOOKUP(CC$1,仕様の整理!$C:$S,6,0),\"-\")","v":"作成日：令和7年11月"},null,null,{"$f":"IFERROR(\"作成日：\"&VLOOKUP(CF$1,仕様の整理!$C:$S,6,0),\"-\")","v":"作成日：令和7年11月"},null,null,{"$f":"IFERROR(\"作成日：\"&VLOOKUP(CI$1,仕様の整理!$C:$S,6,0),\"-\")","v":"作成日：令和7年11月"},null,null,{"$f":"IFERROR(\"作成日：\"&VLOOKUP(CL$1,仕様の整理!$C:$S,6,0),\"-\")","v":"作成日：令和7年12月"},null,null,{"$f":"IFERROR(\"作成日：\"&VLOOKUP(CO$1,仕様の整理!$C:$S,6,0),\"-\")","v":"作成日：令和7年12月"},null,null,{"$f":"IFERROR(\"作成日：\"&VLOOKUP(CR$1,仕様の整理!$C:$S,6,0),\"-\")","v":"作成日：令和7年12月"},null,null,{"$f":"IFERROR(\"作成日：\"&VLOOKUP(CU$1,仕様の整理!$C:$S,6,0),\"-\")","v":"作成日：令和7年12月"},null,null,{"$f":"IFERROR(\"作成日：\"&VLOOKUP(CX$1,仕様の整理!$C:$S,6,0),\"-\")","v":"作成日：令和7年12月"},null,null,{"$f":"IFERROR(\"作成日：\"&VLOOKUP(DA$1,仕様の整理!$C:$S,6,0),\"-\")","v":"作成日：令和7年12月"},null,null,{"$f":"IFERROR(\"作成日：\"&VLOOKUP(DD$1,仕様の整理!$C:$S,6,0),\"-\")","v":"作成日：令和7年12月"},null,null,{"$f":"IFERROR(\"作成日：\"&VLOOKUP(DG$1,仕様の整理!$C:$S,6,0),\"-\")","v":"作成日：令和7年12月"},null,null,{"$f":"IFERROR(\"作成日：\"&VLOOKUP(DJ$1,仕様の整理!$C:$S,6,0),\"-\")","v":"作成日：令和7年12月"},null,null,{"$f":"IFERROR(\"作成日：\"&VLOOKUP(DM$1,仕様の整理!$C:$S,6,0),\"-\")","v":"作成日：令和7年12月"},null,null,{"$f":"IFERROR(\"作成日：\"&VLOOKUP(DP$1,仕様の整理!$C:$S,6,0),\"-\")","v":"作成日：令和7年12月"},null,null,{"$f":"IFERROR(\"作成日：\"&VLOOKUP(DS$1,仕様の整理!$C:$S,6,0),\"-\")","v":"作成日：令和7年12月"},null,null,{"$f":"IFERROR(\"作成日：\"&VLOOKUP(DV$1,仕様の整理!$C:$S,6,0),\"-\")","v":"作成日：令和7年5月"},null,null,{"$f":"IFERROR(\"作成日：\"&VLOOKUP(DY$1,仕様の整理!$C:$S,6,0),\"-\")","v":"作成日：令和7年10月"},null,null,{"$f":"IFERROR(\"作成日：\"&VLOOKUP(EB$1,仕様の整理!$C:$S,6,0),\"-\")","v":"作成日：令和7年10月"},null,null,{"$f":"IFERROR(\"作成日：\"&VLOOKUP(EE$1,仕様の整理!$C:$S,6,0),\"-\")","v":"作成日：令和7年10月"}]
[null,null,null,null,null,{"$f":"IFERROR(\"施工方法：\"&VLOOKUP(F$1,仕様の整理!$C:$S,7,0),\"-\")","v":"施工方法：左官工法"},null,null,{"$f":"IFERROR(\"施工方法：\"&VLOOKUP(I$1,仕様の整理!$C:$S,7,0),\"-\")","v":"施工方法：吹付け工法（湿式）"},null,null,{"$f":"IFERROR(\"施工方法：\"&VLOOKUP(L$1,仕様の整理!$C:$S,7,0),\"-\")","v":"施工方法：充填工法"},null,null,{"$f":"IFERROR(\"施工方法：\"&VLOOKUP(O$1,仕様の整理!$C:$S,7,0),\"-\")","v":"施工方法：左官工法"},null,null,{"$f":"IFERROR(\"施工方法：\"&VLOOKUP(R$1,仕様の整理!$C:$S,7,0),\"-\")","v":"施工方法：吹付け工法（湿式）"},null,null,{"$f":"IFERROR(\"施工方法：\"&VLOOKUP(U$1,仕様の整理!$C:$S,7,0),\"-\")","v":"施工方法：左官工法"},null,null,{"$f":"IFERROR(\"施工方法：\"&VLOOKUP(X$1,仕様の整理!$C:$S,7,0),\"-\")","v":"施工方法：左官工法"},null,null,{"$f":"IFERROR(\"施工方法：\"&VLOOKUP(AA$1,仕様の整理!$C:$S,7,0),\"-\")","v":"施工方法：左官工法"},null,null,{"$f":"IFERROR(\"施工方法：\"&VLOOKUP(AD$1,仕様の整理!$C:$S,7,0),\"-\")","v":"施工方法：左官工法"},null,null,{"$f":"IFERROR(\"施工方法：\"&VLOOKUP(AG$1,仕様の整理!$C:$S,7,0),\"-\")","v":"施工方法：左官工法"},null,null,{"$f":"IFERROR(\"施工方法：\"&VLOOKUP(AJ$1,仕様の整理!$C:$S,7,0),\"-\")","v":"施工方法：左官工法"},null,null,{"$f":"IFERROR(\"施工方法：\"&VLOOKUP(AM$1,仕様の整理!$C:$S,7,0),\"-\")","v":"施工方法：吹付け工法（湿式）"},null,null,{"$f":"IFERROR(\"施工方法：\"&VLOOKUP(AP$1,仕様の整理!$C:$S,7,0),\"-\")","v":"施工方法：吹付け工法（乾式）"},null,null,{"$f":"IFERROR(\"施工方法：\"&VLOOKUP(AS$1,仕様の整理!$C:$S,7,0),\"-\")","v":"施工方法：吹付け工法"},null,null,{"$f":"IFERROR(\"施工方法：\"&VLOOKUP(AV$1,仕様の整理!$C:$S,7,0),\"-\")","v":"施工方法：左官工法"},null,null,{"$f":"IFERROR(\"施工方法：\"&VLOOKUP(AY$1,仕様の整理!$C:$S,7,0),\"-\")","v":"施工方法：左官工法"},null,null,{"$f":"IFERROR(\"施工方法：\"&VLOOKUP(BB$1,仕様の整理!$C:$S,7,0),\"-\")","v":"施工方法：左官工法"},null,null,{"$f":"IFERROR(\"施工方法：\"&VLOOKUP(BE$1,仕様の整理!$C:$S,7,0),\"-\")","v":"施工方法：左官工法"},null,null,{"$f":"IFERROR(\"施工方法：\"&VLOOKUP(BH$1,仕様の整理!$C:$S,7,0),\"-\")","v":"施工方法：吹付け工法"},null,null,{"$f":"IFERROR(\"施工方法：\"&VLOOKUP(BK$1,仕様の整理!$C:$S,7,0),\"-\")","v":"施工方法：左官工法"},null,null,{"$f":"IFERROR(\"施工方法：\"&VLOOKUP(BN$1,仕様の整理!$C:$S,7,0),\"-\")","v":"施工方法：吹付け工法"},null,null,{"$f":"IFERROR(\"施工方法：\"&VLOOKUP(BQ$1,仕様の整理!$C:$S,7,0),\"-\")","v":"施工方法：左官工法"},null,null,{"$f":"IFERROR(\"施工方法：\"&VLOOKUP(BT$1,仕様の整理!$C:$S,7,0),\"-\")","v":"施工方法：吹付け工法"},null,null,{"$f":"IFERROR(\"施工方法：\"&VLOOKUP(BW$1,仕様の整理!$C:$S,7,0),\"-\")","v":"施工方法：吹付け工法"},null,null,{"$f":"IFERROR(\"施工方法：\"&VLOOKUP(BZ$1,仕様の整理!$C:$S,7,0),\"-\")","v":"施工方法：充填工法"},null,null,{"$f":"IFERROR(\"施工方法：\"&VLOOKUP(CC$1,仕様の整理!$C:$S,7,0),\"-\")","v":"施工方法：左官工法"},null,null,{"$f":"IFERROR(\"施工方法：\"&VLOOKUP(CF$1,仕様の整理!$C:$S,7,0),\"-\")","v":"施工方法：左官工法"},null,null,{"$f":"IFERROR(\"施工方法：\"&VLOOKUP(CI$1,仕様の整理!$C:$S,7,0),\"-\")","v":"施工方法：左官工法"},null,null,{"$f":"IFERROR(\"施工方法：\"&VLOOKUP(CL$1,仕様の整理!$C:$S,7,0),\"-\")","v":"施工方法：充填工法"},null,null,{"$f":"IFERROR(\"施工方法：\"&VLOOKUP(CO$1,仕様の整理!$C:$S,7,0),\"-\")","v":"施工方法：左官工法"},null,null,{"$f":"IFERROR(\"施工方法：\"&VLOOKUP(CR$1,仕様の整理!$C:$S,7,0),\"-\")","v":"施工方法：吹付け工法"},null,null,{"$f":"IFERROR(\"施工方法：\"&VLOOKUP(CU$1,仕様の整理!$C:$S,7,0),\"-\")","v":"施工方法：左官工法"},null,null,{"$f":"IFERROR(\"施工方法：\"&VLOOKUP(CX$1,仕様の整理!$C:$S,7,0),\"-\")","v":"施工方法：吹付け工法"},null,null,{"$f":"IFERROR(\"施工方法：\"&VLOOKUP(DA$1,仕様の整理!$C:$S,7,0),\"-\")","v":"施工方法：左官工法"},null,null,{"$f":"IFERROR(\"施工方法：\"&VLOOKUP(DD$1,仕様の整理!$C:$S,7,0),\"-\")","v":"施工方法：左官工法"},null,null,{"$f":"IFERROR(\"施工方法：\"&VLOOKUP(DG$1,仕様の整理!$C:$S,7,0),\"-\")","v":"施工方法：左官工法"},null,null,{"$f":"IFERROR(\"施工方法：\"&VLOOKUP(DJ$1,仕様の整理!$C:$S,7,0),\"-\")","v":"施工方法：左官工法"},null,null,{"$f":"IFERROR(\"施工方法：\"&VLOOKUP(DM$1,仕様の整理!$C:$S,7,0),\"-\")","v":"施工方法：吹付け工法"},null,null,{"$f":"IFERROR(\"施工方法：\"&VLOOKUP(DP$1,仕様の整理!$C:$S,7,0),\"-\")","v":"施工方法：左官工法"},null,null,{"$f":"IFERROR(\"施工方法：\"&VLOOKUP(DS$1,仕様の整理!$C:$S,7,0),\"-\")","v":"施工方法：左官工法"},null,null,{"$f":"IFERROR(\"施工方法：\"&VLOOKUP(DV$1,仕様の整理!$C:$S,7,0),\"-\")","v":"施工方法：吹付け工法"},null,null,{"$f":"IFERROR(\"施工方法：\"&VLOOKUP(DY$1,仕様の整理!$C:$S,7,0),\"-\")","v":"施工方法：左官工法"},null,null,{"$f":"IFERROR(\"施工方法：\"&VLOOKUP(EB$1,仕様の整理!$C:$S,7,0),\"-\")","v":"施工方法：左官工法"},null,null,{"$f":"IFERROR(\"施工方法：\"&VLOOKUP(EE$1,仕様の整理!$C:$S,7,0),\"-\")","v":"施工方法：左官工法"}]
["ＮＥＴＩＳ情報","技術名",null,null,null,{"$f":"IF(VLOOKUP(F$1,仕様の整理!$C:$S,4,0)=\"NETIS掲載期間終了技術\",VLOOKUP(F$1,仕様の整理!$C:$S,2,0),VLOOKUP(F$1,仕様の整理!$C:$S,2,0)&\"（\"&VLOOKUP(F$1,仕様の整理!$C:$S,4,0)&\"）\")&IF(VLOOKUP(F$1,仕様の整理!$C:$S,5,0)=\"○\",\"\",\"《新規登録技術》\")","v":"N-SSI工法"},null,null,{"$f":"IF(VLOOKUP(I$1,仕様の整理!$C:$S,4,0)=\"NETIS掲載期間終了技術\",VLOOKUP(I$1,仕様の整理!$C:$S,2,0),VLOOKUP(I$1,仕様の整理!$C:$S,2,0)&\"（\"&VLOOKUP(I$1,仕様の整理!$C:$S,4,0)&\"）\")&IF(VLOOKUP(I$1,仕様の整理!$C:$S,5,0)=\"○\",\"\",\"《新規登録技術》\")","v":"N-SSI工法"},null,null,{"$f":"IF(VLOOKUP(L$1,仕様の整理!$C:$S,4,0)=\"NETIS掲載期間終了技術\",VLOOKUP(L$1,仕様の整理!$C:$S,2,0),VLOOKUP(L$1,仕様の整理!$C:$S,2,0)&\"（\"&VLOOKUP(L$1,仕様の整理!$C:$S,4,0)&\"）\")&IF(VLOOKUP(L$1,仕様の整理!$C:$S,5,0)=\"○\",\"\",\"《新規登録技術》\")","v":"N-SSI工法"},null,null,{"$f":"IF(VLOOKUP(O$1,仕様の整理!$C:$S,4,0)=\"NETIS掲載期間終了技術\",VLOOKUP(O$1,仕様の整理!$C:$S,2,0),VLOOKUP(O$1,仕様の整理!$C:$S,2,0)&\"（\"&VLOOKUP(O$1,仕様の整理!$C:$S,4,0)&\"）\")&IF(VLOOKUP(O$1,仕様の整理!$C:$S,5,0)=\"○\",\"\",\"《新規登録技術》\")","v":"高炉スラグ・繊維入りポリマーセメントモルタル「エフモル」"},null,null,{"$f":"IF(VLOOKUP(R$1,仕様の整理!$C:$S,4,0)=\"NETIS掲載期間終了技術\",VLOOKUP(R$1,仕様の整理!$C:$S,2,0),VLOOKUP(R$1,仕様の整理!$C:$S,2,0)&\"（\"&VLOOKUP(R$1,仕様の整理!$C:$S,4,0)&\"）\")&IF(VLOOKUP(R$1,仕様の整理!$C:$S,5,0)=\"○\",\"\",\"《新規登録技術》\")","v":"高炉スラグ・繊維入りポリマーセメントモルタル「エフモル」"},null,null,{"$f":"IF(VLOOKUP(U$1,仕様の整理!$C:$S,4,0)=\"NETIS掲載期間終了技術\",VLOOKUP(U$1,仕様の整理!$C:$S,2,0),VLOOKUP(U$1,仕様の整理!$C:$S,2,0)&\"（\"&VLOOKUP(U$1,仕様の整理!$C:$S,4,0)&\"）\")&IF(VLOOKUP(U$1,仕様の整理!$C:$S,5,0)=\"○\",\"\",\"《新規登録技術》\")","v":"NCショット（有用な新技術）"},null,null,{"$f":"IF(VLOOKUP(X$1,仕様の整理!$C:$S,4,0)=\"NETIS掲載期間終了技術\",VLOOKUP(X$1,仕様の整理!$C:$S,2,0),VLOOKUP(X$1,仕様の整理!$C:$S,2,0)&\"（\"&VLOOKUP(X$1,仕様の整理!$C:$S,4,0)&\"）\")&IF(VLOOKUP(X$1,仕様の整理!$C:$S,5,0)=\"○\",\"\",\"《新規登録技術》\")","v":"NCショット（有用な新技術）"},null,null,{"$f":"IF(VLOOKUP(AA$1,仕様の整理!$C:$S,4,0)=\"NETIS掲載期間終了技術\",VLOOKUP(AA$1,仕様の整理!$C:$S,2,0),VLOOKUP(AA$1,仕様の整理!$C:$S,2,0)&\"（\"&VLOOKUP(AA$1,仕様の整理!$C:$S,4,0)&\"）\")&IF(VLOOKUP(AA$1,仕様の整理!$C:$S,5,0)=\"○\",\"\",\"《新規登録技術》\")","v":"コンクリート構造物の断面修復材料「ゴムラテシリーズ」用モルタル）（有用な新技術）"},null,null,{"$f":"IF(VLOOKUP(AD$1,仕様の整理!$C:$S,4,0)=\"NETIS掲載期間終了技術\",VLOOKUP(AD$1,仕様の整理!$C:$S,2,0),VLOOKUP(AD$1,仕様の整理!$C:$S,2,0)&\"（\"&VLOOKUP(AD$1,仕様の整理!$C:$S,4,0)&\"）\")&IF(VLOOKUP(AD$1,仕様の整理!$C:$S,5,0)=\"○\",\"\",\"《新規登録技術》\")","v":"コンクリート構造物の断面修復材料「ゴムラテシリーズ」用モルタル）（有用な新技術）"},null,null,{"$f":"IF(VLOOKUP(AG$1,仕様の整理!$C:$S,4,0)=\"NETIS掲載期間終了技術\",VLOOKUP(AG$1,仕様の整理!$C:$S,2,0),VLOOKUP(AG$1,仕様の整理!$C:$S,2,0)&\"（\"&VLOOKUP(AG$1,仕様の整理!$C:$S,4,0)&\"）\")&IF(VLOOKUP(AG$1,仕様の整理!$C:$S,5,0)=\"○\",\"\",\"《新規登録技術》\")","v":"コンクリート構造物の断面修復材料「ゴムラテシリーズ」用モルタル）（有用な新技術）"},null,null,{"$f":"IF(VLOOKUP(AJ$1,仕様の整理!$C:$S,4,0)=\"NETIS掲載期間終了技術\",VLOOKUP(AJ$1,仕様の整理!$C:$S,2,0),VLOOKUP(AJ$1,仕様の整理!$C:$S,2,0)&\"（\"&VLOOKUP(AJ$1,仕様の整理!$C:$S,4,0)&\"）\")&IF(VLOOKUP(AJ$1,仕様の整理!$C:$S,5,0)=\"○\",\"\",\"《新規登録技術》\")","v":"塩害対策用断面修復材「デンカクロルフィックス」（事後評価済技術）"},null,null,{"$f":"IF(VLOOKUP(AM$1,仕様の整理!$C:$S,4,0)=\"NETIS掲載期間終了技術\",VLOOKUP(AM$1,仕様の整理!$C:$S,2,0),VLOOKUP(AM$1,仕様の整理!$C:$S,2,0)&\"（\"&VLOOKUP(AM$1,仕様の整理!$C:$S,4,0)&\"）\")&IF(VLOOKUP(AM$1,仕様の整理!$C:$S,5,0)=\"○\",\"\",\"《新規登録技術》\")","v":"塩害対策用断面修復材「デンカクロルフィックス」（事後評価済技術）"},null,null,{"$f":"IF(VLOOKUP(AP$1,仕様の整理!$C:$S,4,0)=\"NETIS掲載期間終了技術\",VLOOKUP(AP$1,仕様の整理!$C:$S,2,0),VLOOKUP(AP$1,仕様の整理!$C:$S,2,0)&\"（\"&VLOOKUP(AP$1,仕様の整理!$C:$S,4,0)&\"）\")&IF(VLOOKUP(AP$1,仕様の整理!$C:$S,5,0)=\"○\",\"\",\"《新規登録技術》\")","v":"コンクリート構造物の断面修復乾式吹付け工法"},null,null,{"$f":"IF(VLOOKUP(AS$1,仕様の整理!$C:$S,4,0)=\"NETIS掲載期間終了技術\",VLOOKUP(AS$1,仕様の整理!$C:$S,2,0),VLOOKUP(AS$1,仕様の整理!$C:$S,2,0)&\"（\"&VLOOKUP(AS$1,仕様の整理!$C:$S,4,0)&\"）\")&IF(VLOOKUP(AS$1,仕様の整理!$C:$S,5,0)=\"○\",\"\",\"《新規登録技術》\")","v":"LCユニット工法（事後評価未実施技術）"},null,null,{"$f":"IF(VLOOKUP(AV$1,仕様の整理!$C:$S,4,0)=\"NETIS掲載期間終了技術\",VLOOKUP(AV$1,仕様の整理!$C:$S,2,0),VLOOKUP(AV$1,仕様の整理!$C:$S,2,0)&\"（\"&VLOOKUP(AV$1,仕様の整理!$C:$S,4,0)&\"）\")&IF(VLOOKUP(AV$1,仕様の整理!$C:$S,5,0)=\"○\",\"\",\"《新規登録技術》\")","v":"繊維補強超速硬ポリマーセメントモルタル「リフレモルセットSF」（有用な新技術）"},null,null,{"$f":"IF(VLOOKUP(AY$1,仕様の整理!$C:$S,4,0)=\"NETIS掲載期間終了技術\",VLOOKUP(AY$1,仕様の整理!$C:$S,2,0),VLOOKUP(AY$1,仕様の整理!$C:$S,2,0)&\"（\"&VLOOKUP(AY$1,仕様の整理!$C:$S,4,0)&\"）\")&IF(VLOOKUP(AY$1,仕様の整理!$C:$S,5,0)=\"○\",\"\",\"《新規登録技術》\")","v":"湿潤面対応急速硬化補修材（事後評価未実施技術）"},null,null,{"$f":"IF(VLOOKUP(BB$1,仕様の整理!$C:$S,4,0)=\"NETIS掲載期間終了技術\",VLOOKUP(BB$1,仕様の整理!$C:$S,2,0),VLOOKUP(BB$1,仕様の整理!$C:$S,2,0)&\"（\"&VLOOKUP(BB$1,仕様の整理!$C:$S,4,0)&\"）\")&IF(VLOOKUP(BB$1,仕様の整理!$C:$S,5,0)=\"○\",\"\",\"《新規登録技術》\")","v":"速硬系ポリマーセメントモルタル「U-リペアパッチEX、U-リペアライトEX」（事後評価済技術）"},null,null,{"$f":"IF(VLOOKUP(BE$1,仕様の整理!$C:$S,4,0)=\"NETIS掲載期間終了技術\",VLOOKUP(BE$1,仕様の整理!$C:$S,2,0),VLOOKUP(BE$1,仕様の整理!$C:$S,2,0)&\"（\"&VLOOKUP(BE$1,仕様の整理!$C:$S,4,0)&\"）\")&IF(VLOOKUP(BE$1,仕様の整理!$C:$S,5,0)=\"○\",\"\",\"《新規登録技術》\")","v":"速硬系ポリマーセメントモルタル「U-リペアパッチEX、U-リペアライトEX」（事後評価済技術）"},null,null,{"$f":"IF(VLOOKUP(BH$1,仕様の整理!$C:$S,4,0)=\"NETIS掲載期間終了技術\",VLOOKUP(BH$1,仕様の整理!$C:$S,2,0),VLOOKUP(BH$1,仕様の整理!$C:$S,2,0)&\"（\"&VLOOKUP(BH$1,仕様の整理!$C:$S,4,0)&\"）\")&IF(VLOOKUP(BH$1,仕様の整理!$C:$S,5,0)=\"○\",\"\",\"《新規登録技術》\")","v":"エマルジョン型ポリマー乾式吹付け工法（事後評価済技術）"},null,null,{"$f":"IF(VLOOKUP(BK$1,仕様の整理!$C:$S,4,0)=\"NETIS掲載期間終了技術\",VLOOKUP(BK$1,仕様の整理!$C:$S,2,0),VLOOKUP(BK$1,仕様の整理!$C:$S,2,0)&\"（\"&VLOOKUP(BK$1,仕様の整理!$C:$S,4,0)&\"）\")&IF(VLOOKUP(BK$1,仕様の整理!$C:$S,5,0)=\"○\",\"\",\"《新規登録技術》\")","v":"セルガード（事後評価未実施技術）"},null,null,{"$f":"IF(VLOOKUP(BN$1,仕様の整理!$C:$S,4,0)=\"NETIS掲載期間終了技術\",VLOOKUP(BN$1,仕様の整理!$C:$S,2,0),VLOOKUP(BN$1,仕様の整理!$C:$S,2,0)&\"（\"&VLOOKUP(BN$1,仕様の整理!$C:$S,4,0)&\"）\")&IF(VLOOKUP(BN$1,仕様の整理!$C:$S,5,0)=\"○\",\"\",\"《新規登録技術》\")","v":"セルガード（事後評価未実施技術）"},null,null,{"$f":"IF(VLOOKUP(BQ$1,仕様の整理!$C:$S,4,0)=\"NETIS掲載期間終了技術\",VLOOKUP(BQ$1,仕様の整理!$C:$S,2,0),VLOOKUP(BQ$1,仕様の整理!$C:$S,2,0)&\"（\"&VLOOKUP(BQ$1,仕様の整理!$C:$S,4,0)&\"）\")&IF(VLOOKUP(BQ$1,仕様の整理!$C:$S,5,0)=\"○\",\"\",\"《新規登録技術》\")","v":"高耐久性断面修復工法「タフショットクリート工法」（事後評価未実施技術）"},null,null,{"$f":"IF(VLOOKUP(BT$1,仕様の整理!$C:$S,4,0)=\"NETIS掲載期間終了技術\",VLOOKUP(BT$1,仕様の整理!$C:$S,2,0),VLOOKUP(BT$1,仕様の整理!$C:$S,2,0)&\"（\"&VLOOKUP(BT$1,仕様の整理!$C:$S,4,0)&\"）\")&IF(VLOOKUP(BT$1,仕様の整理!$C:$S,5,0)=\"○\",\"\",\"《新規登録技術》\")","v":"高耐久性断面修復工法「タフショットクリート工法」（事後評価未実施技術）"},null,null,{"$f":"IF(VLOOKUP(BW$1,仕様の整理!$C:$S,4,0)=\"NETIS掲載期間終了技術\",VLOOKUP(BW$1,仕様の整理!$C:$S,2,0),VLOOKUP(BW$1,仕様の整理!$C:$S,2,0)&\"（\"&VLOOKUP(BW$1,仕様の整理!$C:$S,4,0)&\"）\")&IF(VLOOKUP(BW$1,仕様の整理!$C:$S,5,0)=\"○\",\"\",\"《新規登録技術》\")","v":"塩分吸着型 乾式吹付工法（事後評価未実施技術）"},null,null,{"$f":"IF(VLOOKUP(BZ$1,仕様の整理!$C:$S,4,0)=\"NETIS掲載期間終了技術\",VLOOKUP(BZ$1,仕様の整理!$C:$S,2,0),VLOOKUP(BZ$1,仕様の整理!$C:$S,2,0)&\"（\"&VLOOKUP(BZ$1,仕様の整理!$C:$S,4,0)&\"）\")&IF(VLOOKUP(BZ$1,仕様の整理!$C:$S,5,0)=\"○\",\"\",\"《新規登録技術》\")","v":"パワーグラウト(自己治癒補修材)（事後評価未実施技術）"},null,null,{"$f":"IF(VLOOKUP(CC$1,仕様の整理!$C:$S,4,0)=\"NETIS掲載期間終了技術\",VLOOKUP(CC$1,仕様の整理!$C:$S,2,0),VLOOKUP(CC$1,仕様の整理!$C:$S,2,0)&\"（\"&VLOOKUP(CC$1,仕様の整理!$C:$S,4,0)&\"）\")&IF(VLOOKUP(CC$1,仕様の整理!$C:$S,5,0)=\"○\",\"\",\"《新規登録技術》\")","v":"耐塩害タイプポリマーセメントモルタル「U-リペアパッチCT」（事後評価未実施技術）"},null,null,{"$f":"IF(VLOOKUP(CF$1,仕様の整理!$C:$S,4,0)=\"NETIS掲載期間終了技術\",VLOOKUP(CF$1,仕様の整理!$C:$S,2,0),VLOOKUP(CF$1,仕様の整理!$C:$S,2,0)&\"（\"&VLOOKUP(CF$1,仕様の整理!$C:$S,4,0)&\"）\")&IF(VLOOKUP(CF$1,仕様の整理!$C:$S,5,0)=\"○\",\"\",\"《新規登録技術》\")","v":"亜硝酸リチウム併用型断面修復工法「リハビリ断面修復工法」（事後評価未実施技術）"},null,null,{"$f":"IF(VLOOKUP(CI$1,仕様の整理!$C:$S,4,0)=\"NETIS掲載期間終了技術\",VLOOKUP(CI$1,仕様の整理!$C:$S,2,0),VLOOKUP(CI$1,仕様の整理!$C:$S,2,0)&\"（\"&VLOOKUP(CI$1,仕様の整理!$C:$S,4,0)&\"）\")&IF(VLOOKUP(CI$1,仕様の整理!$C:$S,5,0)=\"○\",\"\",\"《新規登録技術》\")","v":"CPJ-L（コンパクトジェット－L）（事後評価未実施技術）"},null,null,{"$f":"IF(VLOOKUP(CL$1,仕様の整理!$C:$S,4,0)=\"NETIS掲載期間終了技術\",VLOOKUP(CL$1,仕様の整理!$C:$S,2,0),VLOOKUP(CL$1,仕様の整理!$C:$S,2,0)&\"（\"&VLOOKUP(CL$1,仕様の整理!$C:$S,4,0)&\"）\")&IF(VLOOKUP(CL$1,仕様の整理!$C:$S,5,0)=\"○\",\"\",\"《新規登録技術》\")","v":"ポリマーセメント系無収縮グラウト材「プレユーロックスDXP」（事後評価未実施技術）"},null,null,{"$f":"IF(VLOOKUP(CO$1,仕様の整理!$C:$S,4,0)=\"NETIS掲載期間終了技術\",VLOOKUP(CO$1,仕様の整理!$C:$S,2,0),VLOOKUP(CO$1,仕様の整理!$C:$S,2,0)&\"（\"&VLOOKUP(CO$1,仕様の整理!$C:$S,4,0)&\"）\")&IF(VLOOKUP(CO$1,仕様の整理!$C:$S,5,0)=\"○\",\"\",\"《新規登録技術》\")","v":"HI-SPECシール工法（事後評価未実施技術）"},null,null,{"$f":"IF(VLOOKUP(CR$1,仕様の整理!$C:$S,4,0)=\"NETIS掲載期間終了技術\",VLOOKUP(CR$1,仕様の整理!$C:$S,2,0),VLOOKUP(CR$1,仕様の整理!$C:$S,2,0)&\"（\"&VLOOKUP(CR$1,仕様の整理!$C:$S,4,0)&\"）\")&IF(VLOOKUP(CR$1,仕様の整理!$C:$S,5,0)=\"○\",\"\",\"《新規登録技術》\")","v":"HI-SPECシール工法（事後評価未実施技術）"},null,null,{"$f":"IF(VLOOKUP(CU$1,仕様の整理!$C:$S,4,0)=\"NETIS掲載期間終了技術\",VLOOKUP(CU$1,仕様の整理!$C:$S,2,0),VLOOKUP(CU$1,仕様の整理!$C:$S,2,0)&\"（\"&VLOOKUP(CU$1,仕様の整理!$C:$S,4,0)&\"）\")&IF(VLOOKUP(CU$1,仕様の整理!$C:$S,5,0)=\"○\",\"\",\"《新規登録技術》\")","v":"断面修復材の施工間隔の短縮を図る「リプロクイック工法」（事後評価未実施技術）"},null,null,{"$f":"IF(VLOOKUP(CX$1,仕様の整理!$C:$S,4,0)=\"NETIS掲載期間終了技術\",VLOOKUP(CX$1,仕様の整理!$C:$S,2,0),VLOOKUP(CX$1,仕様の整理!$C:$S,2,0)&\"（\"&VLOOKUP(CX$1,仕様の整理!$C:$S,4,0)&\"）\")&IF(VLOOKUP(CX$1,仕様の整理!$C:$S,5,0)=\"○\",\"\",\"《新規登録技術》\")","v":"断面修復材の施工間隔の短縮を図る「リプロクイック工法」（事後評価未実施技術）"},null,null,{"$f":"IF(VLOOKUP(DA$1,仕様の整理!$C:$S,4,0)=\"NETIS掲載期間終了技術\",VLOOKUP(DA$1,仕様の整理!$C:$S,2,0),VLOOKUP(DA$1,仕様の整理!$C:$S,2,0)&\"（\"&VLOOKUP(DA$1,仕様の整理!$C:$S,4,0)&\"）\")&IF(VLOOKUP(DA$1,仕様の整理!$C:$S,5,0)=\"○\",\"\",\"《新規登録技術》\")","v":"コンクリ欠損部補強066（事後評価未実施技術）"},null,null,{"$f":"IF(VLOOKUP(DD$1,仕様の整理!$C:$S,4,0)=\"NETIS掲載期間終了技術\",VLOOKUP(DD$1,仕様の整理!$C:$S,2,0),VLOOKUP(DD$1,仕様の整理!$C:$S,2,0)&\"（\"&VLOOKUP(DD$1,仕様の整理!$C:$S,4,0)&\"）\")&IF(VLOOKUP(DD$1,仕様の整理!$C:$S,5,0)=\"○\",\"\",\"《新規登録技術》\")","v":"ジェットモルタルシリーズ（事後評価未実施技術）"},null,null,{"$f":"IF(VLOOKUP(DG$1,仕様の整理!$C:$S,4,0)=\"NETIS掲載期間終了技術\",VLOOKUP(DG$1,仕様の整理!$C:$S,2,0),VLOOKUP(DG$1,仕様の整理!$C:$S,2,0)&\"（\"&VLOOKUP(DG$1,仕様の整理!$C:$S,4,0)&\"）\")&IF(VLOOKUP(DG$1,仕様の整理!$C:$S,5,0)=\"○\",\"\",\"《新規登録技術》\")","v":"ジェットモルタルシリーズ（事後評価未実施技術）"},null,null,{"$f":"IF(VLOOKUP(DJ$1,仕様の整理!$C:$S,4,0)=\"NETIS掲載期間終了技術\",VLOOKUP(DJ$1,仕様の整理!$C:$S,2,0),VLOOKUP(DJ$1,仕様の整理!$C:$S,2,0)&\"（\"&VLOOKUP(DJ$1,仕様の整理!$C:$S,4,0)&\"）\")&IF(VLOOKUP(DJ$1,仕様の整理!$C:$S,5,0)=\"○\",\"\",\"《新規登録技術》\")","v":"ジェットモルタルシリーズ（事後評価未実施技術）"},null,null,{"$f":"IF(VLOOKUP(DM$1,仕様の整理!$C:$S,4,0)=\"NETIS掲載期間終了技術\",VLOOKUP(DM$1,仕様の整理!$C:$S,2,0),VLOOKUP(DM$1,仕様の整理!$C:$S,2,0)&\"（\"&VLOOKUP(DM$1,仕様の整理!$C:$S,4,0)&\"）\")&IF(VLOOKUP(DM$1,仕様の整理!$C:$S,5,0)=\"○\",\"\",\"《新規登録技術》\")","v":"断面修復工法「エアショットワン」（事後評価未実施技術）"},null,null,{"$f":"IF(VLOOKUP(DP$1,仕様の整理!$C:$S,4,0)=\"NETIS掲載期間終了技術\",VLOOKUP(DP$1,仕様の整理!$C:$S,2,0),VLOOKUP(DP$1,仕様の整理!$C:$S,2,0)&\"（\"&VLOOKUP(DP$1,仕様の整理!$C:$S,4,0)&\"）\")&IF(VLOOKUP(DP$1,仕様の整理!$C:$S,5,0)=\"○\",\"\",\"《新規登録技術》\")","v":"断面修復工法「エアショットワン」（事後評価未実施技術）"},null,null,{"$f":"IF(VLOOKUP(DS$1,仕様の整理!$C:$S,4,0)=\"NETIS掲載期間終了技術\",VLOOKUP(DS$1,仕様の整理!$C:$S,2,0),VLOOKUP(DS$1,仕様の整理!$C:$S,2,0)&\"（\"&VLOOKUP(DS$1,仕様の整理!$C:$S,4,0)&\"）\")&IF(VLOOKUP(DS$1,仕様の整理!$C:$S,5,0)=\"○\",\"\",\"《新規登録技術》\")","v":"耐摩耗性を向上させた水路補修用「ショウワRP-1工法」（事後評価未実施技術）"},null,null,{"$f":"IF(VLOOKUP(DV$1,仕様の整理!$C:$S,4,0)=\"NETIS掲載期間終了技術\",VLOOKUP(DV$1,仕様の整理!$C:$S,2,0),VLOOKUP(DV$1,仕様の整理!$C:$S,2,0)&\"（\"&VLOOKUP(DV$1,仕様の整理!$C:$S,4,0)&\"）\")&IF(VLOOKUP(DV$1,仕様の整理!$C:$S,5,0)=\"○\",\"\",\"《新規登録技術》\")","v":"シラン系鉄筋腐食抑制混和剤「プロテクトシル＠ WA CIT」（事後評価未実施技術）《新規登録技術》"},null,null,{"$f":"IF(VLOOKUP(DY$1,仕様の整理!$C:$S,4,0)=\"NETIS掲載期間終了技術\",VLOOKUP(DY$1,仕様の整理!$C:$S,2,0),VLOOKUP(DY$1,仕様の整理!$C:$S,2,0)&\"（\"&VLOOKUP(DY$1,仕様の整理!$C:$S,4,0)&\"）\")&IF(VLOOKUP(DY$1,仕様の整理!$C:$S,5,0)=\"○\",\"\",\"《新規登録技術》\")","v":"低炭素型無収縮モルタル「プレユーロックス GX」（事後評価未実施技術）《新規登録技術》"},null,null,{"$f":"IF(VLOOKUP(EB$1,仕様の整理!$C:$S,4,0)=\"NETIS掲載期間終了技術\",VLOOKUP(EB$1,仕様の整理!$C:$S,2,0),VLOOKUP(EB$1,仕様の整理!$C:$S,2,0)&\"（\"&VLOOKUP(EB$1,仕様の整理!$C:$S,4,0)&\"）\")&IF(VLOOKUP(EB$1,仕様の整理!$C:$S,5,0)=\"○\",\"\",\"《新規登録技術》\")","v":"水溶性錆転換型防錆プライマー「リプロチェンジコート」（事後評価未実施技術）《新規登録技術》"},null,null,{"$f":"IF(VLOOKUP(EE$1,仕様の整理!$C:$S,4,0)=\"NETIS掲載期間終了技術\",VLOOKUP(EE$1,仕様の整理!$C:$S,2,0),VLOOKUP(EE$1,仕様の整理!$C:$S,2,0)&\"（\"&VLOOKUP(EE$1,仕様の整理!$C:$S,4,0)&\"）\")&IF(VLOOKUP(EE$1,仕様の整理!$C:$S,5,0)=\"○\",\"\",\"《新規登録技術》\")","v":"複合型ケイ酸塩系鉄筋防錆材「リフレ防錆コートZN」（事後評価未実施技術）《新規登録技術》"}]
[null,"①","ＮＥＴＩＳ登録番号",null,null,{"$f":"IF(VLOOKUP(F$1,仕様の整理!$C:$J,4,0)=\"NETIS掲載期間終了技術\",\"NETIS掲載期間終了技術\",VLOOKUP(F$1,仕様の整理!$C:$J,3,0))","v":"NETIS掲載期間終了技術"},null,null,{"$f":"IF(VLOOKUP(I$1,仕様の整理!$C:$J,4,0)=\"NETIS掲載期間終了技術\",\"NETIS掲載期間終了技術\",VLOOKUP(I$1,仕様の整理!$C:$J,3,0))","v":"NETIS掲載期間終了技術"},null,null,{"$f":"IF(VLOOKUP(L$1,仕様の整理!$C:$J,4,0)=\"NETIS掲載期間終了技術\",\"NETIS掲載期間終了技術\",VLOOKUP(L$1,仕様の整理!$C:$J,3,0))","v":"NETIS掲載期間終了技術"},null,null,{"$f":"IF(VLOOKUP(O$1,仕様の整理!$C:$J,4,0)=\"NETIS掲載期間終了技術\",\"NETIS掲載期間終了技術\",VLOOKUP(O$1,仕様の整理!$C:$J,3,0))","v":"NETIS掲載期間終了技術"},null,null,{"$f":"IF(VLOOKUP(R$1,仕様の整理!$C:$J,4,0)=\"NETIS掲載期間終了技術\",\"NETIS掲載期間終了技術\",VLOOKUP(R$1,仕様の整理!$C:$J,3,0))","v":"NETIS掲載期間終了技術"},null,null,{"$f":"IF(VLOOKUP(U$1,仕様の整理!$C:$J,4,0)=\"NETIS掲載期間終了技術\",\"NETIS掲載期間終了技術\",VLOOKUP(U$1,仕様の整理!$C:$J,3,0))","v":"QS-150001-VE"},null,null,{"$f":"IF(VLOOKUP(X$1,仕様の整理!$C:$J,4,0)=\"NETIS掲載期間終了技術\",\"NETIS掲載期間終了技術\",VLOOKUP(X$1,仕様の整理!$C:$J,3,0))","v":"QS-150001-VE"},null,null,{"$f":"IF(VLOOKUP(AA$1,仕様の整理!$C:$J,4,0)=\"NETIS掲載期間終了技術\",\"NETIS掲載期間終了技術\",VLOOKUP(AA$1,仕様の整理!$C:$J,3,0))","v":"QS-150017-VE"},null,null,{"$f":"IF(VLOOKUP(AD$1,仕様の整理!$C:$J,4,0)=\"NETIS掲載期間終了技術\",\"NETIS掲載期間終了技術\",VLOOKUP(AD$1,仕様の整理!$C:$J,3,0))","v":"QS-150017-VE"},null,null,{"$f":"IF(VLOOKUP(AG$1,仕様の整理!$C:$J,4,0)=\"NETIS掲載期間終了技術\",\"NETIS掲載期間終了技術\",VLOOKUP(AG$1,仕様の整理!$C:$J,3,0))","v":"QS-150017-VE"},null,null,{"$f":"IF(VLOOKUP(AJ$1,仕様の整理!$C:$J,4,0)=\"NETIS掲載期間終了技術\",\"NETIS掲載期間終了技術\",VLOOKUP(AJ$1,仕様の整理!$C:$J,3,0))","v":"KT-150080-VR"},null,null,{"$f":"IF(VLOOKUP(AM$1,仕様の整理!$C:$J,4,0)=\"NETIS掲載期間終了技術\",\"NETIS掲載期間終了技術\",VLOOKUP(AM$1,仕様の整理!$C:$J,3,0))","v":"KT-150080-VR"},null,null,{"$f":"IF(VLOOKUP(AP$1,仕様の整理!$C:$J,4,0)=\"NETIS掲載期間終了技術\",\"NETIS掲載期間終了技術\",VLOOKUP(AP$1,仕様の整理!$C:$J,3,0))","v":"NETIS掲載期間終了技術"},null,null,{"$f":"IF(VLOOKUP(AS$1,仕様の整理!$C:$J,4,0)=\"NETIS掲載期間終了技術\",\"NETIS掲載期間終了技術\",VLOOKUP(AS$1,仕様の整理!$C:$J,3,0))","v":"SK-170011-A"},null,null,{"$f":"IF(VLOOKUP(AV$1,仕様の整理!$C:$J,4,0)=\"NETIS掲載期間終了技術\",\"NETIS掲載期間終了技術\",VLOOKUP(AV$1,仕様の整理!$C:$J,3,0))","v":"KT-170058-VE"},null,null,{"$f":"IF(VLOOKUP(AY$1,仕様の整理!$C:$J,4,0)=\"NETIS掲載期間終了技術\",\"NETIS掲載期間終了技術\",VLOOKUP(AY$1,仕様の整理!$C:$J,3,0))","v":"KT-170061-A"},null,null,{"$f":"IF(VLOOKUP(BB$1,仕様の整理!$C:$J,4,0)=\"NETIS掲載期間終了技術\",\"NETIS掲載期間終了技術\",VLOOKUP(BB$1,仕様の整理!$C:$J,3,0))","v":"TH-180003-VE"},null,null,{"$f":"IF(VLOOKUP(BE$1,仕様の整理!$C:$J,4,0)=\"NETIS掲載期間終了技術\",\"NETIS掲載期間終了技術\",VLOOKUP(BE$1,仕様の整理!$C:$J,3,0))","v":"TH-180003-VE"},null,null,{"$f":"IF(VLOOKUP(BH$1,仕様の整理!$C:$J,4,0)=\"NETIS掲載期間終了技術\",\"NETIS掲載期間終了技術\",VLOOKUP(BH$1,仕様の整理!$C:$J,3,0))","v":"KTK-180004-VE"},null,null,{"$f":"IF(VLOOKUP(BK$1,仕様の整理!$C:$J,4,0)=\"NETIS掲載期間終了技術\",\"NETIS掲載期間終了技術\",VLOOKUP(BK$1,仕様の整理!$C:$J,3,0))","v":"KT-180077-A"},null,null,{"$f":"IF(VLOOKUP(BN$1,仕様の整理!$C:$J,4,0)=\"NETIS掲載期間終了技術\",\"NETIS掲載期間終了技術\",VLOOKUP(BN$1,仕様の整理!$C:$J,3,0))","v":"KT-180077-A"},null,null,{"$f":"IF(VLOOKUP(BQ$1,仕様の整理!$C:$J,4,0)=\"NETIS掲載期間終了技術\",\"NETIS掲載期間終了技術\",VLOOKUP(BQ$1,仕様の整理!$C:$J,3,0))","v":"QS-180044-A"},null,null,{"$f":"IF(VLOOKUP(BT$1,仕様の整理!$C:$J,4,0)=\"NETIS掲載期間終了技術\",\"NETIS掲載期間終了技術\",VLOOKUP(BT$1,仕様の整理!$C:$J,3,0))","v":"QS-180044-A"},null,null,{"$f":"IF(VLOOKUP(BW$1,仕様の整理!$C:$J,4,0)=\"NETIS掲載期間終了技術\",\"NETIS掲載期間終了技術\",VLOOKUP(BW$1,仕様の整理!$C:$J,3,0))","v":"KT-190023-A"},null,null,{"$f":"IF(VLOOKUP(BZ$1,仕様の整理!$C:$J,4,0)=\"NETIS掲載期間終了技術\",\"NETIS掲載期間終了技術\",VLOOKUP(BZ$1,仕様の整理!$C:$J,3,0))","v":"QS-190036-A"},null,null,{"$f":"IF(VLOOKUP(CC$1,仕様の整理!$C:$J,4,0)=\"NETIS掲載期間終了技術\",\"NETIS掲載期間終了技術\",VLOOKUP(CC$1,仕様の整理!$C:$J,3,0))","v":"CG-200019-A"},null,null,{"$f":"IF(VLOOKUP(CF$1,仕様の整理!$C:$J,4,0)=\"NETIS掲載期間終了技術\",\"NETIS掲載期間終了技術\",VLOOKUP(CF$1,仕様の整理!$C:$J,3,0))","v":"CG-220003-A"},null,null,{"$f":"IF(VLOOKUP(CI$1,仕様の整理!$C:$J,4,0)=\"NETIS掲載期間終了技術\",\"NETIS掲載期間終了技術\",VLOOKUP(CI$1,仕様の整理!$C:$J,3,0))","v":"CG-230003-A"},null,null,{"$f":"IF(VLOOKUP(CL$1,仕様の整理!$C:$J,4,0)=\"NETIS掲載期間終了技術\",\"NETIS掲載期間終了技術\",VLOOKUP(CL$1,仕様の整理!$C:$J,3,0))","v":"KK-230050-A"},null,null,{"$f":"IF(VLOOKUP(CO$1,仕様の整理!$C:$J,4,0)=\"NETIS掲載期間終了技術\",\"NETIS掲載期間終了技術\",VLOOKUP(CO$1,仕様の整理!$C:$J,3,0))","v":"KK-230060-A"},null,null,{"$f":"IF(VLOOKUP(CR$1,仕様の整理!$C:$J,4,0)=\"NETIS掲載期間終了技術\",\"NETIS掲載期間終了技術\",VLOOKUP(CR$1,仕様の整理!$C:$J,3,0))","v":"KK-230060-A"},null,null,{"$f":"IF(VLOOKUP(CU$1,仕様の整理!$C:$J,4,0)=\"NETIS掲載期間終了技術\",\"NETIS掲載期間終了技術\",VLOOKUP(CU$1,仕様の整理!$C:$J,3,0))","v":"KK-230077-A"},null,null,{"$f":"IF(VLOOKUP(CX$1,仕様の整理!$C:$J,4,0)=\"NETIS掲載期間終了技術\",\"NETIS掲載期間終了技術\",VLOOKUP(CX$1,仕様の整理!$C:$J,3,0))","v":"KK-230077-A"},null,null,{"$f":"IF(VLOOKUP(DA$1,仕様の整理!$C:$J,4,0)=\"NETIS掲載期間終了技術\",\"NETIS掲載期間終了技術\",VLOOKUP(DA$1,仕様の整理!$C:$J,3,0))","v":"KT-240012-A"},null,null,{"$f":"IF(VLOOKUP(DD$1,仕様の整理!$C:$J,4,0)=\"NETIS掲載期間終了技術\",\"NETIS掲載期間終了技術\",VLOOKUP(DD$1,仕様の整理!$C:$J,3,0))","v":"KT-240042-A"},null,null,{"$f":"IF(VLOOKUP(DG$1,仕様の整理!$C:$J,4,0)=\"NETIS掲載期間終了技術\",\"NETIS掲載期間終了技術\",VLOOKUP(DG$1,仕様の整理!$C:$J,3,0))","v":"KT-240042-A"},null,null,{"$f":"IF(VLOOKUP(DJ$1,仕様の整理!$C:$J,4,0)=\"NETIS掲載期間終了技術\",\"NETIS掲載期間終了技術\",VLOOKUP(DJ$1,仕様の整理!$C:$J,3,0))","v":"KT-240042-A"},null,null,{"$f":"IF(VLOOKUP(DM$1,仕様の整理!$C:$J,4,0)=\"NETIS掲載期間終了技術\",\"NETIS掲載期間終了技術\",VLOOKUP(DM$1,仕様の整理!$C:$J,3,0))","v":"KK-240029-A"},null,null,{"$f":"IF(VLOOKUP(DP$1,仕様の整理!$C:$J,4,0)=\"NETIS掲載期間終了技術\",\"NETIS掲載期間終了技術\",VLOOKUP(DP$1,仕様の整理!$C:$J,3,0))","v":"KK-240029-A"},null,null,{"$f":"IF(VLOOKUP(DS$1,仕様の整理!$C:$J,4,0)=\"NETIS掲載期間終了技術\",\"NETIS掲載期間終了技術\",VLOOKUP(DS$1,仕様の整理!$C:$J,3,0))","v":"KK-240067-A"},null,null,{"$f":"IF(VLOOKUP(DV$1,仕様の整理!$C:$J,4,0)=\"NETIS掲載期間終了技術\",\"NETIS掲載期間終了技術\",VLOOKUP(DV$1,仕様の整理!$C:$J,3,0))","v":"KK-250012-A"},null,null,{"$f":"IF(VLOOKUP(DY$1,仕様の整理!$C:$J,4,0)=\"NETIS掲載期間終了技術\",\"NETIS掲載期間終了技術\",VLOOKUP(DY$1,仕様の整理!$C:$J,3,0))","v":"KK-250043-A"},null,null,{"$f":"IF(VLOOKUP(EB$1,仕様の整理!$C:$J,4,0)=\"NETIS掲載期間終了技術\",\"NETIS掲載期間終了技術\",VLOOKUP(EB$1,仕様の整理!$C:$J,3,0))","v":"KK-240019-A"},null,null,{"$f":"IF(VLOOKUP(EE$1,仕様の整理!$C:$J,4,0)=\"NETIS掲載期間終了技術\",\"NETIS掲載期間終了技術\",VLOOKUP(EE$1,仕様の整理!$C:$J,3,0))","v":"CB-240020-A"}]
[null,"②","技術の位置付け（有用な新技術）",null,null,"[活用促進]",null,null,"[活用促進]",null,null,"[活用促進]",null,null,"評価済み",null,null,"評価済み",null,null,"[活用促進]",null,null,"[活用促進]",null,null,"[活用促進]",null,null,"[活用促進]",null,null,"[活用促進]",null,null,"-",null,null,"-",null,null,"[活用促進]",null,null,"-",null,null,"[活用促進]",null,null,"-",null,null,"-",null,null,"-",null,null,"-",null,null,"-",null,null,"-",null,null,"-",null,null,"-",null,null,"-",null,null,"-",null,null,"-",null,null,"-",null,null,"-",null,null,"-",null,null,"-",null,null,"-",null,null,"-",null,null,"-",null,null,"-",null,null,"-",null,null,"-",null,null,"-",null,null,"-",null,null,"-",null,null,"-",null,null,"-",null,null,"-",null,null,"-",null,null,"-"]
[null,"③","開発者（本社が存在する都道府県）",null,null,"株式会社ジェイアール総研エンジニアリング",null,null,"株式会社ジェイアール総研エンジニアリング",null,null,"株式会社ジェイアール総研エンジニアリング",null,null,"株式会社南組（北海道）",null,null,"株式会社南組（北海道）",null,null,"二瀬窯業株式会社（福岡県）",null,null,"二瀬窯業株式会社（福岡県）",null,null,"太平洋マテリアル株式会社（東京都）",null,null,"太平洋マテリアル株式会社（東京都）",null,null,"太平洋マテリアル株式会社（東京都）",null,null,"デンカ株式会社（東京都）",null,null,"デンカ株式会社（東京都）",null,null,"株式会社クリテック・ジャパン（東京都）",null,null,"株式会社岬産業（香川県）",null,null,"住友大阪セメント株式会社（東京都）",null,null," 昭和電工株式会社（東京都）",null,null,"宇部興産建材株式会社（東京都、山口県）",null,null,"宇部興産建材株式会社（東京都、山口県）",null,null,"東和耐火工業株式会社（東京都）、住友大阪セメント株式会社（東京都）、株式会社エステック（大阪府）",null,null,"ペガサス株式会社（東京都）",null,null,"ペガサス株式会社（東京都）",null,null,"株式会社大林組（東京都）、宇部興産建材株式会社（東京都、山口県）",null,null,"株式会社大林組（東京都）、宇部興産建材株式会社（東京都、山口県）",null,null,"StoCretec Japan 株式会社（東京都）",null,null,"株式会社CORE技術研究所(大阪府）",null,null,"宇部興産建材株式会社(東京都)",null,null,"福徳技研株式会社（広島県）、極東興和株式会社（広島県）、井上建設株式会社（広島県）、株式会社CORE技術研究所（大阪府）",null,null,"ショーボンド建設株式会社（東京都）",null,null,"太平洋マテリアル株式会社（東京都）",null,null,"株式会社アイゾールテクニカ（大阪府）、阪神高速道路株式会社（大阪府）",null,null,"株式会社アイゾールテクニカ（大阪府）、阪神高速道路株式会社（大阪府）",null,null,"信越産業株式会社（東京都）",null,null,"信越産業株式会社（東京都）",null,null,"株式会社染めQテクノロジィ(茨城県)",null,null,"小野田ケミコ株式会社（東京都）",null,null,"小野田ケミコ株式会社（東京都）",null,null,"小野田ケミコ株式会社（東京都）",null,null,"太平洋マテリアル株式会社（東京都）",null,null,"太平洋マテリアル株式会社（東京都）",null,null,"株式会社レゾナック建材（神奈川県）",null,null,"エボニックジャパン株式会社（東京都）、Evonik Operations GmbH",null,null,"太平洋マテリアル株式会社（東京都）",null,null,"信越産業株式会社（東京都）",null,null,"住友大阪セメント株式会社(東京都)、株式会社フォーシェル（東京都）、株式会社グリーンドウ（東京都）、国立大学法人鹿児島大学"]
[null,"④","開発者における九州地方との関連性（九州登録九州本社：◎、九州外登録九州本社：○、九州に共同開発者有り：△、その他：－）",null,null,"-",null,null,"-",null,null,"-",null,null,"-",null,null,"-",null,null,"◎",null,null,"◎",null,null,"-",null,null,"-",null,null,"-",null,null,"-",null,null,"-",null,null,"-",null,null,"-",null,null,"-",null,null,"-",null,null,"-",null,null,"-",null,null,"-",null,null,"-",null,null,"-",null,null,"-",null,null,"-",null,null,"-",null,null,"-",null,null,"-",null,null,"-",null,null,"-",null,null,"-",null,null,"-",null,null,"-",null,null,"-",null,null,"-",null,null,"-",null,null,"-",null,null,"-",null,null,"-",null,null,"-",null,null,"-",null,null,"-",null,null,"-",null,null,"-",null,null,"-",null,null,"-"]
[null,"⑤","九州地方への機能性（九州地方に支店等を有する場合：○、その他：－）",null,null,"-",null,null,"-",null,null,"-",null,null,"-",null,null,"-",null,null,"　-　（九州管内に物流倉庫）",null,null,"　-　（九州管内に物流倉庫）",null,null,"○（九州管内に支店有り）",null,null,"○（九州管内に支店有り）",null,null,"○（九州管内に支店有り）",null,null,"○（九州管内に事業所）",null,null,"○（九州管内に事業所）",null,null,"-",null,null,"-",null,null,"○（九州地方に支店を有する）",null,null,"○（九州地方に支店を有する）",null,null,"○（九州地方に支店を有する）",null,null,"○（九州地方に支店を有する）",null,null,"○（九州地方に支店を有する）",null,null,"-",null,null,"-",null,null,"○（九州地方に支店を有する）",null,null,"○（九州地方に支店を有する）",null,null,"-",null,null,"-",null,null,"〇（九州地方に支店を有する）",null,null,"○（九州地方に支店等を有する）",null,null,"○（九州地方に支店等を有する）",null,null,"○（九州地方に支店等を有する）",null,null,"○（九州地方に支店等を有する）",null,null,"○（九州地方に支店等を有する）",null,null,"○（九州地方に支店等を有する）",null,null,"○（九州地方に支店等を有する）",null,null,"-",null,null,"-",null,null,"-",null,null,"-",null,null,"○（九州地方に支店等を有する）",null,null,"○（九州地方に支店等を有する）",null,null,"○（九州地方に支店等を有する）",null,null,"-",null,null,"〇",null,null,"〇",null,null,"〇"]
[null,"⑥","技術概要",null,null,"本工法は、飛来塩分や凍結防止材により塩害を受け劣化したRC構造物に対する高防錆型断面修復工法である。材料は、塩分吸着剤を添加した数種のポリマーセメントモルタルで構成されており、補修部位の劣化状況に応じて材料の組合せを選択できる。",null,null,"本工法は、飛来塩分や凍結防止材により塩害を受け劣化したRC構造物に対する高防錆型断面修復工法である。材料は、塩分吸着剤を添加した数種のポリマーセメントモルタルで構成されており、補修部位の劣化状況に応じて材料の組合せを選択できる。",null,null,"本工法は、飛来塩分や凍結防止材により塩害を受け劣化したRC構造物に対する高防錆型断面修復工法である。材料は、塩分吸着剤を添加した数種のポリマーセメントモルタルで構成されており、補修部位の劣化状況に応じて材料の組合せを選択できる。",null,null,"高炉スラグ微粉末・細骨材を配合したポリマーセメントモルタル「エフモル」は、高炉スラグの特長である潜在水硬性により、耐塩害性能・耐凍害性能・化学抵抗性能に優れた補修材料です。また繊維を混入しているため、初期乾燥収縮ひび割れを抑制します。",null,null,"高炉スラグ微粉末・細骨材を配合したポリマーセメントモルタル「エフモル」は、高炉スラグの特長である潜在水硬性により、耐塩害性能・耐凍害性能・化学抵抗性能に優れた補修材料です。また繊維を混入しているため、初期乾燥収縮ひび割れを抑制します。",null,null,"本技術は、コンクリート構造物の補修補強工事に用いる断面修復材である。従来その細骨材として使用していた天然砂の代わりに、高炉水砕スラグを独自の球形化技術にて加工し、プレミックスモルタル化にした。本技術の活用により耐久性、耐酸性などの品質向上が期待できる。",null,null,"本技術は、コンクリート構造物の補修補強工事に用いる断面修復材である。従来その細骨材として使用していた天然砂の代わりに、高炉水砕スラグを独自の球形化技術にて加工し、プレミックスモルタル化にした。本技術の活用により耐久性、耐酸性などの品質向上が期待できる。",null,null,"超速硬ポリマーセメントモルタルまたはコンクリートにより、劣化損傷したコンクリート構造物の断面修復を行う技術で、従来は、超速硬コンクリートで対応していた。本技術の活用により、乾燥収縮が小さく、付着性・耐久性に優れた断面修復が可能である。",null,null,"超速硬ポリマーセメントモルタルまたはコンクリートにより、劣化損傷したコンクリート構造物の断面修復を行う技術で、従来は、超速硬コンクリートで対応していた。本技術の活用により、乾燥収縮が小さく、付着性・耐久性に優れた断面修復が可能である。",null,null,"超速硬ポリマーセメントモルタルまたはコンクリートにより、劣化損傷したコンクリート構造物の断面修復を行う技術で、従来は、超速硬コンクリートで対応していた。本技術の活用により、乾燥収縮が小さく、付着性・耐久性に優れた断面修復が可能である。",null,null,"本技術は、ポリマーセメントモルタルに塩化物イオン固定化材を添加しコンクリートの塩害防止性能を高めた断面修復材で、従来はポリマーセメントモルタルで対応していた。本技術の活用により、塩害劣化を大幅に抑制できるので、耐久性の向上が図れます。",null,null,"本技術は、ポリマーセメントモルタルに塩化物イオン固定化材を添加しコンクリートの塩害防止性能を高めた断面修復材で、従来はポリマーセメントモルタルで対応していた。本技術の活用により、塩害劣化を大幅に抑制できるので、耐久性の向上が図れます。",null,null,"ポリマーセメントモルタル乾式吹付け工法はコンクリート構造物の断面修復や補強を独自のサイロシステムを用いて、短期間に施工する優れた工法である。 ",null,null,"本技術は、容易に調節が可能なスペーサーとユニット化された鉄筋、及び高品質モルタルを組み合わせた補修・補強工法であり、従来は現場組立の鉄筋とポリマーセメントモルタルで施工していた。本技術の活用により、工程の短縮及び経済性の向上が図れる。",null,null,"本技術は、劣化したコンクリート構造物上面の断面修復材で、従来は超速硬コンクリートで対応していた。本技術の活用により、耐久性・付着性・低収縮性が改善され、品質の向上が図れます。また、従来技術に比べて、ハツリ量が減るので、環境、経済性の向上が図れます。",null,null,"本技術は、湿潤状態の施工面に適用できる急速硬化・高強度の補修材で、従来は、エポキシ樹脂系断面修復材で対応していた。本技術の活用により、湿潤の施工面であっても接着性が良く、短時間で硬化・強度が発現するため、工程の短縮および施工性、経済性等の向上が図れる。",null,null,"アルミナセメントを含む数種類の結合材を用いた速硬系のポリマーセメントモルタルであり、早期開放及び工期短縮が望まれるコンクリート構造物の補修工事全般に使われる断面修復材である。",null,null,"アルミナセメントを含む数種類の結合材を用いた速硬系のポリマーセメントモルタルであり、早期開放及び工期短縮が望まれるコンクリート構造物の補修工事全般に使われる断面修復材である。",null,null,"本技術は、コンクリート構造物の断面修復における乾式吹付け工法で、従来は湿式吹付け工法で対応していた。本技術の活用により、施工時の粉塵の発生が抑えられ、且つ優れた厚付け性と長距離圧送性を有するため、経済性および施工性が向上し周辺環境への負荷を軽減できる。",null,null,"本業務は、コンクリート構造物を補修する技術で、従来はポリマーセメントモルタルにより補修を行ってきたが、残存錆や塩分の侵入で、再劣化が起こり易かった。本技術の活用により、再劣化を防止できるようになり、コンクリート構造物の耐久性の向上が図れる。",null,null,"本業務は、コンクリート構造物を補修する技術で、従来はポリマーセメントモルタルにより補修を行ってきたが、残存錆や塩分の侵入で、再劣化が起こり易かった。本技術の活用により、再劣化を防止できるようになり、コンクリート構造物の耐久性の向上が図れる。",null,null,"本技術は、独自の材料を配合したノンポリマーセメントモルタルを使用することで組織の緻密化を可能とし優れた強度・耐久性を有するため、ライフサイクルコストの低減が可能となり、厚付け性にも優れるため工期短縮による経済性の向上が期待できる。",null,null,"本技術は、独自の材料を配合したノンポリマーセメントモルタルを使用することで組織の緻密化を可能とし優れた強度・耐久性を有するため、ライフサイクルコストの低減が可能となり、厚付け性にも優れるため工期短縮による経済性の向上が期待できる。",null,null,"本技術は、塩分吸着剤を混合したポリマーセメントモルタル(PCM)乾式吹付けによる断面修復工法で、従来は吸着剤を混合しないPCM乾式吹付けであった。 本技術の活用により有害な塩化物イオンを吸着して無害化するため、さらなる高耐久性断面が形成でき品質の向上に繋がる。",null,null,"コンクリート工における断面補修工事、狭隘部への打設に使用するモルタル材に自己治癒成分をプレミックスした材料で 施工後に発生したひび割れに水分が供給されることにより膨潤剤の作用でひび割れが自己閉塞する機能を有した高流動性モルタル材で 構造物保全が期待できる。",null,null,"　塩化物イオンが拡散しにくいポリマーセメントモルタルであり、周辺環境の塩分濃度が高いコンクリート構造物の補修工事においても、鉄筋腐食を抑制して長寿命化できる断面修復材である。",null,null,"本技術は、塩害・中性化によって劣化したコンクリートを亜硝酸リチウムを混入した断面修復材を用いて補修する工法である。断面修復材に用いる亜硝酸リチウムがコンクリート中へ浸透拡散し、鉄筋の不動態皮膜を再生することで高い防錆環境を構築する。",null,null,"従来は超速硬コンクリートなどを使用していた。本技術は断面修復材料として用いる低弾性ラテックス改質超速硬コンクリートで低収縮性と優れた物質浸透抵抗性を有している。道路橋コンクリート床版を始めとするコンクリート構造物の耐久性向上が期待できる。",null,null,"本技術は、無収縮モルタルとポリマーセメントの性能を併せ持つコンクリート構造物の断面修復用グラウト材で、従来は、汎用型無収縮グラウト材で対応していた。本技術の活用により、乾燥ひび割れの抑制や遮塩性に優れ、塩分浸透が抑制されるため、品質の向上が図れる。",null,null,"本技術はひび割れが発生したコンクリート床版の補修における高浸透型水性エポキシ樹脂を使用した防水機能を持つ下地補修工法で、従来はウォータージェットによる劣化部除去及び断面修復工法で対応していた。本技術の活用によりコスト縮減が図られ、品質の向上が期待出来る。",null,null,"本技術はひび割れが発生したコンクリート床版の補修における高浸透型水性エポキシ樹脂を使用した防水機能を持つ下地補修工法で、従来はウォータージェットによる劣化部除去及び断面修復工法で対応していた。本技術の活用によりコスト縮減が図られ、品質の向上が期待出来る。",null,null,"本技術は、断面修復材用ポリマーセメントモルタルに凝結促進材を添加し、施工間隔を短縮する工法で、従来は凝結促進材を添加しない左官工法で対応していた。本技術の活用により凝結時間の短縮及びコントロールが可能となるため、工程短縮、経済性及び施工性の向上が図れる。",null,null,"本技術は、断面修復材用ポリマーセメントモルタルに凝結促進材を添加し、施工間隔を短縮する工法で、従来は凝結促進材を添加しない左官工法で対応していた。本技術の活用により凝結時間の短縮及びコントロールが可能となるため、工程短縮、経済性及び施工性の向上が図れる。",null,null,"本技術は、コンクリート欠損部に用いる密着成分を超微粒子に改良した変性エポキシ樹脂防錆補修・補強剤で、従来は、ポリマーセメントモルタル等で対応していた。本技術の活用により、被塗面との付着性が向上し、防錆処理等の前処理が不要となるため、工程の短縮が図れる。",null,null,"本技術は、コンクリート補修工事に使用する、超速硬セメントを用いたプレミックスモルタルである。従来は、生コン工場から出荷されるモルタル(1:3）で対応していた。本技術の活用により、早期交通開放が可能となるため、工程の短縮及び施工性の向上が図られる。",null,null,"本技術は、コンクリート補修工事に使用する、超速硬セメントを用いたプレミックスモルタルである。従来は、生コン工場から出荷されるモルタル(1:3）で対応していた。本技術の活用により、早期交通開放が可能となるため、工程の短縮及び施工性の向上が図られる。",null,null,"本技術は、コンクリート補修工事に使用する、超速硬セメントを用いたプレミックスモルタルである。従来は、生コン工場から出荷されるモルタル(1:3）で対応していた。本技術の活用により、早期交通開放が可能となるため、工程の短縮及び施工性の向上が図られる。",null,null,"本技術は圧縮空気で圧送したモルタルパウダーとポンプ圧送した水を吹付ノズルの先端で混合・吹付する乾式吹付工法で、従来は湿式吹付工法で対応していた。本技術の活用によりモルタルの練り混ぜが不要となるため施工性、経済性、品質、作業環境の向上、工程の短縮が図れる。",null,null,"本技術は圧縮空気で圧送したモルタルパウダーとポンプ圧送した水を吹付ノズルの先端で混合・吹付する乾式吹付工法で、従来は湿式吹付工法で対応していた。本技術の活用によりモルタルの練り混ぜが不要となるため施工性、経済性、品質、作業環境の向上、工程の短縮が図れる。",null,null,"従来技術でもPCMが用いられていたが、本技術は耐摩耗性を向上させており、水路特有の水砂などに対する耐摩耗性が求められる環境で活用することで構造物の延命化が期待できる。",null,null,"本技術はシラン系腐食抑制混和剤を用いたポリマーセメントモルタルで断面修復をする技術で、従来は亜硝酸カルシウム系やアミン系を用いていた。本技術の活用により、鉄筋表面に黒さび（Fe3O4）の形成が顕著であるため、品質が向上する。",null,null,"本技術は、セメント量を約30％削減し、高炉スラグ等を増量した現場練り無収縮モルタルで、従来は一般的な無収縮モルタルで対応していた。本技術の活用により、製造時のCO2排出量を約55％削減できるため環境への影響抑制が図られる。",null,null,"本技術は断面修復工の鉄筋ケレン後の残存赤錆等を黒錆に転換させる水溶性錆転換型防錆プライマーである。従来は亜硝酸リチウム配合ポリマーセメント系鉄筋防錆材を塗布していた。本技術の活用により断面修復材と鉄筋との付着強度が向上し、耐久性、経済性の向上が図れる。",null,null,"本技術は鋼材に用いる防錆材であり、従来技術は亜硝酸リチウム＋モルタルの組み合わせで対応していた。本技術の活用により、施工期間の短縮や省力化および防錆効果の向上が期待できる。"]
[null,"⑦","概要図"]
[null,"⑧","施工条件・適用条件等","施工方法",null,"左官工法、吹付工法【湿式】、充填工法",null,null,"左官工法、吹付工法【湿式】、充填工法",null,null,"左官工法、吹付工法【湿式】、充填工法",null,null,"左官工法、吹付工法（湿式）",null,null,"左官工法、吹付工法（湿式）",null,null,"左官工法",null,null,"左官工法",null,null,"【左官工法】",null,null,"【左官工法】",null,null,"【左官工法】",null,null,"左官工法",null,null,"吹付工法（湿式）",null,null,"吹付け工法（乾式）",null,null,"吹付工法",null,null,"左官工法",null,null,"左官工法",null,null,"左官工法",null,null,"左官工法",null,null,"吹付け工法（乾式）",null,null,"左官工法、吹付工法",null,null,"左官工法、吹付工法",null,null,"左官工法、吹付工法",null,null,"左官工法、吹付工法",null,null,"吹付け工法",null,null,"充填工法",null,null,"左官工法、吹付工法（湿式）",null,null,"左官工法",null,null,"左官工法",null,null,"充填工法",null,null,"左官工法、吹付工法",null,null,"左官工法、吹付工法",null,null,"左官工法、吹付工法",null,null,"左官工法、吹付工法",null,null,"左官工法",null,null,"左官工法",null,null,"左官工法",null,null,"左官工法",null,null,"乾式吹付工法（湿式吹付工法、左官工法も可能）",null,null,"乾式吹付工法（湿式吹付工法、左官工法も可能）",null,null,"左官工法",null,null,"吹付工法",null,null,"左官工法",null,null,"左官工法",null,null,"左官工法"]
[null,null,null,"補修材料",null,"【ポリマーセメントモルタル系】",null,null,"【ポリマーセメントモルタル系】",null,null,"【ポリマーセメントモルタル系】",null,null,"ポリマーセメントモルタル系",null,null,"ポリマーセメントモルタル系",null,null,"ポリマーセメントモルタル系",null,null,"ポリマーセメントモルタル系",null,null,"ポリマーセメントモルタル系",null,null,"ポリマーセメントモルタル系",null,null,"ポリマーセメントモルタル系",null,null,"ポリマーセメントモルタル系",null,null,"ポリマーセメントモルタル系",null,null,"ポリマーセメントモルタル系",null,null,"【ポリマーセメントモルタル系】",null,null,"ポリマーセメントモルタル系",null,null,"ポリマーモルタル系",null,null,"ポリマーセメントモルタル系",null,null,"ポリマーセメントモルタル系",null,null,"ポリマーセメントモルタル系",null,null,"ポリマーセメントモルタル系",null,null,"ポリマーセメントモルタル系",null,null,"セメントモルタル系",null,null,"セメントモルタル系",null,null,"ポリマーセメントモルタル系",null,null,"ひび割れが自己閉塞する機能を付加したプレミックスタイプの高流動モルタル材",null,null,"結合材(セメント等)、骨材、繊維、ポリマーで構成される耐塩害タイプポリマーセメントモルタル",null,null,"ポリマーセメントモルタル系",null,null,"低弾性ラテックス改質超速硬コンクリート【（最大粗骨材粒径：13mm、20mm）】",null,null,"ポリマーセメント系無収縮グラウト材",null,null,"HI-SPECシール工法＋ポリマーセメントモルタル",null,null,"HI-SPECシール工法＋ポリマーセメントモルタル",null,null,"ポリマーセメントモルタル+天然無機物系凝結促進材「リプロクイック」",null,null,"ポリマーセメントモルタル+天然無機物系凝結促進材「リプロクイック」",null,null,"変性エポキシ樹脂",null,null,"超速硬セメントを用いたプレミックスモルタル",null,null,"超速硬セメントを用いたプレミックスモルタル",null,null,"超速硬セメントを用いたプレミックスモルタル",null,null,"ポリマーセメントモルタル",null,null,"ポリマーセメントモルタル",null,null,"ポリマーセメントモルタル",null,null,"シラン系腐食抑制混和剤を用いたポリマーセメントモルタル",null,null,"CO2排出量を削減した低炭素型の現場練り無収縮モルタル",null,null,"断面修復工における防錆材",null,null,"断面修復工における防錆材"]
[null,null,null,"適用範囲",null,"・コンクリート構造物の下面・側面・上面\n・材料の組合せにより補修界面の塩化物イオン量が1.2～9kg/m3までの範囲で使用可能\n・防錆性",null,null,"・コンクリート構造物の下面・側面・上面\n・材料の組合せにより補修界面の塩化物イオン量が1.2～9kg/m3までの範囲で使用可能\n・中性化抑制、塩害抑制、防錆性、【凍害抑制】",null,null,"・コンクリート構造物の下面・側面・上面\n・材料の組合せにより補修界面の塩化物イオン量が1.2～9kg/m3までの範囲で使用可能\n・中性化抑制、塩害抑制、防錆性、【凍害抑制】",null,null,"・既存のコンクリート構造物全般\n(橋梁、ダム、防波堤、ボックスカルバート、港湾構造物、トンネル覆道部、擁壁、用排水路)\n・中性化抑制、塩害抑制、凍害抑制、プライマー処理不要",null,null,"・既存のコンクリート構造物全般\n(橋梁、ダム、防波堤、ボックスカルバート、港湾構造物、トンネル覆道部、擁壁、用排水路)\n・中性化抑制、塩害抑制、凍害抑制、プライマー処理不要",null,null,"・コンクリート構造物全般の断面修復\n・橋梁床版の下面補修・橋脚側面の補修、ボックスカルバートの補修等\n・中性化抑制、凍害抑制",null,null,"・コンクリート構造物全般の断面修復\n・橋梁床版の下面補修・橋脚側面の補修、ボックスカルバートの補修等\n・中性化抑制、凍害抑制、速硬性",null,null,"・道路橋床版コンクリートの上面補修工事(応急的対策)［損傷程度：小(ポットホール)］\n・橋梁ジョイント部のコンクリート工事、コンクリート構造物の補修工事全般(断面修復)\n・中性化抑制、塩害抑制、速硬性　【凍害抑制】",null,null,"・道路橋床版コンクリートの上面補修工事(応急的対策)［損傷程度：中(鉄筋上面まで)］\n・橋梁ジョイント部のコンクリート工事、コンクリート構造物の補修工事全般(断面修復)\n・中性化抑制、塩害抑制、速硬性　【凍害抑制】",null,null,"・道路橋床版コンクリートの上面補修工事(応急的対策)［損傷程度：大(鉄筋下面まで)］\n・橋梁ジョイント部のコンクリート工事、コンクリート構造物の補修工事全般(断面修復)\n・中性化抑制、塩害抑制、速硬性　【凍害抑制】",null,null,"・表面が乾燥しているコンクリート構造物\n・コンクリート強度が24N/mm2(左官工法)以下の構造物\n・中性化抑制、塩害抑制",null,null,"・表面が乾燥しているコンクリート構造物\n・コンクリート強度が30N/mm2(吹付け工法)以下の構造物\n・中性化抑制、塩害抑制",null,null,"・各種コンクリート構造物の断面修復工事　・RCスラブの下面増厚工事\n【塩害抑制、凍害抑制、中性化抑制】",null,null,"・函渠構(BOXカルバート)、橋梁下部、建築物における耐力壁、梁、その他RC構造物の補修\n・耐摩耗性　【中性化抑制、塩害抑制、凍害抑制】",null,null,"橋梁のRC床版の上面補修工事、土間コンクリートの補修工事、コンクリート構造物全般の断面修復工事\n・速硬性　【凍害抑制】",null,null,"・湿潤状態の施工面のコンクリート構造物の補修（止水(締切)が可能な常時水中となる橋脚等、地下トンネル、河川・海岸部や港湾施設の護岸、農業用水路および水力発電施設など）　・速硬性",null,null,"・船の係留施設、橋脚、梁、高欄、トンネ ルなどの劣化したコンクリート構造物の断面修復工事。・速硬性 ・U-リペアライトEXと比較して、U-リペアパッチEXは28日圧縮強度が高い（U-リペアパッチEX：63.4N/m㎡、U-リペアライトEX：37.5N/m㎡）。",null,null,"・船の係留施設、橋脚、梁、高欄、トンネ ルなどの劣化したコンクリート構造物の断面修復工事。・速硬性\n・U-リペアパッチEXと比較して、U-リペアライトEXはモルタル比重が軽く、厚付け性が良い。",null,null,"・コンクリート構造物全般の補修、補強工事(港湾、橋梁、河川、上下水道など)　・最大圧送距離　300m\n・塩害抑制、【中性化抑制、凍害抑制】",null,null,"・人が接近して左官や吹き付けが可能な一般的な土木建築構造物\n・塩害抑制、凍害抑制、防錆性",null,null,"・人が接近して左官や吹き付けが可能な一般的な土木建築構造物\n・塩害抑制、凍害抑制、防錆性",null,null,"・一般的なコンクリート構造物(橋梁・港湾・トンネル・建築構造物等)の補修・補強\n・塩害抑制、中性化抑制、凍害抑制",null,null,"・一般的なコンクリート構造物(橋梁・港湾・トンネル・建築構造物等)の補修・補強\n・塩害抑制、中性化抑制、凍害抑制",null,null,"・塩害環境下にあるコンクリート構造物　・施工空間の幅や高さが1.2m以上確保できる箇所\n・吹付方向が横向きや上向きになる範囲(真下方向を0°とした場合、概ね45°以上)　・塩害抑制",null,null,"・水分供給可能な、断面補修工事、狭隘箇所における充填工法　・無収縮モルタルと同様の適用 \n・軸圧縮強度の目安は44N/㎜2程度　【・中性化抑制　・防錆性】",null,null,"・一般的なコンクリート構造物の断面修復による補修工事　・塩害を受けた構造物や周辺環境の塩化物イオン濃度が高いコンクリート構造物の補修工事　・工期短縮が必要なコンクリート構造物の補修工事　・【塩害抑制】",null,null,"・塩害および中性化で劣化した土木、建築分野の既設鉄筋コンクリート構造物、既設プレストレスコンクリート構造物の補修工事\n・防錆性、中性化抑制、塩害抑制、【プライマー不要】",null,null,"・コンクリート構造物の補修工事　・凍結防止剤を散布する地域の損傷したコンクリート床版の補修工事\n【中性化抑制、塩害抑制、凍害抑制、耐摩耗性】",null,null,"・コンクリート構造物の断面修復および充填 ・塩害地域や積雪が多い地域の断面修復工事 ・大断面となる部材の断面修復および部材間の充填\n【・塩害抑制 ・凍害抑制　・中性化抑制】",null,null,"・コンクリート床版におけるアスファルト舗装打ち換え、補修、防水工事",null,null,"・コンクリート床版におけるアスファルト舗装打ち換え、補修、防水工事",null,null,"・コンクリート構造物の欠損部の断面修復・冬期の気温が低く断面修復材の凝結に時間を要する施工現場　・劣化部の深さが深く、複数層の打ち重ねが必要な施工現場",null,null,"・コンクリート構造物の欠損部の断面修復・冬期の気温が低く断面修復材の凝結に時間を要する施工現場　・劣化部の深さが深く、複数層の打ち重ねが必要な施工現場",null,null,"コンクリート、レンガ、ブロック、天然石、タイル",null,null,"・道路・橋梁のコンクリート補修工事　・空港コンクリート舗装補修工事　・鉄道のコンクリート補修工事",null,null,"・道路・橋梁のコンクリート補修工事　・空港コンクリート舗装補修工事　・鉄道のコンクリート補修工事",null,null,"・道路・橋梁のコンクリート補修工事　・空港コンクリート舗装補修工事　・鉄道のコンクリート補修工事",null,null,"・コンクリート構造物の劣化部や欠損部の断面修復、増厚補強工事　・中性化抑制、塩害抑制、凍結抑制",null,null,"・コンクリート構造物の劣化部や欠損部の断面修復、増厚補強工事　・中性化抑制、塩害抑制、凍結抑制",null,null,"・コンクリート構造物の補修全般　・耐摩耗性が要求される農業用水路・導水路などのコンクリート構造物の補修工事\n・耐摩耗性",null,null,"・融雪剤、飛来塩分や中性化による鉄筋腐食により劣化したコンクリート構造物の補修工事　・シラン系鉄筋腐食抑制混和剤を用いたポリマーセメントモルタルによる断面修復工事　・橋梁の橋桁や壁高欄等のコンクリート構造物の補修工事",null,null,"・コンクリート構造物の断面修復および鋼製構造物等との接合部や隙間への間詰め充填",null,null,"・断面修復工における修復箇所はつり後の露出鉄筋\n・構造物の露出鉄筋",null,null,"土木・建築分野の鉄筋コンクリート構造物及び鋼材の防錆が必要な工事。"]
[null,null,null,"1回あたりの施工厚さ",null,"【左官：壁面20mm、天井面10mm、吹付け：壁面40mm、天井面20mm】",null,null,"【左官：壁面20mm、天井面10mm、吹付け：壁面40mm、天井面20mm】",null,null,"【左官：壁面20mm、天井面10mm、吹付け：壁面40mm、天井面20mm】",null,null,"【10～20mm】",null,null,"【10～20mm】",null,null,"垂直面：15mm、天井面：10mm",null,null,"垂直面：15mm、天井面：10mm",null,null,"【床版部15mm、立ち上がり部5～7mm】",null,null,"【床版部15mm、立ち上がり部5～7mm】",null,null,"【床版部15mm、立ち上がり部5～7mm】",null,null,"10～20mm",null,null,"10cm",null,null,"1層の最少吹付け厚さは6mm、最大で50mmとするが部分的な修復の場合には100mmまで許容",null,null,"【下向き施工：50mm、横向き施工：30mm、上向き施工：20mm】",null,null,"修復深さ20～30mm：モルタル　、修復深さ30mm以上：モルタルおよびコンクリート",null,null,"20mmでダレ、ズレおよび剥がれを生じない",null,null,"【1層5～20mm程度、短時間に塗り重ねることで厚付けにも対応可能】",null,null,"【5～60mm程度】",null,null,"10～200mm程度",null,null,"【10～50mm】",null,null,"【10～50mm】",null,null,"50㎜",null,null,"50㎜",null,null,"50㎜【～100mm】",null,null,"-",null,null,"【左官：壁面5～40mm、天井面5～20mm、吹付け：壁面5～60mm、天井面5～30mm】",null,null,"30ｍｍ",null,null,"・13mm骨材：30mm以上50ｍｍ未満　・20mm骨材：50mm以上",null,null,"【型枠充填工法であるため特に制限なし】",null,null,"-",null,null,"-",null,null,"左官工法：側面10～30mm、天井面10～20mm、吹付工法：側面10～50mm、天井面10～30mm",null,null,"左官工法：側面10～30mm、天井面10～20mm、吹付工法：側面10～50mm、天井面10～30mm",null,null,"垂直面：15～20ｍｍ",null,null,"【100ｍｍ】",null,null,"【100ｍｍ】",null,null,"【100ｍｍ】",null,null,"1層最大200mm",null,null,"1層最大200mm",null,null,"1層約3～5mm程度【10mm程度】",null,null,"-",null,null,"10mm以上500mm未満（それ以外は別材料）",null,null,"-",null,null,"-"]
[null,null,null,"施工中の気温",null,"5～35℃(気温0℃以下の場合は施工中止)",null,null,"5～35℃(気温0℃以下の場合は施工中止)",null,null,"5～35℃(気温0℃以下の場合は施工中止)",null,null,"5℃以上",null,null,"5℃以上",null,null,"5～35℃",null,null,"5～35℃",null,null,"【5℃以上】",null,null,"【5℃以上】",null,null,"【5℃以上】",null,null,"5℃～35℃",null,null,"5℃～35℃",null,null,"5℃～30℃",null,null,"【5～35℃】",null,null,"5～35℃",null,null,"0℃～35℃で6時間以内に硬化（湿潤状態では0℃以上、乾燥状態では-10℃以上で施工）",null,null,"施工可能気温5～35℃",null,null,"施工可能気温5～35℃",null,null,"5～35℃",null,null,"5℃～40℃",null,null,"5℃～40℃",null,null,"5℃以上",null,null,"5℃以上",null,null,"5～30℃",null,null,"・気温5℃以上",null,null,"・気温5～35℃",null,null,"0～40℃【条件：コンクリート表面における温度となる】",null,null,"【5℃～35℃（冬季は初期凍害を防ぐ対策を講じること。夏季は直射日光を避けること。）】",null,null,"5～35℃",null,null,"5～30℃",null,null,"5～30℃",null,null,"5℃以上【5～35℃（気温5℃以下の場合は施工中止）】",null,null,"5℃以上【5～35℃（気温5℃以下の場合は施工中止）】",null,null,"被塗面の温度が10℃以上",null,null,"5～35℃",null,null,"5～35℃",null,null,"5～35℃",null,null,"【5～35℃】",null,null,"【5～35℃】",null,null,"気温5℃～35℃",null,null,"気温5℃以上",null,null,"練り上がり温度：5℃以上40℃以内",null,null,"外気温度5℃以下",null,null,"施工時および養生時の気温が5～40℃で施工可能。"]
[null,null,null,"施工中の水分",null,"不可（水中施工部には適用できない）",null,null,"不可（水中施工部には適用できない）",null,null,"不可（水中施工部には適用できない）",null,null,"不可（水中には適用できない）",null,null,"不可（水中には適用できない）",null,null,"不可（常時濡れている場所での施工は不可）",null,null,"不可（常時濡れている場所での施工は不可）",null,null,"不可（降雨、降雪時は施工不可）",null,null,"不可（降雨、降雪時は施工不可）",null,null,"不可（降雨、降雪時は施工不可）",null,null,"不可（表面が乾燥していないコンクリート構造物は適用不可）",null,null,"不可（表面が乾燥していないコンクリート構造物は適用不可）",null,null,"降雨下の施工不可",null,null,"【可（流出の恐れが無い雨水程度）】",null,null,"不可",null,null,"可（流れる水や水中に設置されている状態のコンクリート構造物を除く）",null,null,"不可（施工時に降雨等による 雨がかり、水がかりがないこと）",null,null,"不可（施工時に降雨等による 雨がかり、水がかりがないこと）",null,null,"【可（流出の恐れが無い雨水程度)】",null,null,"不可",null,null,"不可",null,null,"【可（流出の恐れが無い雨水程度）】",null,null,"【可（流出の恐れが無い雨水程度）】",null,null,"不可【降雨、降雪時の施工は養生を行う】",null,null,"【不可（降雨・降雪時の施工は不可】",null,null,"・施工時に降雨等による雨がかり、水がかりがある場合は施工不可",null,null,"降雨、降雪時の施工は不可（施工箇所を降雨等で濡らさないように養生を行う）【流水の恐れが無い程度であれば可】",null,null,"不可（降雨、降雪時は施工不可）",null,null,"養生時は風雨を避ける",null,null,"不可（雨天時は施工不可）",null,null,"不可（雨天時は施工不可）",null,null,"不可（降雨・降雪時は施工を避けること）",null,null,"不可（降雨・降雪時は施工を避けること）",null,null,"不可（雨天時及び強風時は施工不可）",null,null,"不可（降雨、降雪は施工不可）",null,null,"不可（降雨、降雪は施工不可）",null,null,"不可（降雨、降雪は施工不可）",null,null,"大雨、強風時は施工を中止する",null,null,"大雨、強風時は施工を中止する",null,null,"施工中及び施工後の硬化前に降雨・降雪の恐れがないこと",null,null,"-",null,null,"-",null,null,"降雨・降雪時は施工を避けること",null,null,"雨天時もしくは雨天が予想される場合は、雨がかりしないように養生すること。"]
[null,null,null,"作業空間",null,"-",null,null,"-",null,null,"-",null,null,"吹付け工法の場合、5×3m程度の吹付プラント設置スペースが必要",null,null,"吹付け工法の場合、5×3m程度の吹付プラント設置スペースが必要",null,null,"作業スペースとして1m×1m程度、材料の混練スペースとして2m×2m程度",null,null,"作業スペースとして1m×1m程度、材料の混練スペースとして2m×2m程度",null,null,"作業スペースとして、1.5m×2m程度必要(補修部分は含まず)",null,null,"作業スペースとして、1.5m×2m程度必要(補修部分は含まず)",null,null,"作業スペースとして、1.5m×2m程度必要(補修部分は含まず)",null,null,"作業および置き場スペースとして5m×5m=25m2",null,null,"作業および置き場スペースとして5m×10m=50m2【圧送距離～100m】",null,null,"プラントスペースを確保(W=3.0m、L=8.0m程度)",null,null,"ユニット鉄筋仮置きスペース1.2㎡、吹付機材(他資材を含む)設置スペース27.7㎡(施工面積6m×10m=60㎡の場合)",null,null,"現場での材料混練スペースはハンドミキサの場合1×1=1m2程度、モルタルミキサの場合2×2=4m2程度",null,null,"資材置き場と練り混ぜのスペースとして2m×2m=4m2程度、作業スペースとして1m×1m=1m2程度が必要。",null,null,"混練スペース として2m2以上が必要である。",null,null,"混練スペース として2m2以上が必要である。",null,null,"・プラント設置スペースとして20m2程度(5m×4m)　・吹付け作業スペースとしてノズル先から吹付け面まで 0.3m程度",null,null,"機械、作業員(2人以上)を考慮して5m×5m程度",null,null,"機械、作業員(2人以上)を考慮して5m×5m程度",null,null,"・作業者が吹付け・左官作業が可能なスペースがあること(目安:吹付け24㎡(4×6m)、左官4㎡(2×2m))。",null,null,"・作業者が吹付け・左官作業が可能なスペースがあること(目安:吹付け24㎡(4×6m)、左官4㎡(2×2m))。",null,null,"・プラントスペース(W=3.0m,L=8.0m程度)が確保できること　・施工空間の幅や高さが1.2m以上確保できる箇所",null,null,"・グラウト用高速ミキサー、ホッパー、モルタルポンプ、材料等を保管可能なスペースが必要 (5×5=25㎡程度)",null,null,"・作業スペース10m2程度(目安:吹付け24m2(4×6m)、左官4m2(2×2m))　・気中施工可能であること　・【吹付け工法：最大圧送距離50ｍ】",null,null,"足場等作業用のスペースが確保できること【5ｍ2程度】",null,null,"・作業スペースとして、2.5m×4.0ｍ程度は必要　・コンクリートを練り混ぜるための現場プラントスペースとして、4ｔ車×2台分のスペースを確保する\t",null,null,"作業ヤードは、小規模な現場で(2m×2m)＋(1m×1m)＝5m2程度、大規模な現場で(11.95m×2.49m×2台)＝60m2程度必要",null,null,"【HI-SPECシール工法＋ポリマーセメントモルタル(KSタイプ)100m2施工時、材料の保管と練り混ぜに合計1.5×2mのスペースが必要である。】",null,null,"【HI-SPECシール工法＋ポリマーセメントモルタル(KSタイプ)100m2施工時、材料の保管と練り混ぜに合計1.5×2mのスペースが必要である。】",null,null,"左官工法：作業スペースは、3m×3m＝9m2以上必要、吹付工法：機械設置スペースは4m×4m＝16m2以上必要",null,null,"左官工法：作業スペースは、3m×3m＝9m2以上必要、吹付工法：機械設置スペースは4m×4m＝16m2以上必要",null,null,"施工面積4㎡として資材置場2㎡、施工時の作業面積として9㎡必要",null,null,"練り場のペースは2.7×1.8m程度必要",null,null,"練り場のペースは2.7×1.8m程度必要",null,null,"練り場のペースは2.7×1.8m程度必要",null,null,"作業ヤードは、4m×4m＝16m2以上必要",null,null,"作業ヤードは、4m×4m＝16m2以上必要",null,null,"最小作業範囲として2×2mの作業スペース",null,null,"施工ヤードの広さは5x10m程度",null,null,"小規模：約5㎡（2m×2m＋1m×1m）、大規模：約60㎡（11.95m×2.49m×2台）",null,null,"1m×2m＝2㎡程度が必要",null,null,"塗布時に、ヘラで材料混練可能な0.6m×0.6m=0.36m²程度の作業スペースが確保できること。ハンドミキサーを使用する場合は、1m×1m=1m²程度の作業スペースが必要。"]
[null,"⑨","比較する従来技術",null,null,"亜硝酸リチウム等の鉄筋防錆材を用いたコンクリート構造物の断面修復工法",null,null,"亜硝酸リチウム等の鉄筋防錆材を用いたコンクリート構造物の断面修復工法",null,null,"亜硝酸リチウム等の鉄筋防錆材を用いたコンクリート構造物の断面修復工法",null,null,"ポリマーセメントモルタルを用いた湿式吹付",null,null,"ポリマーセメントモルタルを用いた湿式吹付",null,null,"天然砂を使用したポリマーセメントモルタル",null,null,"天然砂を使用したポリマーセメントモルタル",null,null,"超速硬コンクリート",null,null,"超速硬コンクリート",null,null,"超速硬コンクリート",null,null,"ポリマーセメントモルタル",null,null,"ポリマーセメントモルタル",null,null,"ポリマーセメント左官工法",null,null,"現場組鉄筋工法とポリマーセメント吹付",null,null,"超速硬コンクリート用パック詰め",null,null,"エポキシ樹脂系断面修復材",null,null,"ポリマーセメントモルタル(二材型)",null,null,"ポリマーセメントモルタル(二材型)",null,null,"湿式吹付け工法",null,null,"ポリマーセメントモルタルによる補修",null,null,"ポリマーセメントモルタルによる補修",null,null,"ポリマーセメントモルタル",null,null,"ポリマーセメントモルタル",null,null,"ポリマーセメントモルタル乾式吹付けによる断面修復工法",null,null,"充填工法用モルタル",null,null,"ポリマーセメントモルタル(一材型)",null,null,"ポリマーセメントモルタル断面修復工法(左官工法)",null,null,"超速硬コンクリート，超速硬ポリマーセメントモルタルによる既設コンクリート床版の断面修復",null,null,"無収縮グラウト材",null,null,"断面修復工",null,null,"断面修復工",null,null,"断面修復工（左官工法）",null,null,"断面修復工（左官工法）",null,null,"コンクリート構造物の断面欠損部を修復するために、ポリマーセメントモルタルなどで断面修復する技術で対応していた",null,null,"生コン工場から出荷されたモルタル（1:3）",null,null,"生コン工場から出荷されたモルタル（1:3）",null,null,"生コン工場から出荷されたモルタル（1:3）",null,null,"コンクリート吹付け工法",null,null,"コンクリート吹付け工法",null,null,"断面修復工（左官工法）",null,null,"断面修復工(左官工法)",null,null,"一般的な現場練り無収縮モルタル",null,null,"亜硝酸リチウム系防錆剤",null,null,"亜硝酸リチウム水溶液とポリマーセメントモルタルを組み合わせた無機系の鉄筋防錆材"]
["評価情報 ","⑩","評価基準",null,"項目","最新の活用効果評価結果,所見",null,null,"最新の活用効果評価結果,所見",null,null,"最新の活用効果評価結果,所見",null,null,"最新の活用効果評価結果,所見",null,null,"最新の活用効果評価結果,所見",null,null,"最新の活用効果評価結果,所見",null,null,"最新の活用効果評価結果,所見",null,null,"最新の活用効果評価結果,所見",null,null,"最新の活用効果評価結果,所見",null,null,"最新の活用効果評価結果,所見",null,null,"最新の活用効果評価結果,所見",null,null,"最新の活用効果評価結果,所見",null,null,"最新の活用効果評価結果,所見",null,null,"最新の活用効果評価結果,所見",null,null,"最新の活用効果評価結果,所見",null,null,"最新の活用効果評価結果,所見",null,null,"最新の活用効果評価結果,所見",null,null,"最新の活用効果評価結果,所見",null,null,"最新の活用効果評価結果,所見",null,null,"最新の活用効果評価結果,所見",null,null,"最新の活用効果評価結果,所見",null,null,"最新の活用効果評価結果,所見",null,null,"最新の活用効果評価結果,所見",null,null,"最新の活用効果評価結果,所見",null,null,"最新の活用効果評価結果,所見",null,null,"最新の活用効果評価結果,所見",null,null,"最新の活用効果評価結果,所見",null,null,"最新の活用効果評価結果,所見",null,null,"最新の活用効果評価結果,所見",null,null,"最新の活用効果評価結果,所見",null,null,"最新の活用効果評価結果,所見",null,null,"最新の活用効果評価結果,所見",null,null,"最新の活用効果評価結果,所見",null,null,"最新の活用効果評価結果,所見",null,null,"最新の活用効果評価結果,所見",null,null,"最新の活用効果評価結果,所見",null,null,"最新の活用効果評価結果,所見",null,null,"最新の活用効果評価結果,所見",null,null,"最新の活用効果評価結果,所見",null,null,"最新の活用効果評価結果,所見",null,null,"最新の活用効果評価結果,所見",null,null,"最新の活用効果評価結果,所見",null,null,"最新の活用効果評価結果,所見",null,null,"最新の活用効果評価結果,所見"]
[null,null,"・A：従来技術より極めて優れる\n・B：従来技術より優れる\n・C：従来技術と同等\n・D：従来技術より劣る",null,"経済性","B：-",null,null,"B：-",null,null,"B：-",null,null,"C：-",null,null,"C：-",null,null,"C：-",null,null,"C：-",null,null,"B：-",null,null,"B：-",null,null,"B：-",null,null,"B：-",null,null,"B：-",null,null,"C：留意事項：材料は吹付けの際にリバウンド材が発生するため増加した。",null,null,"-",null,null,"C：-",null,null,"-",null,null,"B：-",null,null,"B：-",null,null,"B：・一度の吹付で厚付けが可能、長距離圧送ができることから、施工日数、作業人員、仮設費が減少した。",null,null,"-",null,null,"-",null,null,"-",null,null,"-",null,null,"-",null,null,"-",null,null,"-",null,null,"-",null,null,"-",null,null,"-",null,null,"-",null,null,"-",null,null,"-",null,null,"-",null,null,"-",null,null,"-",null,null,"-",null,null,"-",null,null,"-",null,null,"-",null,null,"-",null,null,"-",null,null,"-",null,null,"-",null,null,"-"]
[null,null,null,null,"工程","B：所見：はつり量が低減できる為、施工工程が低減できた。",null,null,"B：所見：はつり量が低減できる為、施工工程が低減できた。",null,null,"B：所見：はつり量が低減できる為、施工工程が低減できた。",null,null,"B：所見：プライマー不要による施工日数の短縮ができた。（下地面のプライマー処理が必要なエフモル０５を除く）",null,null,"B：所見：プライマー不要による施工日数の短縮ができた。（下地面のプライマー処理が必要なエフモル０５を除く）",null,null,"B：・コテ離れがよく、接合面での仕上げがしやすいことから、熟練工に頼る作業が大幅に減少するため工程を短縮できる。",null,null,"B：・コテ離れがよく、接合面での仕上げがしやすいことから、熟練工に頼る作業が大幅に減少するため工程を短縮できる。",null,null,"B：・乾燥収縮が小さく、既設構造物との付着性が向上し工程の短縮に期待できる。",null,null,"B：・乾燥収縮が小さく、既設構造物との付着性が向上し工程の短縮に期待できる。",null,null,"B：・乾燥収縮が小さく、既設構造物との付着性が向上し工程の短縮に期待できる。",null,null,"B：-",null,null,"B：-",null,null,"B：所見：1層当りの施工厚さが厚いため、厚さが必要な箇所では二層に分ける等の工程が短縮された。",null,null,"-",null,null,"B：-",null,null,"-",null,null,"B：・速乾性があり強度発現が早いため工程の短縮が図られる。",null,null,"B：・速乾性があり強度発現が早いため工程の短縮が図られる。",null,null,"A：・吹付回数が減少し、施工日数が短縮した。",null,null,"-",null,null,"-",null,null,"-",null,null,"-",null,null,"-",null,null,"-",null,null,"-",null,null,"-",null,null,"-",null,null,"-",null,null,"-",null,null,"-",null,null,"-",null,null,"-",null,null,"-",null,null,"-",null,null,"-",null,null,"-",null,null,"-",null,null,"-",null,null,"-",null,null,"-",null,null,"-",null,null,"-",null,null,"-"]
[null,null,null,null,"品質・出来形","B：所見：既設鉄筋の完全除去が困難な残存錆中の塩分を吸着、腐食の進行を抑止が期待できる。",null,null,"B：所見：既設鉄筋の完全除去が困難な残存錆中の塩分を吸着、腐食の進行を抑止が期待できる。",null,null,"B：所見：既設鉄筋の完全除去が困難な残存錆中の塩分を吸着、腐食の進行を抑止が期待できる。",null,null,"B：所見：繊維の混入により初期乾操収縮ひび割れが抑制される。",null,null,"B：所見：繊維の混入により初期乾操収縮ひび割れが抑制される。",null,null,"B：・骨材に球形化した高炉水砕スラグ加工砂を使用していることで耐久性、耐酸性が優れているため、品質が向上。・高炉水砕スラグ加工砂は、アルカリ骨材反応が起きないため、品質が向上。",null,null,"B：・骨材に球形化した高炉水砕スラグ加工砂を使用していることで耐久性、耐酸性が優れているため、品質が向上。・高炉水砕スラグ加工砂は、アルカリ骨材反応が起きないため、品質が向上。",null,null,"B：・乾燥収縮が小さく、既設構造物との付着性・耐久性の向上に期待できる。",null,null,"B：・乾燥収縮が小さく、既設構造物との付着性・耐久性の向上に期待できる。",null,null,"B：・乾燥収縮が小さく、既設構造物との付着性・耐久性の向上に期待できる。",null,null,"B：・浸透する塩化物イオンを固定化し塩化物イオンの浸透速度を低減するため耐久性に期待できる。",null,null,"B：・浸透する塩化物イオンを固定化し塩化物イオンの浸透速度を低減するため耐久性に期待できる。",null,null,"B：所見：プレミックスポリマーセメントの使用により材料のばらつきがなかった。",null,null,"-",null,null,"B：・コンクリートとの高い付着性がよく乾燥収縮が小さく、静弾性係数が既設コンクリートに近いため、品質の向上が図れる。",null,null,"-",null,null,"C：-",null,null,"C：-",null,null,"B：・遮塩性及び寸法変化率に優れ、耐久性が向上した。",null,null,"-",null,null,"-",null,null,"-",null,null,"-",null,null,"-",null,null,"-",null,null,"-",null,null,"-",null,null,"-",null,null,"-",null,null,"-",null,null,"-",null,null,"-",null,null,"-",null,null,"-",null,null,"-",null,null,"-",null,null,"-",null,null,"-",null,null,"-",null,null,"-",null,null,"-",null,null,"-",null,null,"-",null,null,"-"]
[null,null,null,null,"安全性","C：-",null,null,"C：-",null,null,"C：-",null,null,"C：-",null,null,"C：-",null,null,"C：-",null,null,"C：-",null,null,"C：-",null,null,"C：-",null,null,"C：-",null,null,"C：-",null,null,"C：-",null,null,"C：-",null,null,"-",null,null,"-：-",null,null,"-",null,null,"C：-",null,null,"C：-",null,null,"B：・粉塵濃度が低減したことで、作業環境が向上した。",null,null,"-",null,null,"-",null,null,"-",null,null,"-",null,null,"-",null,null,"-",null,null,"-",null,null,"-",null,null,"-",null,null,"-",null,null,"-",null,null,"-",null,null,"-",null,null,"-",null,null,"-",null,null,"-",null,null,"-",null,null,"-",null,null,"-",null,null,"-",null,null,"-",null,null,"-",null,null,"-",null,null,"-",null,null,"-"]
[null,null,null,null,"施工性","C：-",null,null,"C：-",null,null,"C：-",null,null,"C：-",null,null,"C：-",null,null,"B：・コテ離れがよく、接合面での仕上げがしやすいことから、熟練工に頼る作業が大幅に減少するため施工性が向上。",null,null,"B：・コテ離れがよく、接合面での仕上げがしやすいことから、熟練工に頼る作業が大幅に減少するため施工性が向上。",null,null,"B：・乾燥収縮が小さく、既設構造物との付着性が向上し施工性に優れる。",null,null,"B：・乾燥収縮が小さく、既設構造物との付着性が向上し施工性に優れる。",null,null,"B：・乾燥収縮が小さく、既設構造物との付着性が向上し施工性に優れる。",null,null,"B：-",null,null,"B：-",null,null,"B：所見：サイロシステムを使用することにより、資機材の小運搬ならびに移動が少なかった。留意事項：吹付け方向が下向きになる範囲、幅や高さが概ね1.2mを切るような狭い箇所には適用できない。",null,null,"-",null,null,"B：・従来の超速硬コンクリートと比較して、流動性優れているので施工性に優れている。",null,null,"-",null,null,"B：・厚付けが可能で即日に仕上げる事ができるため施工性の向上が図られる。",null,null,"B：・厚付けが可能で即日に仕上げる事ができるため施工性の向上が図られる。",null,null,"B：・圧送距離が300mまで対応できるため、プラント移動による仮設工が減少した。",null,null,"-",null,null,"-",null,null,"-",null,null,"-",null,null,"-",null,null,"-",null,null,"-",null,null,"-",null,null,"-",null,null,"-",null,null,"-",null,null,"-",null,null,"-",null,null,"-",null,null,"-",null,null,"-",null,null,"-",null,null,"-",null,null,"-",null,null,"-",null,null,"-",null,null,"-",null,null,"-",null,null,"-",null,null,"-"]
[null,null,null,null,"環境","B：所見：はつり量が減少するため、産業廃棄物の発生量が減少した。",null,null,"B：所見：はつり量が減少するため、産業廃棄物の発生量が減少した。",null,null,"B：所見：はつり量が減少するため、産業廃棄物の発生量が減少した。",null,null,"B：所見：高炉スラグの使用により、産業廃棄物の発生量削減、省エネルギー、CO2排出量の削減などに貢献できた。",null,null,"B：所見：高炉スラグの使用により、産業廃棄物の発生量削減、省エネルギー、CO2排出量の削減などに貢献できた。",null,null,"B：-",null,null,"B：-",null,null,"B：・損傷部のみのはつりで良いため、はつり量が低減でき、産廃処分量を抑制できた。",null,null,"B：・損傷部のみのはつりで良いため、はつり量が低減でき、産廃処分量を抑制できた。",null,null,"B：・損傷部のみのはつりで良いため、はつり量が低減でき、産廃処分量を抑制できた。",null,null,"C：-",null,null,"C：-",null,null,"C：-",null,null,"-",null,null,"C：-",null,null,"-",null,null,"C：-",null,null,"C：-",null,null,"B：・粉塵及び汚水の発生が減少した。",null,null,"-",null,null,"-",null,null,"-",null,null,"-",null,null,"-",null,null,"-",null,null,"-",null,null,"-",null,null,"-",null,null,"-",null,null,"-",null,null,"-",null,null,"-",null,null,"-",null,null,"-",null,null,"-",null,null,"-",null,null,"-",null,null,"-",null,null,"-",null,null,"-",null,null,"-",null,null,"-",null,null,"-",null,null,"-"]
[null,null,null,null,"総合評価","B：-",null,null,"B：-",null,null,"B：-",null,null,"C：-",null,null,"C：-",null,null,"B：-",null,null,"B：-",null,null,"B：-",null,null,"B：-",null,null,"B：-",null,null,"B：-",null,null,"B：-",null,null,"B：-",null,null,"-",null,null,"B：留意事項：材料費は従来材料にくらべて高価である。",null,null,"-",null,null,"B：-",null,null,"B：-",null,null,"B：-",null,null,"-",null,null,"-",null,null,"-",null,null,"-",null,null,"-",null,null,"-",null,null,"-",null,null,"-",null,null,"-",null,null,"-",null,null,"-",null,null,"-",null,null,"-",null,null,"-",null,null,"-",null,null,"-",null,null,"-",null,null,"-",null,null,"-",null,null,"-",null,null,"-",null,null,"-",null,null,"-",null,null,"-",null,null,"-"]
["統一した従来技術",null,null,null,null,"統一した従来技術：断面修復工法（施工日数、施工費用はポリマーセメントモルタル、左官工法）",null,null,"統一した従来技術：断面修復工法（吹付け工法であるため経済性、工程は比較対象としない）",null,null,"統一した従来技術：断面修復工法（充填工法であるため経済性、工程は比較対象としない）",null,null,"統一した従来技術：断面修復工法（施工日数、施工費用はポリマーセメントモルタル、左官工法）",null,null,"統一した従来技術：断面修復工法（吹付け工法であるため経済性、工程は比較対象としない）",null,null,"統一した従来技術：断面修復工法（施工日数、施工費用はポリマーセメントモルタル、左官工法）",null,null,"統一した従来技術：断面修復工法（施工日数、施工費用はポリマーセメントモルタル、左官工法）",null,null,"統一した従来技術：断面修復工法（施工日数、施工費用はポリマーセメントモルタル、左官工法）",null,null,"統一した従来技術：断面修復工法（施工日数、施工費用はポリマーセメントモルタル、左官工法）",null,null,"統一した従来技術：断面修復工法（施工日数、施工費用はポリマーセメントモルタル、左官工法）",null,null,"統一した従来技術：断面修復工法（施工日数、施工費用はポリマーセメントモルタル、左官工法）",null,null,"統一した従来技術：断面修復工法（吹付け工法であるため経済性、工程は比較対象としない）",null,null,"統一した従来技術：断面修復工法（吹付け工法であるため経済性、工程は比較対象としない）",null,null,"統一した従来技術：断面修復工法（吹付け工法であるため経済性、工程は比較対象としない）",null,null,"統一した従来技術：断面修復工法（施工日数、施工費用はポリマーセメントモルタル、左官工法）",null,null,"統一した従来技術：断面修復工法（施工日数、施工費用はポリマーセメントモルタル、左官工法）",null,null,"統一した従来技術：断面修復工法（施工日数、施工費用はポリマーセメントモルタル、左官工法）",null,null,"統一した従来技術：断面修復工法（施工日数、施工費用はポリマーセメントモルタル、左官工法）",null,null,"統一した従来技術：断面修復工法（吹付け工法であるため経済性、工程は比較対象としない）",null,null,"統一した従来技術：断面修復工法（施工日数、施工費用はポリマーセメントモルタル、左官工法）",null,null,"統一した従来技術：断面修復工法（吹付け工法であるため経済性、工程は比較対象としない）",null,null,"統一した従来技術：断面修復工法（施工日数、施工費用はポリマーセメントモルタル、左官工法）",null,null,"統一した従来技術：断面修復工法（吹付け工法であるため経済性、工程は比較対象としない）",null,null,"統一した従来技術：断面修復工法（吹付け工法であるため経済性、工程は比較対象としない）",null,null,"統一した従来技術：断面修復工法（充填工法であるため経済性、工程は比較対象としない）",null,null,"統一した従来技術：断面修復工法（施工日数、施工費用はポリマーセメントモルタル、左官工法）",null,null,"統一した従来技術：断面修復工法（施工日数、施工費用はポリマーセメントモルタル、左官工法）",null,null,"統一した従来技術：断面修復工法（施工日数、施工費用はポリマーセメントモルタル、左官工法）",null,null,"統一した従来技術：断面修復工法（充填工法であるため経済性、工程は比較対象としない）",null,null,"統一した従来技術：断面修復工法（施工日数、施工費用はポリマーセメントモルタル、左官工法）",null,null,"統一した従来技術：断面修復工法（吹付け工法であるため経済性、工程は比較対象としない）",null,null,"統一した従来技術：断面修復工法（施工日数、施工費用はポリマーセメントモルタル、左官工法）",null,null,"統一した従来技術：断面修復工法（吹付け工法であるため経済性、工程は比較対象としない）",null,null,"統一した従来技術：断面修復工法（施工日数、施工費用はポリマーセメントモルタル、左官工法）",null,null,"統一した従来技術：断面修復工法（施工日数、施工費用はポリマーセメントモルタル、左官工法）",null,null,"統一した従来技術：断面修復工法（施工日数、施工費用はポリマーセメントモルタル、左官工法）",null,null,"統一した従来技術：断面修復工法（施工日数、施工費用はポリマーセメントモルタル、左官工法）",null,null,"統一した従来技術：断面修復工法（吹付け工法であるため経済性、工程は比較対象としない）",null,null,"統一した従来技術：断面修復工法（施工日数、施工費用はポリマーセメントモルタル、左官工法）",null,null,"統一した従来技術：断面修復工法（施工日数、施工費用はポリマーセメントモルタル、左官工法）",null,null,"／",null,null,"／",null,null,"／",null,null,"／"]
[null,null,null,"施工する方向",null,"従来技術","新技術",null,"従来技術","新技術",null,"従来技術","新技術",null,"従来技術","新技術",null,"従来技術","新技術",null,"従来技術","新技術",null,"従来技術","新技術",null,"従来技術","新技術",null,"従来技術","新技術",null,"従来技術","新技術",null,"従来技術","新技術",null,"従来技術","新技術",null,"従来技術","新技術",null,"従来技術","新技術",null,"従来技術","新技術",null,"従来技術","新技術",null,"従来技術","新技術",null,"従来技術","新技術",null,"従来技術","新技術",null,"従来技術","新技術",null,"従来技術","新技術",null,"従来技術","新技術",null,"従来技術","新技術",null,"従来技術","新技術",null,"従来技術","新技術",null,"従来技術","新技術",null,"従来技術","新技術",null,"従来技術","新技術",null,"従来技術","新技術",null,"従来技術","新技術",null,"従来技術","新技術",null,"従来技術","新技術",null,"従来技術","新技術",null,"従来技術","新技術",null,"従来技術","新技術",null,"従来技術","新技術",null,"従来技術","新技術",null,"従来技術","新技術",null,"従来技術","新技術",null,"従来技術","新技術",null,"従来技術","新技術",null,"従来技術","新技術",null,"従来技術","新技術",null,"従来技術","新技術"]
[null,"⑪","施工費用　注1）","上向き施工","断面修復厚（ｍｍ）",3571000,50,null,"-",50,null,"-",50,null,3571000,30,null,"-",30,null,3571000,30,null,3571000,30,null,3571000,"-",null,3571000,"-",null,3571000,"-",null,3571000,10,null,"-",50,null,"-",50,null,"-",10,null,3571000,"-",null,3571000,"未回答",null,3571000,50,null,3571000,50,null,"-","60～100mm",null,3571000,"-",null,"-","-",null,3571000,100,null,"-",100,null,"-",50,null,"-","-",null,3571000,50,null,3571000,65,null,3571000,"-",null,"-","-",null,3571000,"-",null,"-","-",null,3571000,50,null,"-",50,null,3571000,25,null,3571000,"-",null,3571000,"-",null,3571000,"-",null,"-",50,null,3571000,50,null,3571000,10,null,"／","／",null,"／","／",null,"／","／",null,"／","／"]
[null,null,null,null,"施工費",null,1880580,null,null,2235729,null,null,1018740,null,null,3629660,null,null,3465716,null,null,2558710,null,null,2558710,null,null,"-",null,null,"-",null,null,"-",null,null,2927000,null,null,1657000,null,null,1606027,null,null,3324255,null,null,"-",null,null,"未回答",null,null,2535684,null,null,2535684,null,null,1514698,null,null,"-",null,null,"-",null,null,1405000,null,null,889600,null,null,1606107,null,null,"-",null,null,3296389,null,null,3137069,null,null,"-",null,null,2535684,null,null,"-",null,null,"-",null,null,1619885,null,null,325930,null,null,168488,null,null,"-",null,null,"-",null,null,"-",null,null,1523666,null,null,3082921,null,null,2264584,null,null,"／",null,null,"／",null,null,"／",null,null,"／"]
[null,null,null,null,"材料費",null,678100,null,null,801391,null,null,822760,null,null,639000,null,null,665625,null,null,636020,null,null,794116,null,null,"-",null,null,"-",null,null,"-",null,null,27857,null,null,27857,null,null,1051973,null,null,563745,null,null,"-",null,null,"未回答",null,null,702336,null,null,698088,null,null,815660,null,null,500000,null,null,500000,null,null,459000,null,null,500000,null,null,1240493,null,null,"-",null,null,819672,null,null,980896,null,null,"-",null,null,560500,null,null,"-",null,null,"-",null,null,645750,null,null,652500,null,null,1714286,null,null,"-",null,null,"-",null,null,"-",null,null,763590,null,null,636902,null,null,805932,null,null,"／",null,null,"／",null,null,"／",null,null,"／"]
[null,null,null,null,"合計",null,2558680,null,null,3037120,null,null,1841500,null,null,4268660,null,null,4131341,null,null,3194730,null,null,3352826,null,null,"-",null,null,"-",null,null,"-",null,null,2954857,null,null,1684857,null,null,2658000,null,null,3888000,null,null,"-",null,null,"未回答",null,null,3238020,null,null,3233772,null,null,2330358,null,null,"-",null,null,"-",null,null,1864000,null,null,1389600,null,null,2846600,null,null,"-",null,null,4116061,null,null,4117965,null,null,"-",null,null,{"$f":"IF(SUM(CM32:CN33)=0,\"-\",SUM(CM32:CN33))","v":3096184},null,null,{"$f":"IF(SUM(CP32:CQ33)=0,\"-\",SUM(CP32:CQ33))","v":"-"},null,null,{"$f":"IF(SUM(CS32:CT33)=0,\"-\",SUM(CS32:CT33))","v":"-"},null,null,{"$f":"IF(SUM(CV32:CW33)=0,\"-\",SUM(CV32:CW33))","v":2265635},null,null,{"$f":"IF(SUM(CY32:CZ33)=0,\"-\",SUM(CY32:CZ33))","v":978430},null,null,{"$f":"IF(SUM(DB32:DC33)=0,\"-\",SUM(DB32:DC33))","v":1882774},null,null,{"$f":"IF(SUM(DE32:DF33)=0,\"-\",SUM(DE32:DF33))","v":"-"},null,null,{"$f":"IF(SUM(DH32:DI33)=0,\"-\",SUM(DH32:DI33))","v":"-"},null,null,{"$f":"IF(SUM(DK32:DL33)=0,\"-\",SUM(DK32:DL33))","v":"-"},null,null,{"$f":"IF(SUM(DN32:DO33)=0,\"-\",SUM(DN32:DO33))","v":2287256},null,null,{"$f":"IF(SUM(DQ32:DR33)=0,\"-\",SUM(DQ32:DR33))","v":3719823},null,null,{"$f":"IF(SUM(DT32:DU33)=0,\"-\",SUM(DT32:DU33))","v":3070516},null,null,"／",null,null,"／",null,null,"／",null,null,"／"]
[null,null,null,"横向き施工","断面修復厚",null,50,null,null,50,null,null,50,null,null,30,null,null,30,null,null,30,null,null,30,null,null,"-",null,null,"-",null,null,"-",null,null,20,null,null,100,null,null,50,null,null,10,null,null,"-",null,null,"未回答",null,null,50,null,null,50,null,null,"60～100mm",null,null,"-",null,null,"-",null,null,100,null,null,100,null,null,50,null,null,"-",null,null,50,null,null,65,null,null,"-",null,null,"-",null,null,"-",null,null,"-",null,null,50,null,null,50,null,null,25,null,null,"-",null,null,"-",null,null,"-",null,null,50,null,null,50,null,null,10,null,null,"／",null,null,"／",null,null,"／",null,null,"／"]
[null,null,null,null,"施工費",null,1675520,null,null,1610209,null,null,1013520,null,null,2600950,null,null,2882554,null,null,2132258,null,null,2132258,null,null,"-",null,null,"-",null,null,"-",null,null,2675000,null,null,1657000,null,null,1271475,null,null,2442255,null,null,"-",null,null,"未回答",null,null,2535684,null,null,2535684,null,null,1423844,null,null,"-",null,null,"-",null,null,1080900,null,null,684300,null,null,1271635,null,null,2893609,null,null,2535684,null,null,3137069,null,null,"-",null,null,2535684,null,null,"-",null,null,"-",null,null,1619885,null,null,325930,null,null,168488,null,null,"-",null,null,"-",null,null,"-",null,null,1216516,null,null,2487450,null,null,2013268,null,null,"／",null,null,"／",null,null,"／",null,null,"／"]
[null,null,null,null,"材料費",null,678100,null,null,801391,null,null,822760,null,null,628350,null,null,639000,null,null,636020,null,null,794116,null,null,"-",null,null,"-",null,null,"-",null,null,27857,null,null,27857,null,null,995725,null,null,563745,null,null,"-",null,null,"未回答",null,null,702336,null,null,698088,null,null,776204,null,null,500000,null,null,500000,null,null,439000,null,null,478000,null,null,1174165,null,null,309375,null,null,786352,null,null,980896,null,null,"-",null,null,560500,null,null,"-",null,null,"-",null,null,645750,null,null,652500,null,null,1714286,null,null,"-",null,null,"-",null,null,"-",null,null,662240,null,null,586227,null,null,805932,null,null,"／",null,null,"／",null,null,"／",null,null,"／"]
[null,null,null,null,"合計",null,2353620,null,null,2411600,null,null,1836280,null,null,3229300,null,null,3521554,null,null,2768278,null,null,2926374,null,null,"-",null,null,"-",null,null,"-",null,null,2702857,null,null,1684857,null,null,2267200,null,null,3006000,null,null,"-",null,null,"未回答",null,null,3238020,null,null,3233772,null,null,2200048,null,null,"-",null,null,"-",null,null,1519900,null,null,1162300,null,null,2445800,null,null,3202984,null,null,3322036,null,null,4117965,null,null,"-",null,null,3096184,null,null,"-",null,null,"-",null,null,2265635,null,null,978430,null,null,1882774,null,null,"-",null,null,"-",null,null,"-",null,null,1878756,null,null,3073677,null,null,2819200,null,null,"／",null,null,"／",null,null,"／",null,null,"／"]
[null,null,null,"下向き施工","断面修復厚",null,50,null,null,50,null,null,50,null,null,30,null,null,30,null,null,30,null,null,30,null,null,50,null,null,50,null,null,50,null,null,20,null,null,100,null,null,"-",null,null,10,null,null,"10～30mm",null,null,"未回答",null,null,50,null,null,50,null,null,"60～100mm",null,null,"-",null,null,"-",null,null,100,null,null,100,null,null,"-",null,null,"-",null,null,50,null,null,65,null,null,50,null,null,"-",null,null,30,null,null,30,null,null,50,null,null,50,null,null,50,null,null,50,null,null,50,null,null,50,null,null,50,null,null,50,null,null,10,null,null,"／",null,null,"／",null,null,"／",null,null,"／"]
[null,null,null,null,"施工費",null,1675520,null,null,1610209,null,null,1013520,null,null,1913100,null,null,2397345,null,null,1705806,null,null,1705806,null,null,506440,null,null,506530,null,null,506530,null,null,2675000,null,null,1657000,null,null,"-",null,null,1848255,null,null,751080,null,null,"未回答",null,null,2535684,null,null,2535684,null,null,1250078,null,null,"-",null,null,"-",null,null,982650,null,null,622100,null,null,"-",null,null,2893609,null,null,2535684,null,null,3137069,null,null,993960,null,null,2535684,null,null,2594631,null,null,2341952,null,null,1619885,null,null,325930,null,null,84244,null,null,3136760,null,null,3136760,null,null,3136760,null,null,1114133,null,null,1891978,null,null,1845724,null,null,"／",null,null,"／",null,null,"／",null,null,"／"]
[null,null,null,null,"材料費",null,678100,null,null,801391,null,null,822760,null,null,612375,null,null,628350,null,null,636020,null,null,794116,null,null,921000,null,null,833196,null,null,740795,null,null,27857,null,null,27857,null,null,"-",null,null,563745,null,null,830419,null,null,"未回答",null,null,702336,null,null,698088,null,null,743324,null,null,500000,null,null,500000,null,null,419000,null,null,456000,null,null,"-",null,null,309375,null,null,786352,null,null,980896,null,null,904500,null,null,560500,null,null,629875,null,null,694749,null,null,645750,null,null,652500,null,null,1714286,null,null,733000,null,null,844400,null,null,957200,null,null,662240,null,null,535552,null,null,805932,null,null,"／",null,null,"／",null,null,"／",null,null,"／"]
[null,null,null,null,"合計",null,2353620,null,null,2411600,null,null,1836280,null,null,2525475,null,null,3025695,null,null,2341826,null,null,2499922,null,null,1427440,null,null,1339726,null,null,1247325,null,null,2702857,null,null,1684857,null,null,"-",null,null,2412000,null,null,1581499,null,null,"未回答",null,null,3238020,null,null,3233772,null,null,1993402,null,null,"-",null,null,"-",null,null,1401650,null,null,1078100,null,null,"-",null,null,3202984,null,null,3322036,null,null,4117965,null,null,1898460,null,null,3096184,null,null,3224506,null,null,3036701,null,null,2265635,null,null,978430,null,null,1798530,null,null,3869760,null,null,3981160,null,null,4093960,null,null,1776373,null,null,2427530,null,null,2651656,null,null,"／",null,null,"／",null,null,"／",null,null,"／"]
[null,"⑫","施工日数","上向き施工",null,27.78,9.9670000000000005,null,"-",8.8070000000000004,null,"-",2.71,null,27.78,20,null,"-",14,null,27.78,22.8,null,27.78,22.8,null,27.78,"-",null,27.78,"-",null,27.78,"-",null,27.78,9.4319999999999986,null,"-","未回答",null,"-",7,null,"-",28.75,null,27.78,"-",null,27.78,"未回答",null,27.78,23,null,27.78,23,null,"-",4.7300000000000004,null,27.78,"-",null,"-","-",null,27.78,4.5,null,"-",2.5,null,"-",7,null,"-","-",null,27.78,29.9,null,27.78,27.8,null,27.78,"-",null,"-",14.49,null,27.78,"-",null,"-","-",null,27.78,9.5,null,"-",1,null,27.78,11,null,27.78,"-",null,27.78,"-",null,27.78,"-",null,"-",5.7669999999999995,null,27.78,10.356999999999999,null,27.78,8.9469999999999992,null,"／","／",null,"／","／",null,"／","／",null,"／","／"]
[null,null,null,"横向き施工",null,null,8.8870000000000005,null,null,6.7270000000000003,null,null,2.6900000000000004,null,null,14.4,null,null,11.3,null,null,19,null,null,19,null,null,"-",null,null,"-",null,null,"-",null,null,7.032,null,null,"未回答",null,null,6,null,null,23,null,null,"-",null,null,"未回答",null,null,23,null,null,23,null,null,4.63,null,null,"-",null,null,"-",null,null,3.5,null,null,2,null,null,6,null,null,28,null,null,23,null,null,27.8,null,null,"-",null,null,14.49,null,null,"-",null,null,"-",null,null,9.5,null,null,1,null,null,11,null,null,"-",null,null,"-",null,null,"-",null,null,4.9870000000000001,null,null,8.6869999999999994,null,null,8.9469999999999992,null,null,"／",null,null,"／",null,null,"／",null,null,"／"]
[null,null,null,"下向き施工",null,null,8.8870000000000005,null,null,6.7270000000000003,null,null,2.6900000000000004,null,null,10.6,null,null,8.9,null,null,15.2,null,null,15.2,null,null,2.7,null,null,2.7,null,null,2.7,null,null,7.032,null,null,"未回答",null,null,"-",null,null,17.25,null,null,2.169,null,null,"未回答",null,null,23,null,null,23,null,null,4.41,null,null,"-",null,null,"-",null,null,2.5,null,null,1.5,null,null,"-",null,null,28,null,null,23,null,null,27.8,null,null,4,null,null,14.49,null,null,23.332999999999998,null,null,11.15,null,null,9.5,null,null,1,null,null,11,null,null,14.49,null,null,14.49,null,null,14.49,null,null,4.7270000000000003,null,null,7.0169999999999995,null,null,8.9469999999999992,null,null,"／",null,null,"／",null,null,"／",null,null,"／"]
[null,"備考",null,null,null,"-","・回答に鉄筋ケレン・防錆処理とコンクリートはつりを加算",null,"-","・回答に鉄筋ケレン・防錆処理とコンクリートはつりを加算",null,"-","・回答に鉄筋ケレン・防錆処理とコンクリートはつりを加算",null,"-","-",null,"-","-",null,"-","-",null,"-","-",null,"-","-",null,"-","-",null,"-","-",null,"-","・回答に鉄筋ケレン・防錆処理とコンクリートはつりを加算",null,"-","-",null,"-","-",null,"-","-",null,"-","-",null,"-","-",null,"-","-",null,"-","-",null,"-","・回答に鉄筋ケレン・防錆処理とコンクリートはつりを加算",null,"-","材料販売のみ",null,"-","材料販売のみ",null,"-","-",null,"-","-",null,"-","-",null,"-","-",null,"-","-",null,"-","-",null,"-","-",null,"-","-",null,"-","-",null,"-","-",null,"-","-",null,"-","-",null,"-","-",null,"-","-",null,"-","-",null,"-","-",null,"-","・回答に鉄筋ケレン・防錆処理とコンクリートはつりを加算",null,"-","・回答に鉄筋ケレン・防錆処理とコンクリートはつりを加算",null,"-","・回答に鉄筋ケレン・防錆処理とコンクリートはつりを加算",null,"／","／",null,"／","／",null,"／","／",null,"／","／"]
[null,"⑬","統一した従来技術との比較",null,"経済性",{"$f":"IFERROR(IF(AVERAGE(F31)=\"\",\"-\",IF(AVERAGE(G34,G38,G42)/AVERAGE(F31)=1,\"△\",IF(AVERAGE(G34,G38,G42)/AVERAGE(F31)>1,\"－（\"&ABS(ROUND(100*AVERAGE(G34,G38,G42)/AVERAGE(F31)-100,1))&\"％増）\",IF(AVERAGE(G34,G38,G42)/AVERAGE(F31)<1,\"○（\"&ABS(ROUND(100*AVERAGE(G34,G38,G42)/AVERAGE(F31)-100,1))&\"％減）\",\"\")))),\"-\")","v":"○（32.2％減）"},{"$f":"IFERROR(IF(AVERAGE(F31)=\"\",\"-\",\"（\"&TEXT(AVERAGE(G34,G38,G42),\"#,###\")&\"-\"&TEXT(AVERAGE(F31),\"#,###\")&\"）/\"&\n    TEXT(AVERAGE(F31),\"#,###\")&\"=\"&\n    TEXT((AVERAGE(G34,G38,G42)-AVERAGE(F31))/AVERAGE(F31)*100,\"0.0\")&\"%\"),\"-\")","v":"（2,421,973-3,571,000）/3,571,000=-32.2%"},null,{"$f":"IFERROR(IF(AVERAGE(I31)=\"\",\"-\",IF(AVERAGE(J34,J38,J42)/AVERAGE(I31)=1,\"△\",IF(AVERAGE(J34,J38,J42)/AVERAGE(I31)>1,\"－（\"&ABS(ROUND(100*AVERAGE(J34,J38,J42)/AVERAGE(I31)-100,1))&\"％増）\",IF(AVERAGE(J34,J38,J42)/AVERAGE(I31)<1,\"○（\"&ABS(ROUND(100*AVERAGE(J34,J38,J42)/AVERAGE(I31)-100,1))&\"％減）\",\"\")))),\"-\")","v":"-"},{"$f":"IFERROR(IF(AVERAGE(I31)=\"\",\"-\",\"（\"&TEXT(AVERAGE(J34,J38,J42),\"#,###\")&\"-\"&TEXT(AVERAGE(I31),\"#,###\")&\"）/\"&\n    TEXT(AVERAGE(I31),\"#,###\")&\"=\"&\n    TEXT((AVERAGE(J34,J38,J42)-AVERAGE(I31))/AVERAGE(I31)*100,\"0.0\")&\"%\"),\"-\")","v":"-"},null,{"$f":"IFERROR(IF(AVERAGE(L31)=\"\",\"-\",IF(AVERAGE(M34,M38,M42)/AVERAGE(L31)=1,\"△\",IF(AVERAGE(M34,M38,M42)/AVERAGE(L31)>1,\"－（\"&ABS(ROUND(100*AVERAGE(M34,M38,M42)/AVERAGE(L31)-100,1))&\"％増）\",IF(AVERAGE(M34,M38,M42)/AVERAGE(L31)<1,\"○（\"&ABS(ROUND(100*AVERAGE(M34,M38,M42)/AVERAGE(L31)-100,1))&\"％減）\",\"\")))),\"-\")","v":"-"},{"$f":"IFERROR(IF(AVERAGE(L31)=\"\",\"-\",\"（\"&TEXT(AVERAGE(M34,M38,M42),\"#,###\")&\"-\"&TEXT(AVERAGE(L31),\"#,###\")&\"）/\"&\n    TEXT(AVERAGE(L31),\"#,###\")&\"=\"&\n    TEXT((AVERAGE(M34,M38,M42)-AVERAGE(L31))/AVERAGE(L31)*100,\"0.0\")&\"%\"),\"-\")","v":"-"},null,{"$f":"IFERROR(IF(AVERAGE(O31)=\"\",\"-\",IF(AVERAGE(P34,P38,P42)/AVERAGE(O31)=1,\"△\",IF(AVERAGE(P34,P38,P42)/AVERAGE(O31)>1,\"－（\"&ABS(ROUND(100*AVERAGE(P34,P38,P42)/AVERAGE(O31)-100,1))&\"％増）\",IF(AVERAGE(P34,P38,P42)/AVERAGE(O31)<1,\"○（\"&ABS(ROUND(100*AVERAGE(P34,P38,P42)/AVERAGE(O31)-100,1))&\"％減）\",\"\")))),\"-\")","v":"○（6.4％減）"},{"$f":"IFERROR(IF(AVERAGE(O31)=\"\",\"-\",\"（\"&TEXT(AVERAGE(P34,P38,P42),\"#,###\")&\"-\"&TEXT(AVERAGE(O31),\"#,###\")&\"）/\"&\n    TEXT(AVERAGE(O31),\"#,###\")&\"=\"&\n    TEXT((AVERAGE(P34,P38,P42)-AVERAGE(O31))/AVERAGE(O31)*100,\"0.0\")&\"%\"),\"-\")","v":"（3,341,145-3,571,000）/3,571,000=-6.4%"},null,{"$f":"IFERROR(IF(AVERAGE(R31)=\"\",\"-\",IF(AVERAGE(S34,S38,S42)/AVERAGE(R31)=1,\"△\",IF(AVERAGE(S34,S38,S42)/AVERAGE(R31)>1,\"－（\"&ABS(ROUND(100*AVERAGE(S34,S38,S42)/AVERAGE(R31)-100,1))&\"％増）\",IF(AVERAGE(S34,S38,S42)/AVERAGE(R31)<1,\"○（\"&ABS(ROUND(100*AVERAGE(S34,S38,S42)/AVERAGE(R31)-100,1))&\"％減）\",\"\")))),\"-\")","v":"-"},{"$f":"IFERROR(IF(AVERAGE(R31)=\"\",\"-\",\"（\"&TEXT(AVERAGE(S34,S38,S42),\"#,###\")&\"-\"&TEXT(AVERAGE(R31),\"#,###\")&\"）/\"&\n    TEXT(AVERAGE(R31),\"#,###\")&\"=\"&\n    TEXT((AVERAGE(S34,S38,S42)-AVERAGE(R31))/AVERAGE(R31)*100,\"0.0\")&\"%\"),\"-\")","v":"-"},null,{"$f":"IFERROR(IF(AVERAGE(U31)=\"\",\"-\",IF(AVERAGE(V34,V38,V42)/AVERAGE(U31)=1,\"△\",IF(AVERAGE(V34,V38,V42)/AVERAGE(U31)>1,\"－（\"&ABS(ROUND(100*AVERAGE(V34,V38,V42)/AVERAGE(U31)-100,1))&\"％増）\",IF(AVERAGE(V34,V38,V42)/AVERAGE(U31)<1,\"○（\"&ABS(ROUND(100*AVERAGE(V34,V38,V42)/AVERAGE(U31)-100,1))&\"％減）\",\"\")))),\"-\")","v":"○（22.5％減）"},{"$f":"IFERROR(IF(AVERAGE(U31)=\"\",\"-\",\"（\"&TEXT(AVERAGE(V34,V38,V42),\"#,###\")&\"-\"&TEXT(AVERAGE(U31),\"#,###\")&\"）/\"&\n    TEXT(AVERAGE(U31),\"#,###\")&\"=\"&\n    TEXT((AVERAGE(V34,V38,V42)-AVERAGE(U31))/AVERAGE(U31)*100,\"0.0\")&\"%\"),\"-\")","v":"（2,768,278-3,571,000）/3,571,000=-22.5%"},null,{"$f":"IFERROR(IF(AVERAGE(X31)=\"\",\"-\",IF(AVERAGE(Y34,Y38,Y42)/AVERAGE(X31)=1,\"△\",IF(AVERAGE(Y34,Y38,Y42)/AVERAGE(X31)>1,\"－（\"&ABS(ROUND(100*AVERAGE(Y34,Y38,Y42)/AVERAGE(X31)-100,1))&\"％増）\",IF(AVERAGE(Y34,Y38,Y42)/AVERAGE(X31)<1,\"○（\"&ABS(ROUND(100*AVERAGE(Y34,Y38,Y42)/AVERAGE(X31)-100,1))&\"％減）\",\"\")))),\"-\")","v":"○（18.1％減）"},{"$f":"IFERROR(IF(AVERAGE(X31)=\"\",\"-\",\"（\"&TEXT(AVERAGE(Y34,Y38,Y42),\"#,###\")&\"-\"&TEXT(AVERAGE(X31),\"#,###\")&\"）/\"&\n    TEXT(AVERAGE(X31),\"#,###\")&\"=\"&\n    TEXT((AVERAGE(Y34,Y38,Y42)-AVERAGE(X31))/AVERAGE(X31)*100,\"0.0\")&\"%\"),\"-\")","v":"（2,926,374-3,571,000）/3,571,000=-18.1%"},null,{"$f":"IFERROR(IF(AVERAGE(AA31)=\"\",\"-\",IF(AVERAGE(AB34,AB38,AB42)/AVERAGE(AA31)=1,\"△\",IF(AVERAGE(AB34,AB38,AB42)/AVERAGE(AA31)>1,\"－（\"&ABS(ROUND(100*AVERAGE(AB34,AB38,AB42)/AVERAGE(AA31)-100,1))&\"％増）\",IF(AVERAGE(AB34,AB38,AB42)/AVERAGE(AA31)<1,\"○（\"&ABS(ROUND(100*AVERAGE(AB34,AB38,AB42)/AVERAGE(AA31)-100,1))&\"％減）\",\"\")))),\"-\")","v":"○（60％減）"},{"$f":"IFERROR(IF(AVERAGE(AA31)=\"\",\"-\",\"（\"&TEXT(AVERAGE(AB34,AB38,AB42),\"#,###\")&\"-\"&TEXT(AVERAGE(AA31),\"#,###\")&\"）/\"&\n    TEXT(AVERAGE(AA31),\"#,###\")&\"=\"&\n    TEXT((AVERAGE(AB34,AB38,AB42)-AVERAGE(AA31))/AVERAGE(AA31)*100,\"0.0\")&\"%\"),\"-\")","v":"（1,427,440-3,571,000）/3,571,000=-60.0%"},null,{"$f":"IFERROR(IF(AVERAGE(AD31)=\"\",\"-\",IF(AVERAGE(AE34,AE38,AE42)/AVERAGE(AD31)=1,\"△\",IF(AVERAGE(AE34,AE38,AE42)/AVERAGE(AD31)>1,\"－（\"&ABS(ROUND(100*AVERAGE(AE34,AE38,AE42)/AVERAGE(AD31)-100,1))&\"％増）\",IF(AVERAGE(AE34,AE38,AE42)/AVERAGE(AD31)<1,\"○（\"&ABS(ROUND(100*AVERAGE(AE34,AE38,AE42)/AVERAGE(AD31)-100,1))&\"％減）\",\"\")))),\"-\")","v":"○（62.5％減）"},{"$f":"IFERROR(IF(AVERAGE(AD31)=\"\",\"-\",\"（\"&TEXT(AVERAGE(AE34,AE38,AE42),\"#,###\")&\"-\"&TEXT(AVERAGE(AD31),\"#,###\")&\"）/\"&\n    TEXT(AVERAGE(AD31),\"#,###\")&\"=\"&\n    TEXT((AVERAGE(AE34,AE38,AE42)-AVERAGE(AD31))/AVERAGE(AD31)*100,\"0.0\")&\"%\"),\"-\")","v":"（1,339,726-3,571,000）/3,571,000=-62.5%"},null,{"$f":"IFERROR(IF(AVERAGE(AG31)=\"\",\"-\",IF(AVERAGE(AH34,AH38,AH42)/AVERAGE(AG31)=1,\"△\",IF(AVERAGE(AH34,AH38,AH42)/AVERAGE(AG31)>1,\"－（\"&ABS(ROUND(100*AVERAGE(AH34,AH38,AH42)/AVERAGE(AG31)-100,1))&\"％増）\",IF(AVERAGE(AH34,AH38,AH42)/AVERAGE(AG31)<1,\"○（\"&ABS(ROUND(100*AVERAGE(AH34,AH38,AH42)/AVERAGE(AG31)-100,1))&\"％減）\",\"\")))),\"-\")","v":"○（65.1％減）"},{"$f":"IFERROR(IF(AVERAGE(AG31)=\"\",\"-\",\"（\"&TEXT(AVERAGE(AH34,AH38,AH42),\"#,###\")&\"-\"&TEXT(AVERAGE(AG31),\"#,###\")&\"）/\"&\n    TEXT(AVERAGE(AG31),\"#,###\")&\"=\"&\n    TEXT((AVERAGE(AH34,AH38,AH42)-AVERAGE(AG31))/AVERAGE(AG31)*100,\"0.0\")&\"%\"),\"-\")","v":"（1,247,325-3,571,000）/3,571,000=-65.1%"},null,{"$f":"IFERROR(IF(AVERAGE(AJ31)=\"\",\"-\",IF(AVERAGE(AK34,AK38,AK42)/AVERAGE(AJ31)=1,\"△\",IF(AVERAGE(AK34,AK38,AK42)/AVERAGE(AJ31)>1,\"－（\"&ABS(ROUND(100*AVERAGE(AK34,AK38,AK42)/AVERAGE(AJ31)-100,1))&\"％増）\",IF(AVERAGE(AK34,AK38,AK42)/AVERAGE(AJ31)<1,\"○（\"&ABS(ROUND(100*AVERAGE(AK34,AK38,AK42)/AVERAGE(AJ31)-100,1))&\"％減）\",\"\")))),\"-\")","v":"○（22％減）"},{"$f":"IFERROR(IF(AVERAGE(AJ31)=\"\",\"-\",\"（\"&TEXT(AVERAGE(AK34,AK38,AK42),\"#,###\")&\"-\"&TEXT(AVERAGE(AJ31),\"#,###\")&\"）/\"&\n    TEXT(AVERAGE(AJ31),\"#,###\")&\"=\"&\n    TEXT((AVERAGE(AK34,AK38,AK42)-AVERAGE(AJ31))/AVERAGE(AJ31)*100,\"0.0\")&\"%\"),\"-\")","v":"（2,786,857-3,571,000）/3,571,000=-22.0%"},null,{"$f":"IFERROR(IF(AVERAGE(AM31)=\"\",\"-\",IF(AVERAGE(AN34,AN38,AN42)/AVERAGE(AM31)=1,\"△\",IF(AVERAGE(AN34,AN38,AN42)/AVERAGE(AM31)>1,\"－（\"&ABS(ROUND(100*AVERAGE(AN34,AN38,AN42)/AVERAGE(AM31)-100,1))&\"％増）\",IF(AVERAGE(AN34,AN38,AN42)/AVERAGE(AM31)<1,\"○（\"&ABS(ROUND(100*AVERAGE(AN34,AN38,AN42)/AVERAGE(AM31)-100,1))&\"％減）\",\"\")))),\"-\")","v":"-"},{"$f":"IFERROR(IF(AVERAGE(AM31)=\"\",\"-\",\"（\"&TEXT(AVERAGE(AN34,AN38,AN42),\"#,###\")&\"-\"&TEXT(AVERAGE(AM31),\"#,###\")&\"）/\"&\n    TEXT(AVERAGE(AM31),\"#,###\")&\"=\"&\n    TEXT((AVERAGE(AN34,AN38,AN42)-AVERAGE(AM31))/AVERAGE(AM31)*100,\"0.0\")&\"%\"),\"-\")","v":"-"},null,{"$f":"IFERROR(IF(AVERAGE(AP31)=\"\",\"-\",IF(AVERAGE(AQ34,AQ38,AQ42)/AVERAGE(AP31)=1,\"△\",IF(AVERAGE(AQ34,AQ38,AQ42)/AVERAGE(AP31)>1,\"－（\"&ABS(ROUND(100*AVERAGE(AQ34,AQ38,AQ42)/AVERAGE(AP31)-100,1))&\"％増）\",IF(AVERAGE(AQ34,AQ38,AQ42)/AVERAGE(AP31)<1,\"○（\"&ABS(ROUND(100*AVERAGE(AQ34,AQ38,AQ42)/AVERAGE(AP31)-100,1))&\"％減）\",\"\")))),\"-\")","v":"-"},{"$f":"IFERROR(IF(AVERAGE(AP31)=\"\",\"-\",\"（\"&TEXT(AVERAGE(AQ34,AQ38,AQ42),\"#,###\")&\"-\"&TEXT(AVERAGE(AP31),\"#,###\")&\"）/\"&\n    TEXT(AVERAGE(AP31),\"#,###\")&\"=\"&\n    TEXT((AVERAGE(AQ34,AQ38,AQ42)-AVERAGE(AP31))/AVERAGE(AP31)*100,\"0.0\")&\"%\"),\"-\")","v":"-"},null,{"$f":"IFERROR(IF(AVERAGE(AS31)=\"\",\"-\",IF(AVERAGE(AT34,AT38,AT42)/AVERAGE(AS31)=1,\"△\",IF(AVERAGE(AT34,AT38,AT42)/AVERAGE(AS31)>1,\"－（\"&ABS(ROUND(100*AVERAGE(AT34,AT38,AT42)/AVERAGE(AS31)-100,1))&\"％増）\",IF(AVERAGE(AT34,AT38,AT42)/AVERAGE(AS31)<1,\"○（\"&ABS(ROUND(100*AVERAGE(AT34,AT38,AT42)/AVERAGE(AS31)-100,1))&\"％減）\",\"\")))),\"-\")","v":"-"},{"$f":"IFERROR(IF(AVERAGE(AS31)=\"\",\"-\",\"（\"&TEXT(AVERAGE(AT34,AT38,AT42),\"#,###\")&\"-\"&TEXT(AVERAGE(AS31),\"#,###\")&\"）/\"&\n    TEXT(AVERAGE(AS31),\"#,###\")&\"=\"&\n    TEXT((AVERAGE(AT34,AT38,AT42)-AVERAGE(AS31))/AVERAGE(AS31)*100,\"0.0\")&\"%\"),\"-\")","v":"-"},null,{"$f":"IFERROR(IF(AVERAGE(AV31)=\"\",\"-\",IF(AVERAGE(AW34,AW38,AW42)/AVERAGE(AV31)=1,\"△\",IF(AVERAGE(AW34,AW38,AW42)/AVERAGE(AV31)>1,\"－（\"&ABS(ROUND(100*AVERAGE(AW34,AW38,AW42)/AVERAGE(AV31)-100,1))&\"％増）\",IF(AVERAGE(AW34,AW38,AW42)/AVERAGE(AV31)<1,\"○（\"&ABS(ROUND(100*AVERAGE(AW34,AW38,AW42)/AVERAGE(AV31)-100,1))&\"％減）\",\"\")))),\"-\")","v":"○（55.7％減）"},{"$f":"IFERROR(IF(AVERAGE(AV31)=\"\",\"-\",\"（\"&TEXT(AVERAGE(AW34,AW38,AW42),\"#,###\")&\"-\"&TEXT(AVERAGE(AV31),\"#,###\")&\"）/\"&\n    TEXT(AVERAGE(AV31),\"#,###\")&\"=\"&\n    TEXT((AVERAGE(AW34,AW38,AW42)-AVERAGE(AV31))/AVERAGE(AV31)*100,\"0.0\")&\"%\"),\"-\")","v":"（1,581,499-3,571,000）/3,571,000=-55.7%"},null,{"$f":"IFERROR(IF(AVERAGE(AY31)=\"\",\"-\",IF(AVERAGE(AZ34,AZ38,AZ42)/AVERAGE(AY31)=1,\"△\",IF(AVERAGE(AZ34,AZ38,AZ42)/AVERAGE(AY31)>1,\"－（\"&ABS(ROUND(100*AVERAGE(AZ34,AZ38,AZ42)/AVERAGE(AY31)-100,1))&\"％増）\",IF(AVERAGE(AZ34,AZ38,AZ42)/AVERAGE(AY31)<1,\"○（\"&ABS(ROUND(100*AVERAGE(AZ34,AZ38,AZ42)/AVERAGE(AY31)-100,1))&\"％減）\",\"\")))),\"-\")","v":"-"},{"$f":"IFERROR(IF(AVERAGE(AY31)=\"\",\"-\",\"（\"&TEXT(AVERAGE(AZ34,AZ38,AZ42),\"#,###\")&\"-\"&TEXT(AVERAGE(AY31),\"#,###\")&\"）/\"&\n    TEXT(AVERAGE(AY31),\"#,###\")&\"=\"&\n    TEXT((AVERAGE(AZ34,AZ38,AZ42)-AVERAGE(AY31))/AVERAGE(AY31)*100,\"0.0\")&\"%\"),\"-\")","v":"-"},null,{"$f":"IFERROR(IF(AVERAGE(BB31)=\"\",\"-\",IF(AVERAGE(BC34,BC38,BC42)/AVERAGE(BB31)=1,\"△\",IF(AVERAGE(BC34,BC38,BC42)/AVERAGE(BB31)>1,\"－（\"&ABS(ROUND(100*AVERAGE(BC34,BC38,BC42)/AVERAGE(BB31)-100,1))&\"％増）\",IF(AVERAGE(BC34,BC38,BC42)/AVERAGE(BB31)<1,\"○（\"&ABS(ROUND(100*AVERAGE(BC34,BC38,BC42)/AVERAGE(BB31)-100,1))&\"％減）\",\"\")))),\"-\")","v":"○（9.3％減）"},{"$f":"IFERROR(IF(AVERAGE(BB31)=\"\",\"-\",\"（\"&TEXT(AVERAGE(BC34,BC38,BC42),\"#,###\")&\"-\"&TEXT(AVERAGE(BB31),\"#,###\")&\"）/\"&\n    TEXT(AVERAGE(BB31),\"#,###\")&\"=\"&\n    TEXT((AVERAGE(BC34,BC38,BC42)-AVERAGE(BB31))/AVERAGE(BB31)*100,\"0.0\")&\"%\"),\"-\")","v":"（3,238,020-3,571,000）/3,571,000=-9.3%"},null,{"$f":"IFERROR(IF(AVERAGE(BE31)=\"\",\"-\",IF(AVERAGE(BF34,BF38,BF42)/AVERAGE(BE31)=1,\"△\",IF(AVERAGE(BF34,BF38,BF42)/AVERAGE(BE31)>1,\"－（\"&ABS(ROUND(100*AVERAGE(BF34,BF38,BF42)/AVERAGE(BE31)-100,1))&\"％増）\",IF(AVERAGE(BF34,BF38,BF42)/AVERAGE(BE31)<1,\"○（\"&ABS(ROUND(100*AVERAGE(BF34,BF38,BF42)/AVERAGE(BE31)-100,1))&\"％減）\",\"\")))),\"-\")","v":"○（9.4％減）"},{"$f":"IFERROR(IF(AVERAGE(BE31)=\"\",\"-\",\"（\"&TEXT(AVERAGE(BF34,BF38,BF42),\"#,###\")&\"-\"&TEXT(AVERAGE(BE31),\"#,###\")&\"）/\"&\n    TEXT(AVERAGE(BE31),\"#,###\")&\"=\"&\n    TEXT((AVERAGE(BF34,BF38,BF42)-AVERAGE(BE31))/AVERAGE(BE31)*100,\"0.0\")&\"%\"),\"-\")","v":"（3,233,772-3,571,000）/3,571,000=-9.4%"},null,{"$f":"IFERROR(IF(AVERAGE(BH31)=\"\",\"-\",IF(AVERAGE(BI34,BI38,BI42)/AVERAGE(BH31)=1,\"△\",IF(AVERAGE(BI34,BI38,BI42)/AVERAGE(BH31)>1,\"－（\"&ABS(ROUND(100*AVERAGE(BI34,BI38,BI42)/AVERAGE(BH31)-100,1))&\"％増）\",IF(AVERAGE(BI34,BI38,BI42)/AVERAGE(BH31)<1,\"○（\"&ABS(ROUND(100*AVERAGE(BI34,BI38,BI42)/AVERAGE(BH31)-100,1))&\"％減）\",\"\")))),\"-\")","v":"-"},{"$f":"IFERROR(IF(AVERAGE(BH31)=\"\",\"-\",\"（\"&TEXT(AVERAGE(BI34,BI38,BI42),\"#,###\")&\"-\"&TEXT(AVERAGE(BH31),\"#,###\")&\"）/\"&\n    TEXT(AVERAGE(BH31),\"#,###\")&\"=\"&\n    TEXT((AVERAGE(BI34,BI38,BI42)-AVERAGE(BH31))/AVERAGE(BH31)*100,\"0.0\")&\"%\"),\"-\")","v":"-"},null,{"$f":"IFERROR(IF(AVERAGE(BK31)=\"\",\"-\",IF(AVERAGE(BL34,BL38,BL42)/AVERAGE(BK31)=1,\"△\",IF(AVERAGE(BL34,BL38,BL42)/AVERAGE(BK31)>1,\"－（\"&ABS(ROUND(100*AVERAGE(BL34,BL38,BL42)/AVERAGE(BK31)-100,1))&\"％増）\",IF(AVERAGE(BL34,BL38,BL42)/AVERAGE(BK31)<1,\"○（\"&ABS(ROUND(100*AVERAGE(BL34,BL38,BL42)/AVERAGE(BK31)-100,1))&\"％減）\",\"\")))),\"-\")","v":"-"},{"$f":"IFERROR(IF(AVERAGE(BK31)=\"\",\"-\",\"（\"&TEXT(AVERAGE(BL34,BL38,BL42),\"#,###\")&\"-\"&TEXT(AVERAGE(BK31),\"#,###\")&\"）/\"&\n    TEXT(AVERAGE(BK31),\"#,###\")&\"=\"&\n    TEXT((AVERAGE(BL34,BL38,BL42)-AVERAGE(BK31))/AVERAGE(BK31)*100,\"0.0\")&\"%\"),\"-\")","v":"-"},null,{"$f":"IFERROR(IF(AVERAGE(BN31)=\"\",\"-\",IF(AVERAGE(BO34,BO38,BO42)/AVERAGE(BN31)=1,\"△\",IF(AVERAGE(BO34,BO38,BO42)/AVERAGE(BN31)>1,\"－（\"&ABS(ROUND(100*AVERAGE(BO34,BO38,BO42)/AVERAGE(BN31)-100,1))&\"％増）\",IF(AVERAGE(BO34,BO38,BO42)/AVERAGE(BN31)<1,\"○（\"&ABS(ROUND(100*AVERAGE(BO34,BO38,BO42)/AVERAGE(BN31)-100,1))&\"％減）\",\"\")))),\"-\")","v":"-"},{"$f":"IFERROR(IF(AVERAGE(BN31)=\"\",\"-\",\"（\"&TEXT(AVERAGE(BO34,BO38,BO42),\"#,###\")&\"-\"&TEXT(AVERAGE(BN31),\"#,###\")&\"）/\"&\n    TEXT(AVERAGE(BN31),\"#,###\")&\"=\"&\n    TEXT((AVERAGE(BO34,BO38,BO42)-AVERAGE(BN31))/AVERAGE(BN31)*100,\"0.0\")&\"%\"),\"-\")","v":"-"},null,{"$f":"IFERROR(IF(AVERAGE(BQ31)=\"\",\"-\",IF(AVERAGE(BR34,BR38,BR42)/AVERAGE(BQ31)=1,\"△\",IF(AVERAGE(BR34,BR38,BR42)/AVERAGE(BQ31)>1,\"－（\"&ABS(ROUND(100*AVERAGE(BR34,BR38,BR42)/AVERAGE(BQ31)-100,1))&\"％増）\",IF(AVERAGE(BR34,BR38,BR42)/AVERAGE(BQ31)<1,\"○（\"&ABS(ROUND(100*AVERAGE(BR34,BR38,BR42)/AVERAGE(BQ31)-100,1))&\"％減）\",\"\")))),\"-\")","v":"○（55.3％減）"},{"$f":"IFERROR(IF(AVERAGE(BQ31)=\"\",\"-\",\"（\"&TEXT(AVERAGE(BR34,BR38,BR42),\"#,###\")&\"-\"&TEXT(AVERAGE(BQ31),\"#,###\")&\"）/\"&\n    TEXT(AVERAGE(BQ31),\"#,###\")&\"=\"&\n    TEXT((AVERAGE(BR34,BR38,BR42)-AVERAGE(BQ31))/AVERAGE(BQ31)*100,\"0.0\")&\"%\"),\"-\")","v":"（1,595,183-3,571,000）/3,571,000=-55.3%"},null,{"$f":"IFERROR(IF(AVERAGE(BT31)=\"\",\"-\",IF(AVERAGE(BU34,BU38,BU42)/AVERAGE(BT31)=1,\"△\",IF(AVERAGE(BU34,BU38,BU42)/AVERAGE(BT31)>1,\"－（\"&ABS(ROUND(100*AVERAGE(BU34,BU38,BU42)/AVERAGE(BT31)-100,1))&\"％増）\",IF(AVERAGE(BU34,BU38,BU42)/AVERAGE(BT31)<1,\"○（\"&ABS(ROUND(100*AVERAGE(BU34,BU38,BU42)/AVERAGE(BT31)-100,1))&\"％減）\",\"\")))),\"-\")","v":"-"},{"$f":"IFERROR(IF(AVERAGE(BT31)=\"\",\"-\",\"（\"&TEXT(AVERAGE(BU34,BU38,BU42),\"#,###\")&\"-\"&TEXT(AVERAGE(BT31),\"#,###\")&\"）/\"&\n    TEXT(AVERAGE(BT31),\"#,###\")&\"=\"&\n    TEXT((AVERAGE(BU34,BU38,BU42)-AVERAGE(BT31))/AVERAGE(BT31)*100,\"0.0\")&\"%\"),\"-\")","v":"-"},null,{"$f":"IFERROR(IF(AVERAGE(BW31)=\"\",\"-\",IF(AVERAGE(BX34,BX38,BX42)/AVERAGE(BW31)=1,\"△\",IF(AVERAGE(BX34,BX38,BX42)/AVERAGE(BW31)>1,\"－（\"&ABS(ROUND(100*AVERAGE(BX34,BX38,BX42)/AVERAGE(BW31)-100,1))&\"％増）\",IF(AVERAGE(BX34,BX38,BX42)/AVERAGE(BW31)<1,\"○（\"&ABS(ROUND(100*AVERAGE(BX34,BX38,BX42)/AVERAGE(BW31)-100,1))&\"％減）\",\"\")))),\"-\")","v":"-"},{"$f":"IFERROR(IF(AVERAGE(BW31)=\"\",\"-\",\"（\"&TEXT(AVERAGE(BX34,BX38,BX42),\"#,###\")&\"-\"&TEXT(AVERAGE(BW31),\"#,###\")&\"）/\"&\n    TEXT(AVERAGE(BW31),\"#,###\")&\"=\"&\n    TEXT((AVERAGE(BX34,BX38,BX42)-AVERAGE(BW31))/AVERAGE(BW31)*100,\"0.0\")&\"%\"),\"-\")","v":"-"},null,{"$f":"IFERROR(IF(AVERAGE(BZ31)=\"\",\"-\",IF(AVERAGE(CA34,CA38,CA42)/AVERAGE(BZ31)=1,\"△\",IF(AVERAGE(CA34,CA38,CA42)/AVERAGE(BZ31)>1,\"－（\"&ABS(ROUND(100*AVERAGE(CA34,CA38,CA42)/AVERAGE(BZ31)-100,1))&\"％増）\",IF(AVERAGE(CA34,CA38,CA42)/AVERAGE(BZ31)<1,\"○（\"&ABS(ROUND(100*AVERAGE(CA34,CA38,CA42)/AVERAGE(BZ31)-100,1))&\"％減）\",\"\")))),\"-\")","v":"-"},{"$f":"IFERROR(IF(AVERAGE(BZ31)=\"\",\"-\",\"（\"&TEXT(AVERAGE(CA34,CA38,CA42),\"#,###\")&\"-\"&TEXT(AVERAGE(BZ31),\"#,###\")&\"）/\"&\n    TEXT(AVERAGE(BZ31),\"#,###\")&\"=\"&\n    TEXT((AVERAGE(CA34,CA38,CA42)-AVERAGE(BZ31))/AVERAGE(BZ31)*100,\"0.0\")&\"%\"),\"-\")","v":"-"},null,{"$f":"IFERROR(IF(AVERAGE(CC31)=\"\",\"-\",IF(AVERAGE(CD34,CD38,CD42)/AVERAGE(CC31)=1,\"△\",IF(AVERAGE(CD34,CD38,CD42)/AVERAGE(CC31)>1,\"－（\"&ABS(ROUND(100*AVERAGE(CD34,CD38,CD42)/AVERAGE(CC31)-100,1))&\"％増）\",IF(AVERAGE(CD34,CD38,CD42)/AVERAGE(CC31)<1,\"○（\"&ABS(ROUND(100*AVERAGE(CD34,CD38,CD42)/AVERAGE(CC31)-100,1))&\"％減）\",\"\")))),\"-\")","v":"－（0.4％増）"},{"$f":"IFERROR(IF(AVERAGE(CC31)=\"\",\"-\",\"（\"&TEXT(AVERAGE(CD34,CD38,CD42),\"#,###\")&\"-\"&TEXT(AVERAGE(CC31),\"#,###\")&\"）/\"&\n    TEXT(AVERAGE(CC31),\"#,###\")&\"=\"&\n    TEXT((AVERAGE(CD34,CD38,CD42)-AVERAGE(CC31))/AVERAGE(CC31)*100,\"0.0\")&\"%\"),\"-\")","v":"（3,586,711-3,571,000）/3,571,000=0.4%"},null,{"$f":"IFERROR(IF(AVERAGE(CF31)=\"\",\"-\",IF(AVERAGE(CG34,CG38,CG42)/AVERAGE(CF31)=1,\"△\",IF(AVERAGE(CG34,CG38,CG42)/AVERAGE(CF31)>1,\"－（\"&ABS(ROUND(100*AVERAGE(CG34,CG38,CG42)/AVERAGE(CF31)-100,1))&\"％増）\",IF(AVERAGE(CG34,CG38,CG42)/AVERAGE(CF31)<1,\"○（\"&ABS(ROUND(100*AVERAGE(CG34,CG38,CG42)/AVERAGE(CF31)-100,1))&\"％減）\",\"\")))),\"-\")","v":"－（15.3％増）"},{"$f":"IFERROR(IF(AVERAGE(CF31)=\"\",\"-\",\"（\"&TEXT(AVERAGE(CG34,CG38,CG42),\"#,###\")&\"-\"&TEXT(AVERAGE(CF31),\"#,###\")&\"）/\"&\n    TEXT(AVERAGE(CF31),\"#,###\")&\"=\"&\n    TEXT((AVERAGE(CG34,CG38,CG42)-AVERAGE(CF31))/AVERAGE(CF31)*100,\"0.0\")&\"%\"),\"-\")","v":"（4,117,965-3,571,000）/3,571,000=15.3%"},null,{"$f":"IFERROR(IF(AVERAGE(CI31)=\"\",\"-\",IF(AVERAGE(CJ34,CJ38,CJ42)/AVERAGE(CI31)=1,\"△\",IF(AVERAGE(CJ34,CJ38,CJ42)/AVERAGE(CI31)>1,\"－（\"&ABS(ROUND(100*AVERAGE(CJ34,CJ38,CJ42)/AVERAGE(CI31)-100,1))&\"％増）\",IF(AVERAGE(CJ34,CJ38,CJ42)/AVERAGE(CI31)<1,\"○（\"&ABS(ROUND(100*AVERAGE(CJ34,CJ38,CJ42)/AVERAGE(CI31)-100,1))&\"％減）\",\"\")))),\"-\")","v":"○（46.8％減）"},{"$f":"IFERROR(IF(AVERAGE(CI31)=\"\",\"-\",\"（\"&TEXT(AVERAGE(CJ34,CJ38,CJ42),\"#,###\")&\"-\"&TEXT(AVERAGE(CI31),\"#,###\")&\"）/\"&\n    TEXT(AVERAGE(CI31),\"#,###\")&\"=\"&\n    TEXT((AVERAGE(CJ34,CJ38,CJ42)-AVERAGE(CI31))/AVERAGE(CI31)*100,\"0.0\")&\"%\"),\"-\")","v":"（1,898,460-3,571,000）/3,571,000=-46.8%"},null,{"$f":"IFERROR(IF(AVERAGE(CL31)=\"\",\"-\",IF(AVERAGE(CM34,CM38,CM42)/AVERAGE(CL31)=1,\"△\",IF(AVERAGE(CM34,CM38,CM42)/AVERAGE(CL31)>1,\"－（\"&ABS(ROUND(100*AVERAGE(CM34,CM38,CM42)/AVERAGE(CL31)-100,1))&\"％増）\",IF(AVERAGE(CM34,CM38,CM42)/AVERAGE(CL31)<1,\"○（\"&ABS(ROUND(100*AVERAGE(CM34,CM38,CM42)/AVERAGE(CL31)-100,1))&\"％減）\",\"\")))),\"-\")","v":"-"},{"$f":"IFERROR(IF(AVERAGE(CL31)=\"\",\"-\",\"（\"&TEXT(AVERAGE(CM34,CM38,CM42),\"#,###\")&\"-\"&TEXT(AVERAGE(CL31),\"#,###\")&\"）/\"&\n    TEXT(AVERAGE(CL31),\"#,###\")&\"=\"&\n    TEXT((AVERAGE(CM34,CM38,CM42)-AVERAGE(CL31))/AVERAGE(CL31)*100,\"0.0\")&\"%\"),\"-\")","v":"-"},null,{"$f":"IFERROR(IF(AVERAGE(CO31)=\"\",\"-\",IF(AVERAGE(CP34,CP38,CP42)/AVERAGE(CO31)=1,\"△\",IF(AVERAGE(CP34,CP38,CP42)/AVERAGE(CO31)>1,\"－（\"&ABS(ROUND(100*AVERAGE(CP34,CP38,CP42)/AVERAGE(CO31)-100,1))&\"％増）\",IF(AVERAGE(CP34,CP38,CP42)/AVERAGE(CO31)<1,\"○（\"&ABS(ROUND(100*AVERAGE(CP34,CP38,CP42)/AVERAGE(CO31)-100,1))&\"％減）\",\"\")))),\"-\")","v":"○（9.7％減）"},{"$f":"IFERROR(IF(AVERAGE(CO31)=\"\",\"-\",\"（\"&TEXT(AVERAGE(CP34,CP38,CP42),\"#,###\")&\"-\"&TEXT(AVERAGE(CO31),\"#,###\")&\"）/\"&\n    TEXT(AVERAGE(CO31),\"#,###\")&\"=\"&\n    TEXT((AVERAGE(CP34,CP38,CP42)-AVERAGE(CO31))/AVERAGE(CO31)*100,\"0.0\")&\"%\"),\"-\")","v":"（3,224,506-3,571,000）/3,571,000=-9.7%"},null,{"$f":"IFERROR(IF(AVERAGE(CR31)=\"\",\"-\",IF(AVERAGE(CS34,CS38,CS42)/AVERAGE(CR31)=1,\"△\",IF(AVERAGE(CS34,CS38,CS42)/AVERAGE(CR31)>1,\"－（\"&ABS(ROUND(100*AVERAGE(CS34,CS38,CS42)/AVERAGE(CR31)-100,1))&\"％増）\",IF(AVERAGE(CS34,CS38,CS42)/AVERAGE(CR31)<1,\"○（\"&ABS(ROUND(100*AVERAGE(CS34,CS38,CS42)/AVERAGE(CR31)-100,1))&\"％減）\",\"\")))),\"-\")","v":"-"},{"$f":"IFERROR(IF(AVERAGE(CR31)=\"\",\"-\",\"（\"&TEXT(AVERAGE(CS34,CS38,CS42),\"#,###\")&\"-\"&TEXT(AVERAGE(CR31),\"#,###\")&\"）/\"&\n    TEXT(AVERAGE(CR31),\"#,###\")&\"=\"&\n    TEXT((AVERAGE(CS34,CS38,CS42)-AVERAGE(CR31))/AVERAGE(CR31)*100,\"0.0\")&\"%\"),\"-\")","v":"-"},null,{"$f":"IFERROR(IF(AVERAGE(CU31)=\"\",\"-\",IF(AVERAGE(CV34,CV38,CV42)/AVERAGE(CU31)=1,\"△\",IF(AVERAGE(CV34,CV38,CV42)/AVERAGE(CU31)>1,\"－（\"&ABS(ROUND(100*AVERAGE(CV34,CV38,CV42)/AVERAGE(CU31)-100,1))&\"％増）\",IF(AVERAGE(CV34,CV38,CV42)/AVERAGE(CU31)<1,\"○（\"&ABS(ROUND(100*AVERAGE(CV34,CV38,CV42)/AVERAGE(CU31)-100,1))&\"％減）\",\"\")))),\"-\")","v":"○（36.6％減）"},{"$f":"IFERROR(IF(AVERAGE(CU31)=\"\",\"-\",\"（\"&TEXT(AVERAGE(CV34,CV38,CV42),\"#,###\")&\"-\"&TEXT(AVERAGE(CU31),\"#,###\")&\"）/\"&\n    TEXT(AVERAGE(CU31),\"#,###\")&\"=\"&\n    TEXT((AVERAGE(CV34,CV38,CV42)-AVERAGE(CU31))/AVERAGE(CU31)*100,\"0.0\")&\"%\"),\"-\")","v":"（2,265,635-3,571,000）/3,571,000=-36.6%"},null,{"$f":"IFERROR(IF(AVERAGE(CX31)=\"\",\"-\",IF(AVERAGE(CY34,CY38,CY42)/AVERAGE(CX31)=1,\"△\",IF(AVERAGE(CY34,CY38,CY42)/AVERAGE(CX31)>1,\"－（\"&ABS(ROUND(100*AVERAGE(CY34,CY38,CY42)/AVERAGE(CX31)-100,1))&\"％増）\",IF(AVERAGE(CY34,CY38,CY42)/AVERAGE(CX31)<1,\"○（\"&ABS(ROUND(100*AVERAGE(CY34,CY38,CY42)/AVERAGE(CX31)-100,1))&\"％減）\",\"\")))),\"-\")","v":"-"},{"$f":"IFERROR(IF(AVERAGE(CX31)=\"\",\"-\",\"（\"&TEXT(AVERAGE(CY34,CY38,CY42),\"#,###\")&\"-\"&TEXT(AVERAGE(CX31),\"#,###\")&\"）/\"&\n    TEXT(AVERAGE(CX31),\"#,###\")&\"=\"&\n    TEXT((AVERAGE(CY34,CY38,CY42)-AVERAGE(CX31))/AVERAGE(CX31)*100,\"0.0\")&\"%\"),\"-\")","v":"-"},null,{"$f":"IFERROR(IF(AVERAGE(DA31)=\"\",\"-\",IF(AVERAGE(DB34,DB38,DB42)/AVERAGE(DA31)=1,\"△\",IF(AVERAGE(DB34,DB38,DB42)/AVERAGE(DA31)>1,\"－（\"&ABS(ROUND(100*AVERAGE(DB34,DB38,DB42)/AVERAGE(DA31)-100,1))&\"％増）\",IF(AVERAGE(DB34,DB38,DB42)/AVERAGE(DA31)<1,\"○（\"&ABS(ROUND(100*AVERAGE(DB34,DB38,DB42)/AVERAGE(DA31)-100,1))&\"％減）\",\"\")))),\"-\")","v":"○（48.1％減）"},{"$f":"IFERROR(IF(AVERAGE(DA31)=\"\",\"-\",\"（\"&TEXT(AVERAGE(DB34,DB38,DB42),\"#,###\")&\"-\"&TEXT(AVERAGE(DA31),\"#,###\")&\"）/\"&\n    TEXT(AVERAGE(DA31),\"#,###\")&\"=\"&\n    TEXT((AVERAGE(DB34,DB38,DB42)-AVERAGE(DA31))/AVERAGE(DA31)*100,\"0.0\")&\"%\"),\"-\")","v":"（1,854,693-3,571,000）/3,571,000=-48.1%"},null,{"$f":"IFERROR(IF(AVERAGE(DD31)=\"\",\"-\",IF(AVERAGE(DE34,DE38,DE42)/AVERAGE(DD31)=1,\"△\",IF(AVERAGE(DE34,DE38,DE42)/AVERAGE(DD31)>1,\"－（\"&ABS(ROUND(100*AVERAGE(DE34,DE38,DE42)/AVERAGE(DD31)-100,1))&\"％増）\",IF(AVERAGE(DE34,DE38,DE42)/AVERAGE(DD31)<1,\"○（\"&ABS(ROUND(100*AVERAGE(DE34,DE38,DE42)/AVERAGE(DD31)-100,1))&\"％減）\",\"\")))),\"-\")","v":"－（8.4％増）"},{"$f":"IFERROR(IF(AVERAGE(DD31)=\"\",\"-\",\"（\"&TEXT(AVERAGE(DE34,DE38,DE42),\"#,###\")&\"-\"&TEXT(AVERAGE(DD31),\"#,###\")&\"）/\"&\n    TEXT(AVERAGE(DD31),\"#,###\")&\"=\"&\n    TEXT((AVERAGE(DE34,DE38,DE42)-AVERAGE(DD31))/AVERAGE(DD31)*100,\"0.0\")&\"%\"),\"-\")","v":"（3,869,760-3,571,000）/3,571,000=8.4%"},null,{"$f":"IFERROR(IF(AVERAGE(DG31)=\"\",\"-\",IF(AVERAGE(DH34,DH38,DH42)/AVERAGE(DG31)=1,\"△\",IF(AVERAGE(DH34,DH38,DH42)/AVERAGE(DG31)>1,\"－（\"&ABS(ROUND(100*AVERAGE(DH34,DH38,DH42)/AVERAGE(DG31)-100,1))&\"％増）\",IF(AVERAGE(DH34,DH38,DH42)/AVERAGE(DG31)<1,\"○（\"&ABS(ROUND(100*AVERAGE(DH34,DH38,DH42)/AVERAGE(DG31)-100,1))&\"％減）\",\"\")))),\"-\")","v":"－（11.5％増）"},{"$f":"IFERROR(IF(AVERAGE(DG31)=\"\",\"-\",\"（\"&TEXT(AVERAGE(DH34,DH38,DH42),\"#,###\")&\"-\"&TEXT(AVERAGE(DG31),\"#,###\")&\"）/\"&\n    TEXT(AVERAGE(DG31),\"#,###\")&\"=\"&\n    TEXT((AVERAGE(DH34,DH38,DH42)-AVERAGE(DG31))/AVERAGE(DG31)*100,\"0.0\")&\"%\"),\"-\")","v":"（3,981,160-3,571,000）/3,571,000=11.5%"},null,{"$f":"IFERROR(IF(AVERAGE(DJ31)=\"\",\"-\",IF(AVERAGE(DK34,DK38,DK42)/AVERAGE(DJ31)=1,\"△\",IF(AVERAGE(DK34,DK38,DK42)/AVERAGE(DJ31)>1,\"－（\"&ABS(ROUND(100*AVERAGE(DK34,DK38,DK42)/AVERAGE(DJ31)-100,1))&\"％増）\",IF(AVERAGE(DK34,DK38,DK42)/AVERAGE(DJ31)<1,\"○（\"&ABS(ROUND(100*AVERAGE(DK34,DK38,DK42)/AVERAGE(DJ31)-100,1))&\"％減）\",\"\")))),\"-\")","v":"－（14.6％増）"},{"$f":"IFERROR(IF(AVERAGE(DJ31)=\"\",\"-\",\"（\"&TEXT(AVERAGE(DK34,DK38,DK42),\"#,###\")&\"-\"&TEXT(AVERAGE(DJ31),\"#,###\")&\"）/\"&\n    TEXT(AVERAGE(DJ31),\"#,###\")&\"=\"&\n    TEXT((AVERAGE(DK34,DK38,DK42)-AVERAGE(DJ31))/AVERAGE(DJ31)*100,\"0.0\")&\"%\"),\"-\")","v":"（4,093,960-3,571,000）/3,571,000=14.6%"},null,{"$f":"IFERROR(IF(AVERAGE(DM31)=\"\",\"-\",IF(AVERAGE(DN34,DN38,DN42)/AVERAGE(DM31)=1,\"△\",IF(AVERAGE(DN34,DN38,DN42)/AVERAGE(DM31)>1,\"－（\"&ABS(ROUND(100*AVERAGE(DN34,DN38,DN42)/AVERAGE(DM31)-100,1))&\"％増）\",IF(AVERAGE(DN34,DN38,DN42)/AVERAGE(DM31)<1,\"○（\"&ABS(ROUND(100*AVERAGE(DN34,DN38,DN42)/AVERAGE(DM31)-100,1))&\"％減）\",\"\")))),\"-\")","v":"-"},{"$f":"IFERROR(IF(AVERAGE(DM31)=\"\",\"-\",\"（\"&TEXT(AVERAGE(DN34,DN38,DN42),\"#,###\")&\"-\"&TEXT(AVERAGE(DM31),\"#,###\")&\"）/\"&\n    TEXT(AVERAGE(DM31),\"#,###\")&\"=\"&\n    TEXT((AVERAGE(DN34,DN38,DN42)-AVERAGE(DM31))/AVERAGE(DM31)*100,\"0.0\")&\"%\"),\"-\")","v":"-"},null,{"$f":"IFERROR(IF(AVERAGE(DP31)=\"\",\"-\",IF(AVERAGE(DQ34,DQ38,DQ42)/AVERAGE(DP31)=1,\"△\",IF(AVERAGE(DQ34,DQ38,DQ42)/AVERAGE(DP31)>1,\"－（\"&ABS(ROUND(100*AVERAGE(DQ34,DQ38,DQ42)/AVERAGE(DP31)-100,1))&\"％増）\",IF(AVERAGE(DQ34,DQ38,DQ42)/AVERAGE(DP31)<1,\"○（\"&ABS(ROUND(100*AVERAGE(DQ34,DQ38,DQ42)/AVERAGE(DP31)-100,1))&\"％減）\",\"\")))),\"-\")","v":"○（13.9％減）"},{"$f":"IFERROR(IF(AVERAGE(DP31)=\"\",\"-\",\"（\"&TEXT(AVERAGE(DQ34,DQ38,DQ42),\"#,###\")&\"-\"&TEXT(AVERAGE(DP31),\"#,###\")&\"）/\"&\n    TEXT(AVERAGE(DP31),\"#,###\")&\"=\"&\n    TEXT((AVERAGE(DQ34,DQ38,DQ42)-AVERAGE(DP31))/AVERAGE(DP31)*100,\"0.0\")&\"%\"),\"-\")","v":"（3,073,677-3,571,000）/3,571,000=-13.9%"},null,{"$f":"IFERROR(IF(AVERAGE(DS31)=\"\",\"-\",IF(AVERAGE(DT34,DT38,DT42)/AVERAGE(DS31)=1,\"△\",IF(AVERAGE(DT34,DT38,DT42)/AVERAGE(DS31)>1,\"－（\"&ABS(ROUND(100*AVERAGE(DT34,DT38,DT42)/AVERAGE(DS31)-100,1))&\"％増）\",IF(AVERAGE(DT34,DT38,DT42)/AVERAGE(DS31)<1,\"○（\"&ABS(ROUND(100*AVERAGE(DT34,DT38,DT42)/AVERAGE(DS31)-100,1))&\"％減）\",\"\")))),\"-\")","v":"○（20.3％減）"},{"$f":"IFERROR(IF(AVERAGE(DS31)=\"\",\"-\",\"（\"&TEXT(AVERAGE(DT34,DT38,DT42),\"#,###\")&\"-\"&TEXT(AVERAGE(DS31),\"#,###\")&\"）/\"&\n    TEXT(AVERAGE(DS31),\"#,###\")&\"=\"&\n    TEXT((AVERAGE(DT34,DT38,DT42)-AVERAGE(DS31))/AVERAGE(DS31)*100,\"0.0\")&\"%\"),\"-\")","v":"（2,847,124-3,571,000）/3,571,000=-20.3%"},null,{"$f":"IFERROR(IF(AVERAGE(DV31)=\"\",\"／\",IF(AVERAGE(DW34,DW38,DW42)/AVERAGE(DV31)=1,\"△\",IF(AVERAGE(DW34,DW38,DW42)/AVERAGE(DV31)>1,\"／（\"&ABS(ROUND(100*AVERAGE(DW34,DW38,DW42)/AVERAGE(DV31)/100,1))&\"％増）\",IF(AVERAGE(DW34,DW38,DW42)/AVERAGE(DV31)<1,\"○（\"&ABS(ROUND(100*AVERAGE(DW34,DW38,DW42)/AVERAGE(DV31)/100,1))&\"％減）\",\"\")))),\"／\")","v":"／"},{"$f":"IFERROR(IF(AVERAGE(DV31)=\"\",\"／\",\"（\"&TEXT(AVERAGE(DW34,DW38,DW42),\"#,###\")&\"／\"&TEXT(AVERAGE(DV31),\"#,###\")&\"）/\"&\n    TEXT(AVERAGE(DV31),\"#,###\")&\"=\"&\n    TEXT((AVERAGE(DW34,DW38,DW42)/AVERAGE(DV31))/AVERAGE(DV31)*100,\"0.0\")&\"%\"),\"／\")","v":"／"},null,{"$f":"IFERROR(IF(AVERAGE(DY31)=\"\",\"／\",IF(AVERAGE(DZ34,DZ38,DZ42)/AVERAGE(DY31)=1,\"△\",IF(AVERAGE(DZ34,DZ38,DZ42)/AVERAGE(DY31)>1,\"／（\"&ABS(ROUND(100*AVERAGE(DZ34,DZ38,DZ42)/AVERAGE(DY31)/100,1))&\"％増）\",IF(AVERAGE(DZ34,DZ38,DZ42)/AVERAGE(DY31)<1,\"○（\"&ABS(ROUND(100*AVERAGE(DZ34,DZ38,DZ42)/AVERAGE(DY31)/100,1))&\"％減）\",\"\")))),\"／\")","v":"／"},{"$f":"IFERROR(IF(AVERAGE(DY31)=\"\",\"／\",\"（\"&TEXT(AVERAGE(DZ34,DZ38,DZ42),\"#,###\")&\"／\"&TEXT(AVERAGE(DY31),\"#,###\")&\"）/\"&\n    TEXT(AVERAGE(DY31),\"#,###\")&\"=\"&\n    TEXT((AVERAGE(DZ34,DZ38,DZ42)/AVERAGE(DY31))/AVERAGE(DY31)*100,\"0.0\")&\"%\"),\"／\")","v":"／"},null,{"$f":"IFERROR(IF(AVERAGE(EB31)=\"\",\"／\",IF(AVERAGE(EC34,EC38,EC42)/AVERAGE(EB31)=1,\"△\",IF(AVERAGE(EC34,EC38,EC42)/AVERAGE(EB31)>1,\"／（\"&ABS(ROUND(100*AVERAGE(EC34,EC38,EC42)/AVERAGE(EB31)/100,1))&\"％増）\",IF(AVERAGE(EC34,EC38,EC42)/AVERAGE(EB31)<1,\"○（\"&ABS(ROUND(100*AVERAGE(EC34,EC38,EC42)/AVERAGE(EB31)/100,1))&\"％減）\",\"\")))),\"／\")","v":"／"},{"$f":"IFERROR(IF(AVERAGE(EB31)=\"\",\"／\",\"（\"&TEXT(AVERAGE(EC34,EC38,EC42),\"#,###\")&\"／\"&TEXT(AVERAGE(EB31),\"#,###\")&\"）/\"&\n    TEXT(AVERAGE(EB31),\"#,###\")&\"=\"&\n    TEXT((AVERAGE(EC34,EC38,EC42)/AVERAGE(EB31))/AVERAGE(EB31)*100,\"0.0\")&\"%\"),\"／\")","v":"／"},null,{"$f":"IFERROR(IF(AVERAGE(EE31)=\"\",\"／\",IF(AVERAGE(EF34,EF38,EF42)/AVERAGE(EE31)=1,\"△\",IF(AVERAGE(EF34,EF38,EF42)/AVERAGE(EE31)>1,\"／（\"&ABS(ROUND(100*AVERAGE(EF34,EF38,EF42)/AVERAGE(EE31)/100,1))&\"％増）\",IF(AVERAGE(EF34,EF38,EF42)/AVERAGE(EE31)<1,\"○（\"&ABS(ROUND(100*AVERAGE(EF34,EF38,EF42)/AVERAGE(EE31)/100,1))&\"％減）\",\"\")))),\"／\")","v":"／"},{"$f":"IFERROR(IF(AVERAGE(EE31)=\"\",\"／\",\"（\"&TEXT(AVERAGE(EF34,EF38,EF42),\"#,###\")&\"／\"&TEXT(AVERAGE(EE31),\"#,###\")&\"）/\"&\n    TEXT(AVERAGE(EE31),\"#,###\")&\"=\"&\n    TEXT((AVERAGE(EF34,EF38,EF42)/AVERAGE(EE31))/AVERAGE(EE31)*100,\"0.0\")&\"%\"),\"／\")","v":"／"}]
[null,null,null,null,"工程",{"$f":"IFERROR(IF(F43=\"\",\"-\",IF(ROUND(AVERAGE(G43:H45),3)/ROUND(F43,3)=1,\"△\",IF(ROUND(AVERAGE(G43:H45),3)/ROUND(F43,3)>1,\"－（\"&ABS(ROUND(100*ROUND(AVERAGE(G43:H45),3)/ROUND(F43,3)-100,1))&\"％増）\",IF(ROUND(AVERAGE(G43:H45),3)/ROUND(F43,3)<1,\"○（\"&ABS(ROUND(100*ROUND(AVERAGE(G43:H45),3)/ROUND(F43,3)-100,1))&\"％減）\",\"\")))),\"-\")","v":"○（66.7％減）"},{"$f":"IFERROR(IF(ISBLANK(F43),\"-\",\"（\" & TEXT(ROUND(AVERAGE(G43:H45),3),\"#,##0.000\")& \"-\" & TEXT(ROUND(F43,3),\"#,##0.000\")& \"）/\" &\n    TEXT(ROUND(F43,3),\"#,##0.000\")& \"=\" &\n    TEXT((ROUND(AVERAGE(G43:H45),3)-ROUND(F43,3))/ROUND(F43,3)*100,\"0.0\")& \"%\"),\"-\")","v":"（9.247-27.780）/27.780=-66.7%"},null,{"$f":"IFERROR(IF(I43=\"\",\"-\",IF(ROUND(AVERAGE(J43:K45),3)/ROUND(I43,3)=1,\"△\",IF(ROUND(AVERAGE(J43:K45),3)/ROUND(I43,3)>1,\"－（\"&ABS(ROUND(100*ROUND(AVERAGE(J43:K45),3)/ROUND(I43,3)-100,1))&\"％増）\",IF(ROUND(AVERAGE(J43:K45),3)/ROUND(I43,3)<1,\"○（\"&ABS(ROUND(100*ROUND(AVERAGE(J43:K45),3)/ROUND(I43,3)-100,1))&\"％減）\",\"\")))),\"-\")","v":"-"},{"$f":"IFERROR(IF(ISBLANK(I43),\"-\",\"（\" & TEXT(ROUND(AVERAGE(J43:K45),3),\"#,##0.000\")& \"-\" & TEXT(ROUND(I43,3),\"#,##0.000\")& \"）/\" &\n    TEXT(ROUND(I43,3),\"#,##0.000\")& \"=\" &\n    TEXT((ROUND(AVERAGE(J43:K45),3)-ROUND(I43,3))/ROUND(I43,3)*100,\"0.0\")& \"%\"),\"-\")","v":"-"},null,{"$f":"IFERROR(IF(L43=\"\",\"-\",IF(ROUND(AVERAGE(M43:N45),3)/ROUND(L43,3)=1,\"△\",IF(ROUND(AVERAGE(M43:N45),3)/ROUND(L43,3)>1,\"－（\"&ABS(ROUND(100*ROUND(AVERAGE(M43:N45),3)/ROUND(L43,3)-100,1))&\"％増）\",IF(ROUND(AVERAGE(M43:N45),3)/ROUND(L43,3)<1,\"○（\"&ABS(ROUND(100*ROUND(AVERAGE(M43:N45),3)/ROUND(L43,3)-100,1))&\"％減）\",\"\")))),\"-\")","v":"-"},{"$f":"IFERROR(IF(ISBLANK(L43),\"-\",\"（\" & TEXT(ROUND(AVERAGE(M43:N45),3),\"#,##0.000\")& \"-\" & TEXT(ROUND(L43,3),\"#,##0.000\")& \"）/\" &\n    TEXT(ROUND(L43,3),\"#,##0.000\")& \"=\" &\n    TEXT((ROUND(AVERAGE(M43:N45),3)-ROUND(L43,3))/ROUND(L43,3)*100,\"0.0\")& \"%\"),\"-\")","v":"-"},null,{"$f":"IFERROR(IF(O43=\"\",\"-\",IF(ROUND(AVERAGE(P43:Q45),3)/ROUND(O43,3)=1,\"△\",IF(ROUND(AVERAGE(P43:Q45),3)/ROUND(O43,3)>1,\"－（\"&ABS(ROUND(100*ROUND(AVERAGE(P43:Q45),3)/ROUND(O43,3)-100,1))&\"％増）\",IF(ROUND(AVERAGE(P43:Q45),3)/ROUND(O43,3)<1,\"○（\"&ABS(ROUND(100*ROUND(AVERAGE(P43:Q45),3)/ROUND(O43,3)-100,1))&\"％減）\",\"\")))),\"-\")","v":"○（46％減）"},{"$f":"IFERROR(IF(ISBLANK(O43),\"-\",\"（\" & TEXT(ROUND(AVERAGE(P43:Q45),3),\"#,##0.000\")& \"-\" & TEXT(ROUND(O43,3),\"#,##0.000\")& \"）/\" &\n    TEXT(ROUND(O43,3),\"#,##0.000\")& \"=\" &\n    TEXT((ROUND(AVERAGE(P43:Q45),3)-ROUND(O43,3))/ROUND(O43,3)*100,\"0.0\")& \"%\"),\"-\")","v":"（15.000-27.780）/27.780=-46.0%"},null,{"$f":"IFERROR(IF(R43=\"\",\"-\",IF(ROUND(AVERAGE(S43:T45),3)/ROUND(R43,3)=1,\"△\",IF(ROUND(AVERAGE(S43:T45),3)/ROUND(R43,3)>1,\"－（\"&ABS(ROUND(100*ROUND(AVERAGE(S43:T45),3)/ROUND(R43,3)-100,1))&\"％増）\",IF(ROUND(AVERAGE(S43:T45),3)/ROUND(R43,3)<1,\"○（\"&ABS(ROUND(100*ROUND(AVERAGE(S43:T45),3)/ROUND(R43,3)-100,1))&\"％減）\",\"\")))),\"-\")","v":"-"},{"$f":"IFERROR(IF(ISBLANK(R43),\"-\",\"（\" & TEXT(ROUND(AVERAGE(S43:T45),3),\"#,##0.000\")& \"-\" & TEXT(ROUND(R43,3),\"#,##0.000\")& \"）/\" &\n    TEXT(ROUND(R43,3),\"#,##0.000\")& \"=\" &\n    TEXT((ROUND(AVERAGE(S43:T45),3)-ROUND(R43,3))/ROUND(R43,3)*100,\"0.0\")& \"%\"),\"-\")","v":"-"},null,{"$f":"IFERROR(IF(U43=\"\",\"-\",IF(ROUND(AVERAGE(V43:W45),3)/ROUND(U43,3)=1,\"△\",IF(ROUND(AVERAGE(V43:W45),3)/ROUND(U43,3)>1,\"－（\"&ABS(ROUND(100*ROUND(AVERAGE(V43:W45),3)/ROUND(U43,3)-100,1))&\"％増）\",IF(ROUND(AVERAGE(V43:W45),3)/ROUND(U43,3)<1,\"○（\"&ABS(ROUND(100*ROUND(AVERAGE(V43:W45),3)/ROUND(U43,3)-100,1))&\"％減）\",\"\")))),\"-\")","v":"○（31.6％減）"},{"$f":"IFERROR(IF(ISBLANK(U43),\"-\",\"（\" & TEXT(ROUND(AVERAGE(V43:W45),3),\"#,##0.000\")& \"-\" & TEXT(ROUND(U43,3),\"#,##0.000\")& \"）/\" &\n    TEXT(ROUND(U43,3),\"#,##0.000\")& \"=\" &\n    TEXT((ROUND(AVERAGE(V43:W45),3)-ROUND(U43,3))/ROUND(U43,3)*100,\"0.0\")& \"%\"),\"-\")","v":"（19.000-27.780）/27.780=-31.6%"},null,{"$f":"IFERROR(IF(X43=\"\",\"-\",IF(ROUND(AVERAGE(Y43:Z45),3)/ROUND(X43,3)=1,\"△\",IF(ROUND(AVERAGE(Y43:Z45),3)/ROUND(X43,3)>1,\"－（\"&ABS(ROUND(100*ROUND(AVERAGE(Y43:Z45),3)/ROUND(X43,3)-100,1))&\"％増）\",IF(ROUND(AVERAGE(Y43:Z45),3)/ROUND(X43,3)<1,\"○（\"&ABS(ROUND(100*ROUND(AVERAGE(Y43:Z45),3)/ROUND(X43,3)-100,1))&\"％減）\",\"\")))),\"-\")","v":"○（31.6％減）"},{"$f":"IFERROR(IF(ISBLANK(X43),\"-\",\"（\" & TEXT(ROUND(AVERAGE(Y43:Z45),3),\"#,##0.000\")& \"-\" & TEXT(ROUND(X43,3),\"#,##0.000\")& \"）/\" &\n    TEXT(ROUND(X43,3),\"#,##0.000\")& \"=\" &\n    TEXT((ROUND(AVERAGE(Y43:Z45),3)-ROUND(X43,3))/ROUND(X43,3)*100,\"0.0\")& \"%\"),\"-\")","v":"（19.000-27.780）/27.780=-31.6%"},null,{"$f":"IFERROR(IF(AA43=\"\",\"-\",IF(ROUND(AVERAGE(AB43:AC45),3)/ROUND(AA43,3)=1,\"△\",IF(ROUND(AVERAGE(AB43:AC45),3)/ROUND(AA43,3)>1,\"－（\"&ABS(ROUND(100*ROUND(AVERAGE(AB43:AC45),3)/ROUND(AA43,3)-100,1))&\"％増）\",IF(ROUND(AVERAGE(AB43:AC45),3)/ROUND(AA43,3)<1,\"○（\"&ABS(ROUND(100*ROUND(AVERAGE(AB43:AC45),3)/ROUND(AA43,3)-100,1))&\"％減）\",\"\")))),\"-\")","v":"○（90.3％減）"},{"$f":"IFERROR(IF(ISBLANK(AA43),\"-\",\"（\" & TEXT(ROUND(AVERAGE(AB43:AC45),3),\"#,##0.000\")& \"-\" & TEXT(ROUND(AA43,3),\"#,##0.000\")& \"）/\" &\n    TEXT(ROUND(AA43,3),\"#,##0.000\")& \"=\" &\n    TEXT((ROUND(AVERAGE(AB43:AC45),3)-ROUND(AA43,3))/ROUND(AA43,3)*100,\"0.0\")& \"%\"),\"-\")","v":"（2.700-27.780）/27.780=-90.3%"},null,{"$f":"IFERROR(IF(AD43=\"\",\"-\",IF(ROUND(AVERAGE(AE43:AF45),3)/ROUND(AD43,3)=1,\"△\",IF(ROUND(AVERAGE(AE43:AF45),3)/ROUND(AD43,3)>1,\"－（\"&ABS(ROUND(100*ROUND(AVERAGE(AE43:AF45),3)/ROUND(AD43,3)-100,1))&\"％増）\",IF(ROUND(AVERAGE(AE43:AF45),3)/ROUND(AD43,3)<1,\"○（\"&ABS(ROUND(100*ROUND(AVERAGE(AE43:AF45),3)/ROUND(AD43,3)-100,1))&\"％減）\",\"\")))),\"-\")","v":"○（90.3％減）"},{"$f":"IFERROR(IF(ISBLANK(AD43),\"-\",\"（\" & TEXT(ROUND(AVERAGE(AE43:AF45),3),\"#,##0.000\")& \"-\" & TEXT(ROUND(AD43,3),\"#,##0.000\")& \"）/\" &\n    TEXT(ROUND(AD43,3),\"#,##0.000\")& \"=\" &\n    TEXT((ROUND(AVERAGE(AE43:AF45),3)-ROUND(AD43,3))/ROUND(AD43,3)*100,\"0.0\")& \"%\"),\"-\")","v":"（2.700-27.780）/27.780=-90.3%"},null,{"$f":"IFERROR(IF(AG43=\"\",\"-\",IF(ROUND(AVERAGE(AH43:AI45),3)/ROUND(AG43,3)=1,\"△\",IF(ROUND(AVERAGE(AH43:AI45),3)/ROUND(AG43,3)>1,\"－（\"&ABS(ROUND(100*ROUND(AVERAGE(AH43:AI45),3)/ROUND(AG43,3)-100,1))&\"％増）\",IF(ROUND(AVERAGE(AH43:AI45),3)/ROUND(AG43,3)<1,\"○（\"&ABS(ROUND(100*ROUND(AVERAGE(AH43:AI45),3)/ROUND(AG43,3)-100,1))&\"％減）\",\"\")))),\"-\")","v":"○（90.3％減）"},{"$f":"IFERROR(IF(ISBLANK(AG43),\"-\",\"（\" & TEXT(ROUND(AVERAGE(AH43:AI45),3),\"#,##0.000\")& \"-\" & TEXT(ROUND(AG43,3),\"#,##0.000\")& \"）/\" &\n    TEXT(ROUND(AG43,3),\"#,##0.000\")& \"=\" &\n    TEXT((ROUND(AVERAGE(AH43:AI45),3)-ROUND(AG43,3))/ROUND(AG43,3)*100,\"0.0\")& \"%\"),\"-\")","v":"（2.700-27.780）/27.780=-90.3%"},null,{"$f":"IFERROR(IF(AJ43=\"\",\"-\",IF(ROUND(AVERAGE(AK43:AL45),3)/ROUND(AJ43,3)=1,\"△\",IF(ROUND(AVERAGE(AK43:AL45),3)/ROUND(AJ43,3)>1,\"－（\"&ABS(ROUND(100*ROUND(AVERAGE(AK43:AL45),3)/ROUND(AJ43,3)-100,1))&\"％増）\",IF(ROUND(AVERAGE(AK43:AL45),3)/ROUND(AJ43,3)<1,\"○（\"&ABS(ROUND(100*ROUND(AVERAGE(AK43:AL45),3)/ROUND(AJ43,3)-100,1))&\"％減）\",\"\")))),\"-\")","v":"○（71.8％減）"},{"$f":"IFERROR(IF(ISBLANK(AJ43),\"-\",\"（\" & TEXT(ROUND(AVERAGE(AK43:AL45),3),\"#,##0.000\")& \"-\" & TEXT(ROUND(AJ43,3),\"#,##0.000\")& \"）/\" &\n    TEXT(ROUND(AJ43,3),\"#,##0.000\")& \"=\" &\n    TEXT((ROUND(AVERAGE(AK43:AL45),3)-ROUND(AJ43,3))/ROUND(AJ43,3)*100,\"0.0\")& \"%\"),\"-\")","v":"（7.832-27.780）/27.780=-71.8%"},null,{"$f":"IFERROR(IF(AM43=\"\",\"-\",IF(ROUND(AVERAGE(AN43:AO45),3)/ROUND(AM43,3)=1,\"△\",IF(ROUND(AVERAGE(AN43:AO45),3)/ROUND(AM43,3)>1,\"－（\"&ABS(ROUND(100*ROUND(AVERAGE(AN43:AO45),3)/ROUND(AM43,3)-100,1))&\"％増）\",IF(ROUND(AVERAGE(AN43:AO45),3)/ROUND(AM43,3)<1,\"○（\"&ABS(ROUND(100*ROUND(AVERAGE(AN43:AO45),3)/ROUND(AM43,3)-100,1))&\"％減）\",\"\")))),\"-\")","v":"-"},{"$f":"IFERROR(IF(ISBLANK(AM43),\"-\",\"（\" & TEXT(ROUND(AVERAGE(AN43:AO45),3),\"#,##0.000\")& \"-\" & TEXT(ROUND(AM43,3),\"#,##0.000\")& \"）/\" &\n    TEXT(ROUND(AM43,3),\"#,##0.000\")& \"=\" &\n    TEXT((ROUND(AVERAGE(AN43:AO45),3)-ROUND(AM43,3))/ROUND(AM43,3)*100,\"0.0\")& \"%\"),\"-\")","v":"-"},null,{"$f":"IFERROR(IF(AP43=\"\",\"-\",IF(ROUND(AVERAGE(AQ43:AR45),3)/ROUND(AP43,3)=1,\"△\",IF(ROUND(AVERAGE(AQ43:AR45),3)/ROUND(AP43,3)>1,\"－（\"&ABS(ROUND(100*ROUND(AVERAGE(AQ43:AR45),3)/ROUND(AP43,3)-100,1))&\"％増）\",IF(ROUND(AVERAGE(AQ43:AR45),3)/ROUND(AP43,3)<1,\"○（\"&ABS(ROUND(100*ROUND(AVERAGE(AQ43:AR45),3)/ROUND(AP43,3)-100,1))&\"％減）\",\"\")))),\"-\")","v":"-"},{"$f":"IFERROR(IF(ISBLANK(AP43),\"-\",\"（\" & TEXT(ROUND(AVERAGE(AQ43:AR45),3),\"#,##0.000\")& \"-\" & TEXT(ROUND(AP43,3),\"#,##0.000\")& \"）/\" &\n    TEXT(ROUND(AP43,3),\"#,##0.000\")& \"=\" &\n    TEXT((ROUND(AVERAGE(AQ43:AR45),3)-ROUND(AP43,3))/ROUND(AP43,3)*100,\"0.0\")& \"%\"),\"-\")","v":"-"},null,{"$f":"IFERROR(IF(AS43=\"\",\"-\",IF(ROUND(AVERAGE(AT43:AU45),3)/ROUND(AS43,3)=1,\"△\",IF(ROUND(AVERAGE(AT43:AU45),3)/ROUND(AS43,3)>1,\"－（\"&ABS(ROUND(100*ROUND(AVERAGE(AT43:AU45),3)/ROUND(AS43,3)-100,1))&\"％増）\",IF(ROUND(AVERAGE(AT43:AU45),3)/ROUND(AS43,3)<1,\"○（\"&ABS(ROUND(100*ROUND(AVERAGE(AT43:AU45),3)/ROUND(AS43,3)-100,1))&\"％減）\",\"\")))),\"-\")","v":"-"},{"$f":"IFERROR(IF(ISBLANK(AS43),\"-\",\"（\" & TEXT(ROUND(AVERAGE(AT43:AU45),3),\"#,##0.000\")& \"-\" & TEXT(ROUND(AS43,3),\"#,##0.000\")& \"）/\" &\n    TEXT(ROUND(AS43,3),\"#,##0.000\")& \"=\" &\n    TEXT((ROUND(AVERAGE(AT43:AU45),3)-ROUND(AS43,3))/ROUND(AS43,3)*100,\"0.0\")& \"%\"),\"-\")","v":"-"},null,{"$f":"IFERROR(IF(AV43=\"\",\"-\",IF(ROUND(AVERAGE(AW43:AX45),3)/ROUND(AV43,3)=1,\"△\",IF(ROUND(AVERAGE(AW43:AX45),3)/ROUND(AV43,3)>1,\"－（\"&ABS(ROUND(100*ROUND(AVERAGE(AW43:AX45),3)/ROUND(AV43,3)-100,1))&\"％増）\",IF(ROUND(AVERAGE(AW43:AX45),3)/ROUND(AV43,3)<1,\"○（\"&ABS(ROUND(100*ROUND(AVERAGE(AW43:AX45),3)/ROUND(AV43,3)-100,1))&\"％減）\",\"\")))),\"-\")","v":"○（92.2％減）"},{"$f":"IFERROR(IF(ISBLANK(AV43),\"-\",\"（\" & TEXT(ROUND(AVERAGE(AW43:AX45),3),\"#,##0.000\")& \"-\" & TEXT(ROUND(AV43,3),\"#,##0.000\")& \"）/\" &\n    TEXT(ROUND(AV43,3),\"#,##0.000\")& \"=\" &\n    TEXT((ROUND(AVERAGE(AW43:AX45),3)-ROUND(AV43,3))/ROUND(AV43,3)*100,\"0.0\")& \"%\"),\"-\")","v":"（2.169-27.780）/27.780=-92.2%"},null,{"$f":"IFERROR(IF(AY43=\"\",\"-\",IF(ROUND(AVERAGE(AZ43:BA45),3)/ROUND(AY43,3)=1,\"△\",IF(ROUND(AVERAGE(AZ43:BA45),3)/ROUND(AY43,3)>1,\"－（\"&ABS(ROUND(100*ROUND(AVERAGE(AZ43:BA45),3)/ROUND(AY43,3)-100,1))&\"％増）\",IF(ROUND(AVERAGE(AZ43:BA45),3)/ROUND(AY43,3)<1,\"○（\"&ABS(ROUND(100*ROUND(AVERAGE(AZ43:BA45),3)/ROUND(AY43,3)-100,1))&\"％減）\",\"\")))),\"-\")","v":"-"},{"$f":"IFERROR(IF(ISBLANK(AY43),\"-\",\"（\" & TEXT(ROUND(AVERAGE(AZ43:BA45),3),\"#,##0.000\")& \"-\" & TEXT(ROUND(AY43,3),\"#,##0.000\")& \"）/\" &\n    TEXT(ROUND(AY43,3),\"#,##0.000\")& \"=\" &\n    TEXT((ROUND(AVERAGE(AZ43:BA45),3)-ROUND(AY43,3))/ROUND(AY43,3)*100,\"0.0\")& \"%\"),\"-\")","v":"-"},null,{"$f":"IFERROR(IF(BB43=\"\",\"-\",IF(ROUND(AVERAGE(BC43:BD45),3)/ROUND(BB43,3)=1,\"△\",IF(ROUND(AVERAGE(BC43:BD45),3)/ROUND(BB43,3)>1,\"－（\"&ABS(ROUND(100*ROUND(AVERAGE(BC43:BD45),3)/ROUND(BB43,3)-100,1))&\"％増）\",IF(ROUND(AVERAGE(BC43:BD45),3)/ROUND(BB43,3)<1,\"○（\"&ABS(ROUND(100*ROUND(AVERAGE(BC43:BD45),3)/ROUND(BB43,3)-100,1))&\"％減）\",\"\")))),\"-\")","v":"○（17.2％減）"},{"$f":"IFERROR(IF(ISBLANK(BB43),\"-\",\"（\" & TEXT(ROUND(AVERAGE(BC43:BD45),3),\"#,##0.000\")& \"-\" & TEXT(ROUND(BB43,3),\"#,##0.000\")& \"）/\" &\n    TEXT(ROUND(BB43,3),\"#,##0.000\")& \"=\" &\n    TEXT((ROUND(AVERAGE(BC43:BD45),3)-ROUND(BB43,3))/ROUND(BB43,3)*100,\"0.0\")& \"%\"),\"-\")","v":"（23.000-27.780）/27.780=-17.2%"},null,{"$f":"IFERROR(IF(BE43=\"\",\"-\",IF(ROUND(AVERAGE(BF43:BG45),3)/ROUND(BE43,3)=1,\"△\",IF(ROUND(AVERAGE(BF43:BG45),3)/ROUND(BE43,3)>1,\"－（\"&ABS(ROUND(100*ROUND(AVERAGE(BF43:BG45),3)/ROUND(BE43,3)-100,1))&\"％増）\",IF(ROUND(AVERAGE(BF43:BG45),3)/ROUND(BE43,3)<1,\"○（\"&ABS(ROUND(100*ROUND(AVERAGE(BF43:BG45),3)/ROUND(BE43,3)-100,1))&\"％減）\",\"\")))),\"-\")","v":"○（17.2％減）"},{"$f":"IFERROR(IF(ISBLANK(BE43),\"-\",\"（\" & TEXT(ROUND(AVERAGE(BF43:BG45),3),\"#,##0.000\")& \"-\" & TEXT(ROUND(BE43,3),\"#,##0.000\")& \"）/\" &\n    TEXT(ROUND(BE43,3),\"#,##0.000\")& \"=\" &\n    TEXT((ROUND(AVERAGE(BF43:BG45),3)-ROUND(BE43,3))/ROUND(BE43,3)*100,\"0.0\")& \"%\"),\"-\")","v":"（23.000-27.780）/27.780=-17.2%"},null,{"$f":"IFERROR(IF(BH43=\"\",\"-\",IF(ROUND(AVERAGE(BI43:BJ45),3)/ROUND(BH43,3)=1,\"△\",IF(ROUND(AVERAGE(BI43:BJ45),3)/ROUND(BH43,3)>1,\"－（\"&ABS(ROUND(100*ROUND(AVERAGE(BI43:BJ45),3)/ROUND(BH43,3)-100,1))&\"％増）\",IF(ROUND(AVERAGE(BI43:BJ45),3)/ROUND(BH43,3)<1,\"○（\"&ABS(ROUND(100*ROUND(AVERAGE(BI43:BJ45),3)/ROUND(BH43,3)-100,1))&\"％減）\",\"\")))),\"-\")","v":"-"},{"$f":"IFERROR(IF(ISBLANK(BH43),\"-\",\"（\" & TEXT(ROUND(AVERAGE(BI43:BJ45),3),\"#,##0.000\")& \"-\" & TEXT(ROUND(BH43,3),\"#,##0.000\")& \"）/\" &\n    TEXT(ROUND(BH43,3),\"#,##0.000\")& \"=\" &\n    TEXT((ROUND(AVERAGE(BI43:BJ45),3)-ROUND(BH43,3))/ROUND(BH43,3)*100,\"0.0\")& \"%\"),\"-\")","v":"-"},null,{"$f":"IFERROR(IF(BK43=\"\",\"-\",IF(ROUND(AVERAGE(BL43:BM45),3)/ROUND(BK43,3)=1,\"△\",IF(ROUND(AVERAGE(BL43:BM45),3)/ROUND(BK43,3)>1,\"－（\"&ABS(ROUND(100*ROUND(AVERAGE(BL43:BM45),3)/ROUND(BK43,3)-100,1))&\"％増）\",IF(ROUND(AVERAGE(BL43:BM45),3)/ROUND(BK43,3)<1,\"○（\"&ABS(ROUND(100*ROUND(AVERAGE(BL43:BM45),3)/ROUND(BK43,3)-100,1))&\"％減）\",\"\")))),\"-\")","v":"-"},{"$f":"IFERROR(IF(ISBLANK(BK43),\"-\",\"（\" & TEXT(ROUND(AVERAGE(BL43:BM45),3),\"#,##0.000\")& \"-\" & TEXT(ROUND(BK43,3),\"#,##0.000\")& \"）/\" &\n    TEXT(ROUND(BK43,3),\"#,##0.000\")& \"=\" &\n    TEXT((ROUND(AVERAGE(BL43:BM45),3)-ROUND(BK43,3))/ROUND(BK43,3)*100,\"0.0\")& \"%\"),\"-\")","v":"-"},null,{"$f":"IFERROR(IF(BN43=\"\",\"-\",IF(ROUND(AVERAGE(BO43:BP45),3)/ROUND(BN43,3)=1,\"△\",IF(ROUND(AVERAGE(BO43:BP45),3)/ROUND(BN43,3)>1,\"－（\"&ABS(ROUND(100*ROUND(AVERAGE(BO43:BP45),3)/ROUND(BN43,3)-100,1))&\"％増）\",IF(ROUND(AVERAGE(BO43:BP45),3)/ROUND(BN43,3)<1,\"○（\"&ABS(ROUND(100*ROUND(AVERAGE(BO43:BP45),3)/ROUND(BN43,3)-100,1))&\"％減）\",\"\")))),\"-\")","v":"-"},{"$f":"IFERROR(IF(ISBLANK(BN43),\"-\",\"（\" & TEXT(ROUND(AVERAGE(BO43:BP45),3),\"#,##0.000\")& \"-\" & TEXT(ROUND(BN43,3),\"#,##0.000\")& \"）/\" &\n    TEXT(ROUND(BN43,3),\"#,##0.000\")& \"=\" &\n    TEXT((ROUND(AVERAGE(BO43:BP45),3)-ROUND(BN43,3))/ROUND(BN43,3)*100,\"0.0\")& \"%\"),\"-\")","v":"-"},null,{"$f":"IFERROR(IF(BQ43=\"\",\"-\",IF(ROUND(AVERAGE(BR43:BS45),3)/ROUND(BQ43,3)=1,\"△\",IF(ROUND(AVERAGE(BR43:BS45),3)/ROUND(BQ43,3)>1,\"－（\"&ABS(ROUND(100*ROUND(AVERAGE(BR43:BS45),3)/ROUND(BQ43,3)-100,1))&\"％増）\",IF(ROUND(AVERAGE(BR43:BS45),3)/ROUND(BQ43,3)<1,\"○（\"&ABS(ROUND(100*ROUND(AVERAGE(BR43:BS45),3)/ROUND(BQ43,3)-100,1))&\"％減）\",\"\")))),\"-\")","v":"○（87.4％減）"},{"$f":"IFERROR(IF(ISBLANK(BQ43),\"-\",\"（\" & TEXT(ROUND(AVERAGE(BR43:BS45),3),\"#,##0.000\")& \"-\" & TEXT(ROUND(BQ43,3),\"#,##0.000\")& \"）/\" &\n    TEXT(ROUND(BQ43,3),\"#,##0.000\")& \"=\" &\n    TEXT((ROUND(AVERAGE(BR43:BS45),3)-ROUND(BQ43,3))/ROUND(BQ43,3)*100,\"0.0\")& \"%\"),\"-\")","v":"（3.500-27.780）/27.780=-87.4%"},null,{"$f":"IFERROR(IF(BT43=\"\",\"-\",IF(ROUND(AVERAGE(BU43:BV45),3)/ROUND(BT43,3)=1,\"△\",IF(ROUND(AVERAGE(BU43:BV45),3)/ROUND(BT43,3)>1,\"－（\"&ABS(ROUND(100*ROUND(AVERAGE(BU43:BV45),3)/ROUND(BT43,3)-100,1))&\"％増）\",IF(ROUND(AVERAGE(BU43:BV45),3)/ROUND(BT43,3)<1,\"○（\"&ABS(ROUND(100*ROUND(AVERAGE(BU43:BV45),3)/ROUND(BT43,3)-100,1))&\"％減）\",\"\")))),\"-\")","v":"-"},{"$f":"IFERROR(IF(ISBLANK(BT43),\"-\",\"（\" & TEXT(ROUND(AVERAGE(BU43:BV45),3),\"#,##0.000\")& \"-\" & TEXT(ROUND(BT43,3),\"#,##0.000\")& \"）/\" &\n    TEXT(ROUND(BT43,3),\"#,##0.000\")& \"=\" &\n    TEXT((ROUND(AVERAGE(BU43:BV45),3)-ROUND(BT43,3))/ROUND(BT43,3)*100,\"0.0\")& \"%\"),\"-\")","v":"-"},null,{"$f":"IFERROR(IF(BW43=\"\",\"-\",IF(ROUND(AVERAGE(BX43:BY45),3)/ROUND(BW43,3)=1,\"△\",IF(ROUND(AVERAGE(BX43:BY45),3)/ROUND(BW43,3)>1,\"－（\"&ABS(ROUND(100*ROUND(AVERAGE(BX43:BY45),3)/ROUND(BW43,3)-100,1))&\"％増）\",IF(ROUND(AVERAGE(BX43:BY45),3)/ROUND(BW43,3)<1,\"○（\"&ABS(ROUND(100*ROUND(AVERAGE(BX43:BY45),3)/ROUND(BW43,3)-100,1))&\"％減）\",\"\")))),\"-\")","v":"-"},{"$f":"IFERROR(IF(ISBLANK(BW43),\"-\",\"（\" & TEXT(ROUND(AVERAGE(BX43:BY45),3),\"#,##0.000\")& \"-\" & TEXT(ROUND(BW43,3),\"#,##0.000\")& \"）/\" &\n    TEXT(ROUND(BW43,3),\"#,##0.000\")& \"=\" &\n    TEXT((ROUND(AVERAGE(BX43:BY45),3)-ROUND(BW43,3))/ROUND(BW43,3)*100,\"0.0\")& \"%\"),\"-\")","v":"-"},null,{"$f":"IFERROR(IF(BZ43=\"\",\"-\",IF(ROUND(AVERAGE(CA43:CB45),3)/ROUND(BZ43,3)=1,\"△\",IF(ROUND(AVERAGE(CA43:CB45),3)/ROUND(BZ43,3)>1,\"－（\"&ABS(ROUND(100*ROUND(AVERAGE(CA43:CB45),3)/ROUND(BZ43,3)-100,1))&\"％増）\",IF(ROUND(AVERAGE(CA43:CB45),3)/ROUND(BZ43,3)<1,\"○（\"&ABS(ROUND(100*ROUND(AVERAGE(CA43:CB45),3)/ROUND(BZ43,3)-100,1))&\"％減）\",\"\")))),\"-\")","v":"-"},{"$f":"IFERROR(IF(ISBLANK(BZ43),\"-\",\"（\" & TEXT(ROUND(AVERAGE(CA43:CB45),3),\"#,##0.000\")& \"-\" & TEXT(ROUND(BZ43,3),\"#,##0.000\")& \"）/\" &\n    TEXT(ROUND(BZ43,3),\"#,##0.000\")& \"=\" &\n    TEXT((ROUND(AVERAGE(CA43:CB45),3)-ROUND(BZ43,3))/ROUND(BZ43,3)*100,\"0.0\")& \"%\"),\"-\")","v":"-"},null,{"$f":"IFERROR(IF(CC43=\"\",\"-\",IF(ROUND(AVERAGE(CD43:CE45),3)/ROUND(CC43,3)=1,\"△\",IF(ROUND(AVERAGE(CD43:CE45),3)/ROUND(CC43,3)>1,\"－（\"&ABS(ROUND(100*ROUND(AVERAGE(CD43:CE45),3)/ROUND(CC43,3)-100,1))&\"％増）\",IF(ROUND(AVERAGE(CD43:CE45),3)/ROUND(CC43,3)<1,\"○（\"&ABS(ROUND(100*ROUND(AVERAGE(CD43:CE45),3)/ROUND(CC43,3)-100,1))&\"％減）\",\"\")))),\"-\")","v":"○（8.9％減）"},{"$f":"IFERROR(IF(ISBLANK(CC43),\"-\",\"（\" & TEXT(ROUND(AVERAGE(CD43:CE45),3),\"#,##0.000\")& \"-\" & TEXT(ROUND(CC43,3),\"#,##0.000\")& \"）/\" &\n    TEXT(ROUND(CC43,3),\"#,##0.000\")& \"=\" &\n    TEXT((ROUND(AVERAGE(CD43:CE45),3)-ROUND(CC43,3))/ROUND(CC43,3)*100,\"0.0\")& \"%\"),\"-\")","v":"（25.300-27.780）/27.780=-8.9%"},null,{"$f":"IFERROR(IF(CF43=\"\",\"-\",IF(ROUND(AVERAGE(CG43:CH45),3)/ROUND(CF43,3)=1,\"△\",IF(ROUND(AVERAGE(CG43:CH45),3)/ROUND(CF43,3)>1,\"－（\"&ABS(ROUND(100*ROUND(AVERAGE(CG43:CH45),3)/ROUND(CF43,3)-100,1))&\"％増）\",IF(ROUND(AVERAGE(CG43:CH45),3)/ROUND(CF43,3)<1,\"○（\"&ABS(ROUND(100*ROUND(AVERAGE(CG43:CH45),3)/ROUND(CF43,3)-100,1))&\"％減）\",\"\")))),\"-\")","v":"－（0.1％増）"},{"$f":"IFERROR(IF(ISBLANK(CF43),\"-\",\"（\" & TEXT(ROUND(AVERAGE(CG43:CH45),3),\"#,##0.000\")& \"-\" & TEXT(ROUND(CF43,3),\"#,##0.000\")& \"）/\" &\n    TEXT(ROUND(CF43,3),\"#,##0.000\")& \"=\" &\n    TEXT((ROUND(AVERAGE(CG43:CH45),3)-ROUND(CF43,3))/ROUND(CF43,3)*100,\"0.0\")& \"%\"),\"-\")","v":"（27.800-27.780）/27.780=0.1%"},null,{"$f":"IFERROR(IF(CI43=\"\",\"-\",IF(ROUND(AVERAGE(CJ43:CK45),3)/ROUND(CI43,3)=1,\"△\",IF(ROUND(AVERAGE(CJ43:CK45),3)/ROUND(CI43,3)>1,\"－（\"&ABS(ROUND(100*ROUND(AVERAGE(CJ43:CK45),3)/ROUND(CI43,3)-100,1))&\"％増）\",IF(ROUND(AVERAGE(CJ43:CK45),3)/ROUND(CI43,3)<1,\"○（\"&ABS(ROUND(100*ROUND(AVERAGE(CJ43:CK45),3)/ROUND(CI43,3)-100,1))&\"％減）\",\"\")))),\"-\")","v":"○（85.6％減）"},{"$f":"IFERROR(IF(ISBLANK(CI43),\"-\",\"（\" & TEXT(ROUND(AVERAGE(CJ43:CK45),3),\"#,##0.000\")& \"-\" & TEXT(ROUND(CI43,3),\"#,##0.000\")& \"）/\" &\n    TEXT(ROUND(CI43,3),\"#,##0.000\")& \"=\" &\n    TEXT((ROUND(AVERAGE(CJ43:CK45),3)-ROUND(CI43,3))/ROUND(CI43,3)*100,\"0.0\")& \"%\"),\"-\")","v":"（4.000-27.780）/27.780=-85.6%"},null,{"$f":"IFERROR(IF(CL43=\"\",\"-\",IF(ROUND(AVERAGE(CM43:CN45),3)/ROUND(CL43,3)=1,\"△\",IF(ROUND(AVERAGE(CM43:CN45),3)/ROUND(CL43,3)>1,\"－（\"&ABS(ROUND(100*ROUND(AVERAGE(CM43:CN45),3)/ROUND(CL43,3)-100,1))&\"％増）\",IF(ROUND(AVERAGE(CM43:CN45),3)/ROUND(CL43,3)<1,\"○（\"&ABS(ROUND(100*ROUND(AVERAGE(CM43:CN45),3)/ROUND(CL43,3)-100,1))&\"％減）\",\"\")))),\"-\")","v":"-"},{"$f":"IFERROR(IF(ISBLANK(CL43),\"-\",\"（\" & TEXT(ROUND(AVERAGE(CM43:CN45),3),\"#,##0.000\")& \"-\" & TEXT(ROUND(CL43,3),\"#,##0.000\")& \"）/\" &\n    TEXT(ROUND(CL43,3),\"#,##0.000\")& \"=\" &\n    TEXT((ROUND(AVERAGE(CM43:CN45),3)-ROUND(CL43,3))/ROUND(CL43,3)*100,\"0.0\")& \"%\"),\"-\")","v":"-"},null,{"$f":"IFERROR(IF(CO43=\"\",\"-\",IF(ROUND(AVERAGE(CP43:CQ45),3)/ROUND(CO43,3)=1,\"△\",IF(ROUND(AVERAGE(CP43:CQ45),3)/ROUND(CO43,3)>1,\"－（\"&ABS(ROUND(100*ROUND(AVERAGE(CP43:CQ45),3)/ROUND(CO43,3)-100,1))&\"％増）\",IF(ROUND(AVERAGE(CP43:CQ45),3)/ROUND(CO43,3)<1,\"○（\"&ABS(ROUND(100*ROUND(AVERAGE(CP43:CQ45),3)/ROUND(CO43,3)-100,1))&\"％減）\",\"\")))),\"-\")","v":"○（16％減）"},{"$f":"IFERROR(IF(ISBLANK(CO43),\"-\",\"（\" & TEXT(ROUND(AVERAGE(CP43:CQ45),3),\"#,##0.000\")& \"-\" & TEXT(ROUND(CO43,3),\"#,##0.000\")& \"）/\" &\n    TEXT(ROUND(CO43,3),\"#,##0.000\")& \"=\" &\n    TEXT((ROUND(AVERAGE(CP43:CQ45),3)-ROUND(CO43,3))/ROUND(CO43,3)*100,\"0.0\")& \"%\"),\"-\")","v":"（23.333-27.780）/27.780=-16.0%"},null,{"$f":"IFERROR(IF(CR43=\"\",\"-\",IF(ROUND(AVERAGE(CS43:CT45),3)/ROUND(CR43,3)=1,\"△\",IF(ROUND(AVERAGE(CS43:CT45),3)/ROUND(CR43,3)>1,\"－（\"&ABS(ROUND(100*ROUND(AVERAGE(CS43:CT45),3)/ROUND(CR43,3)-100,1))&\"％増）\",IF(ROUND(AVERAGE(CS43:CT45),3)/ROUND(CR43,3)<1,\"○（\"&ABS(ROUND(100*ROUND(AVERAGE(CS43:CT45),3)/ROUND(CR43,3)-100,1))&\"％減）\",\"\")))),\"-\")","v":"-"},{"$f":"IFERROR(IF(ISBLANK(CR43),\"-\",\"（\" & TEXT(ROUND(AVERAGE(CS43:CT45),3),\"#,##0.000\")& \"-\" & TEXT(ROUND(CR43,3),\"#,##0.000\")& \"）/\" &\n    TEXT(ROUND(CR43,3),\"#,##0.000\")& \"=\" &\n    TEXT((ROUND(AVERAGE(CS43:CT45),3)-ROUND(CR43,3))/ROUND(CR43,3)*100,\"0.0\")& \"%\"),\"-\")","v":"-"},null,{"$f":"IFERROR(IF(CU43=\"\",\"-\",IF(ROUND(AVERAGE(CV43:CW45),3)/ROUND(CU43,3)=1,\"△\",IF(ROUND(AVERAGE(CV43:CW45),3)/ROUND(CU43,3)>1,\"－（\"&ABS(ROUND(100*ROUND(AVERAGE(CV43:CW45),3)/ROUND(CU43,3)-100,1))&\"％増）\",IF(ROUND(AVERAGE(CV43:CW45),3)/ROUND(CU43,3)<1,\"○（\"&ABS(ROUND(100*ROUND(AVERAGE(CV43:CW45),3)/ROUND(CU43,3)-100,1))&\"％減）\",\"\")))),\"-\")","v":"○（65.8％減）"},{"$f":"IFERROR(IF(ISBLANK(CU43),\"-\",\"（\" & TEXT(ROUND(AVERAGE(CV43:CW45),3),\"#,##0.000\")& \"-\" & TEXT(ROUND(CU43,3),\"#,##0.000\")& \"）/\" &\n    TEXT(ROUND(CU43,3),\"#,##0.000\")& \"=\" &\n    TEXT((ROUND(AVERAGE(CV43:CW45),3)-ROUND(CU43,3))/ROUND(CU43,3)*100,\"0.0\")& \"%\"),\"-\")","v":"（9.500-27.780）/27.780=-65.8%"},null,{"$f":"IFERROR(IF(CX43=\"\",\"-\",IF(ROUND(AVERAGE(CY43:CZ45),3)/ROUND(CX43,3)=1,\"△\",IF(ROUND(AVERAGE(CY43:CZ45),3)/ROUND(CX43,3)>1,\"－（\"&ABS(ROUND(100*ROUND(AVERAGE(CY43:CZ45),3)/ROUND(CX43,3)-100,1))&\"％増）\",IF(ROUND(AVERAGE(CY43:CZ45),3)/ROUND(CX43,3)<1,\"○（\"&ABS(ROUND(100*ROUND(AVERAGE(CY43:CZ45),3)/ROUND(CX43,3)-100,1))&\"％減）\",\"\")))),\"-\")","v":"-"},{"$f":"IFERROR(IF(ISBLANK(CX43),\"-\",\"（\" & TEXT(ROUND(AVERAGE(CY43:CZ45),3),\"#,##0.000\")& \"-\" & TEXT(ROUND(CX43,3),\"#,##0.000\")& \"）/\" &\n    TEXT(ROUND(CX43,3),\"#,##0.000\")& \"=\" &\n    TEXT((ROUND(AVERAGE(CY43:CZ45),3)-ROUND(CX43,3))/ROUND(CX43,3)*100,\"0.0\")& \"%\"),\"-\")","v":"-"},null,{"$f":"IFERROR(IF(DA43=\"\",\"-\",IF(ROUND(AVERAGE(DB43:DC45),3)/ROUND(DA43,3)=1,\"△\",IF(ROUND(AVERAGE(DB43:DC45),3)/ROUND(DA43,3)>1,\"－（\"&ABS(ROUND(100*ROUND(AVERAGE(DB43:DC45),3)/ROUND(DA43,3)-100,1))&\"％増）\",IF(ROUND(AVERAGE(DB43:DC45),3)/ROUND(DA43,3)<1,\"○（\"&ABS(ROUND(100*ROUND(AVERAGE(DB43:DC45),3)/ROUND(DA43,3)-100,1))&\"％減）\",\"\")))),\"-\")","v":"○（60.4％減）"},{"$f":"IFERROR(IF(ISBLANK(DA43),\"-\",\"（\" & TEXT(ROUND(AVERAGE(DB43:DC45),3),\"#,##0.000\")& \"-\" & TEXT(ROUND(DA43,3),\"#,##0.000\")& \"）/\" &\n    TEXT(ROUND(DA43,3),\"#,##0.000\")& \"=\" &\n    TEXT((ROUND(AVERAGE(DB43:DC45),3)-ROUND(DA43,3))/ROUND(DA43,3)*100,\"0.0\")& \"%\"),\"-\")","v":"（11.000-27.780）/27.780=-60.4%"},null,{"$f":"IFERROR(IF(DD43=\"\",\"-\",IF(ROUND(AVERAGE(DE43:DF45),3)/ROUND(DD43,3)=1,\"△\",IF(ROUND(AVERAGE(DE43:DF45),3)/ROUND(DD43,3)>1,\"－（\"&ABS(ROUND(100*ROUND(AVERAGE(DE43:DF45),3)/ROUND(DD43,3)-100,1))&\"％増）\",IF(ROUND(AVERAGE(DE43:DF45),3)/ROUND(DD43,3)<1,\"○（\"&ABS(ROUND(100*ROUND(AVERAGE(DE43:DF45),3)/ROUND(DD43,3)-100,1))&\"％減）\",\"\")))),\"-\")","v":"○（47.8％減）"},{"$f":"IFERROR(IF(ISBLANK(DD43),\"-\",\"（\" & TEXT(ROUND(AVERAGE(DE43:DF45),3),\"#,##0.000\")& \"-\" & TEXT(ROUND(DD43,3),\"#,##0.000\")& \"）/\" &\n    TEXT(ROUND(DD43,3),\"#,##0.000\")& \"=\" &\n    TEXT((ROUND(AVERAGE(DE43:DF45),3)-ROUND(DD43,3))/ROUND(DD43,3)*100,\"0.0\")& \"%\"),\"-\")","v":"（14.490-27.780）/27.780=-47.8%"},null,{"$f":"IFERROR(IF(DG43=\"\",\"-\",IF(ROUND(AVERAGE(DH43:DI45),3)/ROUND(DG43,3)=1,\"△\",IF(ROUND(AVERAGE(DH43:DI45),3)/ROUND(DG43,3)>1,\"－（\"&ABS(ROUND(100*ROUND(AVERAGE(DH43:DI45),3)/ROUND(DG43,3)-100,1))&\"％増）\",IF(ROUND(AVERAGE(DH43:DI45),3)/ROUND(DG43,3)<1,\"○（\"&ABS(ROUND(100*ROUND(AVERAGE(DH43:DI45),3)/ROUND(DG43,3)-100,1))&\"％減）\",\"\")))),\"-\")","v":"○（47.8％減）"},{"$f":"IFERROR(IF(ISBLANK(DG43),\"-\",\"（\" & TEXT(ROUND(AVERAGE(DH43:DI45),3),\"#,##0.000\")& \"-\" & TEXT(ROUND(DG43,3),\"#,##0.000\")& \"）/\" &\n    TEXT(ROUND(DG43,3),\"#,##0.000\")& \"=\" &\n    TEXT((ROUND(AVERAGE(DH43:DI45),3)-ROUND(DG43,3))/ROUND(DG43,3)*100,\"0.0\")& \"%\"),\"-\")","v":"（14.490-27.780）/27.780=-47.8%"},null,{"$f":"IFERROR(IF(DJ43=\"\",\"-\",IF(ROUND(AVERAGE(DK43:DL45),3)/ROUND(DJ43,3)=1,\"△\",IF(ROUND(AVERAGE(DK43:DL45),3)/ROUND(DJ43,3)>1,\"－（\"&ABS(ROUND(100*ROUND(AVERAGE(DK43:DL45),3)/ROUND(DJ43,3)-100,1))&\"％増）\",IF(ROUND(AVERAGE(DK43:DL45),3)/ROUND(DJ43,3)<1,\"○（\"&ABS(ROUND(100*ROUND(AVERAGE(DK43:DL45),3)/ROUND(DJ43,3)-100,1))&\"％減）\",\"\")))),\"-\")","v":"○（47.8％減）"},{"$f":"IFERROR(IF(ISBLANK(DJ43),\"-\",\"（\" & TEXT(ROUND(AVERAGE(DK43:DL45),3),\"#,##0.000\")& \"-\" & TEXT(ROUND(DJ43,3),\"#,##0.000\")& \"）/\" &\n    TEXT(ROUND(DJ43,3),\"#,##0.000\")& \"=\" &\n    TEXT((ROUND(AVERAGE(DK43:DL45),3)-ROUND(DJ43,3))/ROUND(DJ43,3)*100,\"0.0\")& \"%\"),\"-\")","v":"（14.490-27.780）/27.780=-47.8%"},null,{"$f":"IFERROR(IF(DM43=\"\",\"-\",IF(ROUND(AVERAGE(DN43:DO45),3)/ROUND(DM43,3)=1,\"△\",IF(ROUND(AVERAGE(DN43:DO45),3)/ROUND(DM43,3)>1,\"－（\"&ABS(ROUND(100*ROUND(AVERAGE(DN43:DO45),3)/ROUND(DM43,3)-100,1))&\"％増）\",IF(ROUND(AVERAGE(DN43:DO45),3)/ROUND(DM43,3)<1,\"○（\"&ABS(ROUND(100*ROUND(AVERAGE(DN43:DO45),3)/ROUND(DM43,3)-100,1))&\"％減）\",\"\")))),\"-\")","v":"-"},{"$f":"IFERROR(IF(ISBLANK(DM43),\"-\",\"（\" & TEXT(ROUND(AVERAGE(DN43:DO45),3),\"#,##0.000\")& \"-\" & TEXT(ROUND(DM43,3),\"#,##0.000\")& \"）/\" &\n    TEXT(ROUND(DM43,3),\"#,##0.000\")& \"=\" &\n    TEXT((ROUND(AVERAGE(DN43:DO45),3)-ROUND(DM43,3))/ROUND(DM43,3)*100,\"0.0\")& \"%\"),\"-\")","v":"-"},null,{"$f":"IFERROR(IF(DP43=\"\",\"-\",IF(ROUND(AVERAGE(DQ43:DR45),3)/ROUND(DP43,3)=1,\"△\",IF(ROUND(AVERAGE(DQ43:DR45),3)/ROUND(DP43,3)>1,\"－（\"&ABS(ROUND(100*ROUND(AVERAGE(DQ43:DR45),3)/ROUND(DP43,3)-100,1))&\"％増）\",IF(ROUND(AVERAGE(DQ43:DR45),3)/ROUND(DP43,3)<1,\"○（\"&ABS(ROUND(100*ROUND(AVERAGE(DQ43:DR45),3)/ROUND(DP43,3)-100,1))&\"％減）\",\"\")))),\"-\")","v":"○（68.7％減）"},{"$f":"IFERROR(IF(ISBLANK(DP43),\"-\",\"（\" & TEXT(ROUND(AVERAGE(DQ43:DR45),3),\"#,##0.000\")& \"-\" & TEXT(ROUND(DP43,3),\"#,##0.000\")& \"）/\" &\n    TEXT(ROUND(DP43,3),\"#,##0.000\")& \"=\" &\n    TEXT((ROUND(AVERAGE(DQ43:DR45),3)-ROUND(DP43,3))/ROUND(DP43,3)*100,\"0.0\")& \"%\"),\"-\")","v":"（8.687-27.780）/27.780=-68.7%"},null,{"$f":"IFERROR(IF(DS43=\"\",\"-\",IF(ROUND(AVERAGE(DT43:DU45),3)/ROUND(DS43,3)=1,\"△\",IF(ROUND(AVERAGE(DT43:DU45),3)/ROUND(DS43,3)>1,\"－（\"&ABS(ROUND(100*ROUND(AVERAGE(DT43:DU45),3)/ROUND(DS43,3)-100,1))&\"％増）\",IF(ROUND(AVERAGE(DT43:DU45),3)/ROUND(DS43,3)<1,\"○（\"&ABS(ROUND(100*ROUND(AVERAGE(DT43:DU45),3)/ROUND(DS43,3)-100,1))&\"％減）\",\"\")))),\"-\")","v":"○（67.8％減）"},{"$f":"IFERROR(IF(ISBLANK(DS43),\"-\",\"（\" & TEXT(ROUND(AVERAGE(DT43:DU45),3),\"#,##0.000\")& \"-\" & TEXT(ROUND(DS43,3),\"#,##0.000\")& \"）/\" &\n    TEXT(ROUND(DS43,3),\"#,##0.000\")& \"=\" &\n    TEXT((ROUND(AVERAGE(DT43:DU45),3)-ROUND(DS43,3))/ROUND(DS43,3)*100,\"0.0\")& \"%\"),\"-\")","v":"（8.947-27.780）/27.780=-67.8%"},null,{"$f":"IFERROR(IF(DV43=\"\",\"／\",IF(ROUND(AVERAGE(DW43:DX45),3)/ROUND(DV43,3)=1,\"△\",IF(ROUND(AVERAGE(DW43:DX45),3)/ROUND(DV43,3)>1,\"／（\"&ABS(ROUND(100*ROUND(AVERAGE(DW43:DX45),3)/ROUND(DV43,3)/100,1))&\"％増）\",IF(ROUND(AVERAGE(DW43:DX45),3)/ROUND(DV43,3)<1,\"○（\"&ABS(ROUND(100*ROUND(AVERAGE(DW43:DX45),3)/ROUND(DV43,3)/100,1))&\"％減）\",\"\")))),\"／\")","v":"／"},{"$f":"IFERROR(IF(ISBLANK(DV43),\"／\",\"（\" & TEXT(ROUND(AVERAGE(DW43:DX45),3),\"#,##0.000\")& \"／\" & TEXT(ROUND(DV43,3),\"#,##0.000\")& \"）/\" &\n    TEXT(ROUND(DV43,3),\"#,##0.000\")& \"=\" &\n    TEXT((ROUND(AVERAGE(DW43:DX45),3)/ROUND(DV43,3))/ROUND(DV43,3)*100,\"0.0\")& \"%\"),\"／\")","v":"／"},null,{"$f":"IFERROR(IF(DY43=\"\",\"／\",IF(ROUND(AVERAGE(DZ43:EA45),3)/ROUND(DY43,3)=1,\"△\",IF(ROUND(AVERAGE(DZ43:EA45),3)/ROUND(DY43,3)>1,\"／（\"&ABS(ROUND(100*ROUND(AVERAGE(DZ43:EA45),3)/ROUND(DY43,3)/100,1))&\"％増）\",IF(ROUND(AVERAGE(DZ43:EA45),3)/ROUND(DY43,3)<1,\"○（\"&ABS(ROUND(100*ROUND(AVERAGE(DZ43:EA45),3)/ROUND(DY43,3)/100,1))&\"％減）\",\"\")))),\"／\")","v":"／"},{"$f":"IFERROR(IF(ISBLANK(DY43),\"／\",\"（\" & TEXT(ROUND(AVERAGE(DZ43:EA45),3),\"#,##0.000\")& \"／\" & TEXT(ROUND(DY43,3),\"#,##0.000\")& \"）/\" &\n    TEXT(ROUND(DY43,3),\"#,##0.000\")& \"=\" &\n    TEXT((ROUND(AVERAGE(DZ43:EA45),3)/ROUND(DY43,3))/ROUND(DY43,3)*100,\"0.0\")& \"%\"),\"／\")","v":"／"},null,{"$f":"IFERROR(IF(EB43=\"\",\"／\",IF(ROUND(AVERAGE(EC43:ED45),3)/ROUND(EB43,3)=1,\"△\",IF(ROUND(AVERAGE(EC43:ED45),3)/ROUND(EB43,3)>1,\"／（\"&ABS(ROUND(100*ROUND(AVERAGE(EC43:ED45),3)/ROUND(EB43,3)/100,1))&\"％増）\",IF(ROUND(AVERAGE(EC43:ED45),3)/ROUND(EB43,3)<1,\"○（\"&ABS(ROUND(100*ROUND(AVERAGE(EC43:ED45),3)/ROUND(EB43,3)/100,1))&\"％減）\",\"\")))),\"／\")","v":"／"},{"$f":"IFERROR(IF(ISBLANK(EB43),\"／\",\"（\" & TEXT(ROUND(AVERAGE(EC43:ED45),3),\"#,##0.000\")& \"／\" & TEXT(ROUND(EB43,3),\"#,##0.000\")& \"）/\" &\n    TEXT(ROUND(EB43,3),\"#,##0.000\")& \"=\" &\n    TEXT((ROUND(AVERAGE(EC43:ED45),3)/ROUND(EB43,3))/ROUND(EB43,3)*100,\"0.0\")& \"%\"),\"／\")","v":"／"},null,{"$f":"IFERROR(IF(EE43=\"\",\"／\",IF(ROUND(AVERAGE(EF43:EG45),3)/ROUND(EE43,3)=1,\"△\",IF(ROUND(AVERAGE(EF43:EG45),3)/ROUND(EE43,3)>1,\"／（\"&ABS(ROUND(100*ROUND(AVERAGE(EF43:EG45),3)/ROUND(EE43,3)/100,1))&\"％増）\",IF(ROUND(AVERAGE(EF43:EG45),3)/ROUND(EE43,3)<1,\"○（\"&ABS(ROUND(100*ROUND(AVERAGE(EF43:EG45),3)/ROUND(EE43,3)/100,1))&\"％減）\",\"\")))),\"／\")","v":"／"},{"$f":"IFERROR(IF(ISBLANK(EE43),\"／\",\"（\" & TEXT(ROUND(AVERAGE(EF43:EG45),3),\"#,##0.000\")& \"／\" & TEXT(ROUND(EE43,3),\"#,##0.000\")& \"）/\" &\n    TEXT(ROUND(EE43,3),\"#,##0.000\")& \"=\" &\n    TEXT((ROUND(AVERAGE(EF43:EG45),3)/ROUND(EE43,3))/ROUND(EE43,3)*100,\"0.0\")& \"%\"),\"／\")","v":"／"}]
[null,null,"判定の凡例 \n  ○：従来技術より優れる\n  △：従来技術と同程度\n  -：上記以外",null,"品質・出来形","-：⑭並びに、総括：㉑耐久性に記載",null,null,"-：⑭並びに、総括：㉑耐久性に記載",null,null,"-：⑭並びに、総括：㉑耐久性に記載",null,null,"-：⑭並びに、総括：㉑耐久性に記載",null,null,"-：⑭並びに、総括：㉑耐久性に記載",null,null,"-：⑩並びに、総括：㉑耐久性に記載",null,null,"-：⑩並びに、総括：㉑耐久性に記載",null,null,"-：⑩並びに、総括：㉑耐久性に記載",null,null,"-：⑩並びに、総括：㉑耐久性に記載",null,null,"-：⑩並びに、総括：㉑耐久性に記載",null,null,"-：⑩並びに、総括：㉑耐久性に記載",null,null,"-：⑩並びに、総括：㉑耐久性に記載",null,null,"-：⑭並びに、総括：㉑耐久性に記載",null,null,"-：⑩並びに、総括：㉑耐久性に記載",null,null,"-：⑭並びに、総括：㉑耐久性に記載",null,null,"-：⑩並びに、総括：㉑耐久性に記載",null,null,"-：⑭並びに、総括：㉑耐久性に記載",null,null,"-：⑭並びに、総括：㉑耐久性に記載",null,null,"-：⑭並びに、総括：㉑耐久性に記載",null,null,"-：⑭並びに、総括：㉑耐久性に記載",null,null,"-：⑭並びに、総括：㉑耐久性に記載",null,null,"-：⑭並びに、総括：㉑耐久性に記載",null,null,"-：⑭並びに、総括：㉑耐久性に記載",null,null,"-：⑭並びに、総括：㉑耐久性に記載",null,null,"-：⑭並びに、総括：㉑耐久性に記載",null,null,"-：⑭並びに、総括：㉑耐久性に記載",null,null,"-：⑭並びに、総括：㉑耐久性に記載",null,null,"-：⑭並びに、総括：㉑耐久性に記載",null,null,"-：⑪並びに、総括：㉑耐久性に記載",null,null,"-：⑪並びに、総括：㉑耐久性に記載",null,null,"-：⑪並びに、総括：㉑耐久性に記載",null,null,"-：⑪並びに、総括：㉑耐久性に記載",null,null,"-：⑪並びに、総括：㉑耐久性に記載",null,null,"-：⑪並びに、総括：㉑耐久性に記載",null,null,"-：⑪並びに、総括：㉑耐久性に記載",null,null,"-：⑪並びに、総括：㉑耐久性に記載",null,null,"-：⑪並びに、総括：㉑耐久性に記載",null,null,"-：⑪並びに、総括：㉑耐久性に記載",null,null,"-：⑪並びに、総括：㉑耐久性に記載",null,null,"-：⑪並びに、総括：㉑耐久性に記載",null,null,"／",null,null,"／",null,null,"／",null,null,"／"]
[null,null,null,null,"安全性","△：従来技術と同程度",null,null,"△：従来技術と同程度",null,null,"△：従来技術と同程度",null,null,"△：従来技術と同程度",null,null,"-：-",null,null,"△：従来技術と同程度",null,null,"△：従来技術と同程度",null,null,"△：従来技術と同程度",null,null,"△：従来技術と同程度",null,null,"△：従来技術と同程度",null,null,"△：従来技術と同程度",null,null,"△：従来技術と同程度",null,null,"△：従来技術と同程度",null,null,"△：従来技術と同程度",null,null,"△：従来技術と同程度",null,null,"△：従来技術と同程度",null,null,"△：従来技術と同程度",null,null,"△：従来技術と同程度",null,null,"△：従来技術と同程度",null,null,"△：従来技術と同程度",null,null,"△：従来技術と同程度",null,null,"△：従来技術と同程度",null,null,"△：従来技術と同程度",null,null,"△：従来技術と同程度",null,null,"△：従来技術と同程度",null,null,"△：従来技術と同程度",null,null,"△：従来技術と同程度",null,null,"△：従来技術と同程度",null,null,"△：従来技術と同程度",null,null,"△：従来技術と同程度",null,null,"△：従来技術と同程度",null,null,"△：従来技術と同程度",null,null,"△：従来技術と同程度",null,null,"△：従来技術と同程度",null,null,"△：従来技術と同程度",null,null,"△：従来技術と同程度",null,null,"△：従来技術と同程度",null,null,"△：従来技術と同程度",null,null,"△：従来技術と同程度",null,null,"△：従来技術と同程度",null,null,"／",null,null,"／",null,null,"／",null,null,"／"]
[null,null,null,null,"施工性","○：コンクリ-ト中の塩分吸着が可能な為、鉄筋の全面露出が不要。はつり量および断面修復厚さが減少する。",null,null,"○：コンクリ-ト中の塩分吸着が可能な為、鉄筋の全面露出が不要。はつり量および断面修復厚さが減少する。",null,null,"○：コンクリ-ト中の塩分吸着が可能な為、鉄筋の全面露出が不要。はつり量および断面修復厚さが減少する。",null,null,"○：プライマ-処理不要",null,null,"○：プライマ-処理不要",null,null,"△：従来技術と同程度",null,null,"△：従来技術と同程度",null,null,"△：従来技術と同程度",null,null,"△：従来技術と同程度",null,null,"△：従来技術と同程度",null,null,"△：従来技術と同程度",null,null,"○：1層あたりの吹付け厚が壁面で100mm、圧送距離が100ｍまで可能",null,null,"○：長距離搬送、厚付けが可能なことから施工性に優れ、工期の短縮が図れる。",null,null,"△：従来技術と同程度",null,null,"○：鉄筋裏に確実に充填可能",null,null,"○：湿潤環境下でも接着性が良く、短時間で急速硬化・高強度が発現する",null,null,"○：速硬性である。1回で最大60㎜の厚付けが可能。",null,null,"○：速硬性である。短時間に塗り重ねることで厚付けにも対応可能。",null,null,"○：1層あたり200mm程度の厚付けが可能で、圧送距離が300m",null,null,"○：従来技術では1種または2種のケレンが必要であったが、新技術では3種ケレンで対応できるようになり、施工性が向上する。",null,null,"○：従来技術では1種または2種のケレンが必要であったが、新技術では3種ケレンで対応できるようになり、施工性が向上する。",null,null,"○：1層あたり施工厚が壁面で50mm、天井面で30㎜まで可能",null,null,"○：1層あたり施工厚が壁面で50mm、天井面で30㎜まで可能",null,null,"○：従来の湿式吹付け工法の約2～3倍の吹付けが可能（最大吹付け厚さ100mm）",null,null,"△：従来技術と同程度",null,null,"○：１回で最大40ｍｍの厚付けが可能",null,null,"○：コンクリ-トのはつり、断面修復深さが浅くなることで、はつり、鉄筋ケレン、左官等の作業量が低減するため",null,null,"○：既設コンクリ-トとの打継ぎに使用するエポキシ樹脂系接着剤は、湿潤面に対しても優れた付着性を有している。",null,null,"△：従来技術と同程度",null,null,"△：従来技術と同程度",null,null,"△：従来技術と同程度",null,null,"○：断面修復材「リプロモルタルAZ」の凝結時間をコントロ-ルすることで、多層打ち重ね時間の短縮を図ることができる。",null,null,"○：断面修復材「リプロモルタルAZ」の凝結時間をコントロ-ルすることで、多層打ち重ね時間の短縮を図ることができる。",null,null,"△：従来技術と同程度",null,null,"○：終結時間が80分以内と短く施工性に優れ、ノンポリマ-仕様で造膜作用がなく仕上げ性にも優れる。",null,null,"○：終結時間が80分以内と短く施工性に優れ、ノンポリマ-仕様で造膜作用がなく仕上げ性にも優れる。",null,null,"○：終結時間が80分以内と短く施工性に優れ、ノンポリマ-仕様で造膜作用がなく仕上げ性にも優れる。",null,null,"○：1層で最大200mmの厚付性と200ｍの長距離圧送が可能となる。",null,null,"○：1層で最大200mmの厚付性と200ｍの長距離圧送が可能となる。",null,null,"△：従来技術と同程度",null,null,"／",null,null,"／",null,null,"／",null,null,"／"]
[null,null,null,null,"環境","△：従来技術と同程度",null,null,"△：従来技術と同程度",null,null,"△：従来技術と同程度",null,null,"○：高炉スラグを配合してセメント使用量を少なくしたため、セメント製造にかかる二酸化炭素排出量の削減に寄与している",null,null,"○：高炉スラグを配合してセメント使用量を少なくしたため、セメント製造にかかる二酸化炭素排出量の削減に寄与している",null,null,"○：リサイクル品としてのエコマ-ク取得製品",null,null,"○：リサイクル品としてのエコマ-ク取得製品",null,null,"△：従来技術と同程度",null,null,"△：従来技術と同程度",null,null,"△：従来技術と同程度",null,null,"△：従来技術と同程度",null,null,"△：従来技術と同程度",null,null,"△：従来技術と同程度",null,null,"△：従来技術と同程度",null,null,"△：従来技術と同程度",null,null,"△：従来技術と同程度",null,null,"△：従来技術と同程度",null,null,"△：従来技術と同程度",null,null,"△：従来技術と同程度",null,null,"△：従来技術と同程度",null,null,"△：従来技術と同程度",null,null,"△：従来技術と同程度",null,null,"△：従来技術と同程度",null,null,"△：従来技術と同程度",null,null,"△：従来技術と同程度",null,null,"△：従来技術と同程度",null,null,"○：コンクリ-トのはつり深さが低減することで、コンクリ-トがらの発生量が減少する",null,null,"△：従来技術と同程度",null,null,"○：粉塵低減材を配合し練り混ぜ時の粉塵発生を抑制できるため、作業環境の改善が図れる。",null,null,"△：従来技術と同程度",null,null,"△：従来技術と同程度",null,null,"△：従来技術と同程度",null,null,"△：従来技術と同程度",null,null,"○：亜鉛末及び有機溶剤の削減により、周辺環境と施工作業に携わる作業員への影響が軽減する。",null,null,"○：ノンポリマ-のため洗い水などの処理が容易で環境負荷が小さい。",null,null,"○：ノンポリマ-のため洗い水などの処理が容易で環境負荷が小さい。",null,null,"○：ノンポリマ-のため洗い水などの処理が容易で環境負荷が小さい。",null,null,"△：従来技術と同程度",null,null,"△：従来技術と同程度",null,null,"○：耐摩耗性が向上しているため、構造物の補修サイクルを延長することができるため、コンクリ-トガラ等の廃棄物を低減することに寄与できる。",null,null,"／",null,null,"／",null,null,"／",null,null,"／"]
[null,"⑭","試験項目","断面修復材料",null,"-","ポリマーセメントモルタル：遮塩モルタルRP200","ポリマーセメントモルタル（普通） 注2）","-","ポリマーセメントモルタル（遮塩モルタルRP200）","ポリマーセメントモルタル（普通） 注2）","-","ポリマーセメントモルタル（遮塩モルタルRP310Ｇ）","ポリマーセメントモルタル（普通） 注2）","-","ポリマーセメントモルタル（エフモル05）","ポリマーセメントモルタル（普通） 注2）","-","ポリマーセメントモルタル（エフモル05）","ポリマーセメントモルタル（普通） 注2）","-","ポリマーセメントモルタル（NC ショットM）","ポリマーセメントモルタル（普通） 注2）","-","ポリマーセメントモルタル（NC ショットL）","ポリマーセメントモルタル（普通） 注2）","-","ポリマーセメントモルタル（ポットホール用モルタル）","ポリマーセメントモルタル（普通） 注2）","-","ポリマーセメントモルタル（ゴムラテモルタル）","ポリマーセメントモルタル（普通） 注2）","-","ポリマーセメントモルタル（ゴムラテコンクリート）","ポリマーセメントモルタル（普通） 注2）","-","ポリマーセメントモルタル（RISクロルフィックスエース）","ポリマーセメントモルタル（普通） 注2）","-","ポリマーセメントモルタル（クロルフィックスショット）","ポリマーセメントモルタル（普通） 注2）","-","ポリマーセメントモルタル：StoCrete TS100","ポリマーセメントモルタル（普通） 注2）","-","LCモルタル","ポリマーセメントモルタル（普通） 注2）","-","リフレモルセットSF(モルタル)　","ポリマーセメントモルタル（普通） 注2）","-","ポリマーモルタル（CR-2000）","ポリマーセメントモルタル（速硬） 注2）","-","ポリマーセメントモルタル（U‐リペアパッチEX）","ポリマーセメントモルタル（普通） 注2）","-","ポリマーセメントモルタル（U‐リペアライトEX）","ポリマーセメントモルタル（普通） 注2）","-","ポリマーセメントモルタル","ポリマーセメントモルタル（普通） 注2）","-","ポリマーセメントモルタル","ポリマーセメントモルタル（普通） 注2）","-","ポリマーセメントモルタル","ポリマーセメントモルタル（普通） 注2）","-","セメントモルタル（タフショットクリート）","セメントモルタル（普通） 注2）","-","セメントモルタル（タフショットクリート）","セメントモルタル（普通） 注2）","-","ポリマーセメントモルタル","ポリマーセメントモルタル（普通） 注2）","-","パワーグラウト(自己治癒補修材)","セメントモルタル（普通） 注2）","-","ポリマーセメントモルタル(U-リペアパッチCT)","ポリマーセメントモルタル（普通） 注2）","-","ポリマーセメントモルタル","ポリマーセメントモルタル（普通） 注2）","-","CPJ-L（コンパクトジェット-L）13mm骨材（20mm骨材）","セメントモルタル（速硬） 注2）","-","プレユーロックスDXP","ポリマーセメントモルタル（普通）","-","HI-SPECシール工法（KSタイプ）","ポリマーセメントモルタル（普通）","-","HI-SPECシール工法（KSタイプ）","ポリマーセメントモルタル（普通）","-","リプロモルタルAZ","ポリマーセメントモルタル（普通）","-","リプロモルタルAZ","ポリマーセメントモルタル（普通）","-","コンクリ補強欠損部066","ポリマ-セメントモルタル（普通）","-","ジェットモルタル　PF（低弾性・無収縮タイプ）","ポリマーセメントモルタル（普通）","-","ジェットモルタル　赤（早期供用・無収縮タイプ）","ポリマーセメントモルタル（普通）","-","ジェットモルタル　青（通常タイプ）","ポリマーセメントモルタル（普通）","エアショットワン","エアショットワン","ポリマーセメントモルタル（普通）","エアショットワン","エアショットワン","ポリマーセメントモルタル（普通）","-","RP-1","ポリマ-セメントモルタル（普通）","／","／","／","／","／","／","／","／","／","／","／","／"]
[null,null,null,"施工方法",null,"左官工法","左官工法","左官工法","吹付け工法","吹付け工法","吹付け工法","充填工法","充填工法","充填工法","左官工法","左官工法","左官工法","左官工法","左官工法","吹付け工法","左官工法","左官工法","左官工法","左官工法","左官工法","左官工法","左官工法","左官工法","左官工法","左官工法","左官工法","左官工法","左官工法","左官工法","左官工法","左官工法","左官工法","左官工法","吹付け工法","吹付け工法","吹付け工法","吹付け工法","吹付け工法","吹付け工法","-","吹付け工法","吹付け工法","左官工法（床板上面）","左官工法（床板上面）","左官工法","-","-","左官工法","左官工法","左官工法","左官工法","左官工法","左官工法","左官工法","吹付け工法","吹付け工法","吹付け工法","左官工法","左官工法","左官工法","吹付け工法","吹付け工法","吹付け工法","左官工法","左官工法","左官工法","吹付け工法","吹付け工法","吹付け工法","吹付け工法","吹付け工法","吹付け工法","充填工法","充填工法","充填工法","左官工法","左官工法","左官工法","左官工法","左官工法","左官工法","左官工法","左官工法","左官工法","充填工法","充填工法","充填工法","-","-","左官工法","-","-","吹付け工法","左官工法","左官工法","左官工法","-","-","吹付け工法","左官工法","左官工法","左官工法","床版断面修繕工法（下向き）","床版断面修繕工法（下向き）","左官工法","左官工法","左官工法","左官工法","左官工法","左官工法","左官工法","吹付け工法","吹付け工法","吹付け工法","左官工法","左官工法","左官工法","左官工法","左官工法","左官工法","／","／","／","／","／","／","／","／","／","／","／","／"]
[null,null,null,"試験規格",null,"適用基準NEXCO構造物施工管理要領","公的機関による試験結果","基準","適用基準NEXCO構造物施工管理要領","公的機関による試験結果","基準","適用基準NEXCO構造物施工管理要領","公的機関による試験結果","基準","適用基準NEXCO構造物施工管理要領","公的機関による試験結果","基準","適用基準NEXCO構造物施工管理要領","公的機関による試験結果","基準","適用基準NEXCO構造物施工管理要領","公的機関による試験結果（自社での試験結果）","基準","適用基準NEXCO構造物施工管理要領","公的機関による試験結果（自社での試験結果）","基準","適用基準NEXCO「床板上面における断面修復の性能照査項目」","公的機関での試験結果","基準","適用基準NEXCO「床板上面における断面修復の性能照査項目」","公的機関での試験結果","基準","適用基準NEXCO「床板上面における断面修復の性能照査項目」","公的機関での試験結果","基準","適用基準　NEXCO「左官工法による断面修復材の品質規格」（自社基準）","自社での試験結果","基準","適用基準　NEXCO「吹付け工法による断面修復材の品質規格」（自社基準）","自社での試験結果","基準","適用基準｢コンクリート構造物の断面修復の手引き(案)」（平成16年3月）断面修復材の性能確認試験(JHERⅠ416)","公的機関による試験結果","基準","農林水産省「開水路補修・補強工事マニュアル（案）」","公的機関等での試験結果","基準","NEXCO構造物施工管理要領 「床版上面における断面修復材の性能照査項目」","公的機関での試験結果","基準","適用基準　自社基準（従来技術の試験結果）","自社での試験結果","基準","適用基準　NEXCO「左官工法による断面修復材の品質規格」","公的機関での試験結果","基準","適用基準　NEXCO「左官工法による断面修復材の品質規格」","公的機関での試験結果","基準","適用基準　NEXCO「吹付け工法による断面修復材の品質規格」（自社基準）","公的機関による試験結果","基準","適用基準NEXCO構造物施工管理要領","公的機関または民間委託による試験結果","基準","適用基準NEXCO構造物施工管理要領","公的機関または民間委託による試験結果","基準","国土交通省告示第１３７２号","公的機関による試験結果（自社での試験結果）","基準","国土交通省告示第１３７２号","公的機関による試験結果（自社での試験結果）","基準","自社基準","公的機関での試験結果","基準","適用基準国土交通省無収縮モルタルの規格値","公的機関による試験結果（自社）","基準","適用基準　NEXCO構造物施工管理要領","公的機関による試験結果","基準","適用基準　NEXCO「左官工法による断面修復材の品質規格」","自社試験による試験結果","基準","適用基準 NEXCO「床版上面における断面修復の性能照査項目」","公的機関による試験結果（自社での試験結果）","基準","NEXCO構造物施工管理要領｢打込み工法による断面修復｣","公的機関（自社試験）による試験結果","基準","-","-","基準","-","-","基準","NEXCO構造物施工管理要領「左官工法による断面修復の性能照査項目」","公的機関","基準","-","-","基準","国土交通省告示第1372号2項","公的機関（自社試験）による試験結果","基準","NEXCO構造物施工管理要領（NEXCO試験法439）","公的機関（自社試験）","基準","自社基準","自社試験","基準","自社基準","自社試験","基準","NEXCO構造物施工管理要領","公的機関（自社試験）による試験結果","基準","NEXCO構造物施工管理要領","公的機関（自社試験）による試験結果","基準","農業水利施設の補修・補強に関するマニュアル【開水路補修編】","公的機関（自社試験）による試験結果","基準","／","／","／","／","／","／","／","／","／","／","／","／"]
[null,null,"補修材料の性能","フロー",null,"-","-","120～160mm","-","-","140～250","-","-","～300mm","-","-","120～160mm","-","-","140～250","-","-","120～160mm","-","-","120～160mm","-","-","120～160mm","-","-","120～160mm","-","-","120～160mm","（直後150～190mm）","177mm（JISR5201）","120～160mm","（直後170～230mm）","193mm（JISR5201）","140～250","-","-","140～250","-","-","140～250","-","-","120～160mm","-","-","120～160mm","-","-","120～160mm","-","-","120～160mm","（直後170～230mm）","-","140～250","-","157mm","120～160mm","-","157mm","140～250","-","-","120～160mm","-","-","140～250","-","-","140～250","-","（6.6秒）","-","-","-","120～160mm","-","147.5mm","120～160mm","-","-","120～180mm","250～320mm","268mm","～300mm","-","-","120～160mm","-","-","140～250","-","-","120～180mm","-","-","140～250","-","-","120～160mm","－","（205）","120～160mm","－",210,"120～160mm","－",190,"120～160mm","-","（148mm）","140～250","-","（160mm）","120～160mm","-","-","120～160mm","／","／","／","／","／","／","／","／","／","／","／","／"]
[null,null,null,"硬化時間（時間）",null,"1時間以上","9時間8分","3～8時間","-","-","3～8時間","-","-","4～15時間","1時間以上","2時間32分","3～8時間","1時間以上","2時間32分","3～8時間","1時間以上","9時間34分","3～8時間","1時間以上","2時間27分","3～8時間","30分以上","46分","3～8時間","30分以上","44分","3～8時間","30分以上","54分","3～8時間","1時間以上","3時間（JISR5201）","3～8時間","-","-","3～8時間","-","-","3～8時間","-","-","3～8時間","30分以上","5℃：58分、,23℃：33分、35℃：44分","3～8時間","-","-","0.5～2時間","1時間以上（参考値）","1～1.5時間","3～8時間","1時間以上（参考値）","0.5時間","3～8時間","-","-","3～8時間","1時間以上","3時間","3～8時間","-","3時間","3～8時間","-","-","2～7時間","-","-","2～7時間","-","-","3～8時間","始発：1時間以上，終結：10時間以内","（始発：2時間02分，終結：6時間52分）","3～12時間","1時間以上","4.5時間","3～8時間","1時間以上（参考値）","5時間33分（亜硝酸リチウム混入時：4時間30分）","3～8時間","始発時間30分以上","49～71分（40～62分）","0.5～2時間","-","8時間40分(始発)","4～15時間","-","-","3～8時間","-","-","3～8時間","1時間以上","2.0時間","2～7時間","-","-","3～8時間","-","（12時間）","3～8時間","30分以上（始発）","45分","3～8時間","始発－終結(分）","25－32分","3～8時間","始発－終結(分）","40－55分","3～8時間","-","-","3～8時間","1時間以上","5時間","3～8時間","-","6時間","3～8時間","／","／","／","／","／","／","／","／","／","／","／","／"]
[null,null,null,"圧縮強度\n（N/mm2）","材齢3ｈ","-","-","-","-","-","-","-","-","-","-","-","-","-","-","-","-","-","-","-","-","-","-","-","-","-","-","-","-","-","-","-","-","-","-","-","-","-","-","-","-","-","-","-","-","-","-","-","3～15N/mm2","-","23.6N/mm2","-","-","21.6N/mm2","-","-","-","-","-","-","-","-","-","-","-","-","-","-","-","-","-","-","-","-","（49.5N/mm2）","-","-","-","-","-","-","-","-","-","1～10N/mm2","-","-","-","-","-","-","-","-","-","-","-","-","-","-","-","-","-","-","－","（28.9）","-","－",33.5,"-","18以上",21,"-","-","-","-","-","-","-","-","-","-","／","／","／","／","／","／","／","／","／","／","／","／"]
[null,null,null,null,"材齢1ｄ","-","-","5～25N/mm2","-","-","5～15N/mm2","-","-","5～10N/mm2","-","-","5～25N/mm2","-","-","5～15N/mm2","-","（15.8N/mm2）","5～25N/mm2","-","（17.6N/mm2）","5～25N/mm2","-","-","5～25N/mm2","-","-","5～25N/mm2","-","-","5～25N/mm2","-","-","5～25N/mm2","-","-","5～15N/mm2","-","-","5～15N/mm2","-","-","5～15N/mm2","-","-","5～25N/m㎡","-","-","10～30N/mm2","-","34.3N/mm2","5～25N/mm2","-","26.2N/mm2","5～25N/mm2","-","-","5～15N/mm2","-","-","5～25N/mm2","-","-","5～15N/mm2","-","-","15～25N/mm2","-","-","10～25N/mm2","-","-","5～15N/mm2","-","-","5～40N/mm2","-","-","5～25N/mm2","-","13.1N/mm2","5～25N/mm2","－","-","5～30N/mm2","-","-","5～10N/mm2","-","-","5～25N/mm2","-","-","5～15N/mm2","-","-","15～25N/mm2","-","-","5～15N/mm2","-","-","5～25N/mm2","－","（39.5）","5～25N/mm2","－",47.5,"5～25N/mm2","－",27.8,"5～25N/mm2","-","（24.7）","5～15N/mm2","-","（18.5）","5～25N/mm2","-","-","5～25N/mm2","／","／","／","／","／","／","／","／","／","／","／","／"]
[null,null,null,null,"材齢7ｄ","-","-","20～40N/mm2","-","-","20～40N/mm2","-","-","15～40N/mm2","-","-","20～40N/mm2","-","-","20～40N/mm2","-","（36.8N/mm2）","20～40N/mm2","-","（32.6N/mm2）","20～40N/mm2","-","-","20～40N/mm2","-","-","20～40N/mm2","-","-","20～40N/mm2","-","22.5N/mm2（JISR5201）","20～40N/mm2","-","36.5N/mm2（JISR5201）","20～40N/mm2","-","-","20～40N/mm2","-","-","20～40N/mm2","-","-","20～40N/m㎡","5℃：50N/mm2以上","5℃：58.9N/mm2以上","20～40N/mm2","-","51.0N/mm2","20～40N/mm2","-","32.2N/mm2","20～40N/mm2","-","37.4N/mm2","20～40N/mm2","-","30.6N/mm2","20～40N/mm2","-","30.6N/mm2","20～40N/mm2","-","-","20～60N/mm2","-","-","30～50N/mm2","-","-","20～40N/mm2","-","-","30～65N/mm2","-","52N/mm2（自社）","20～40N/mm2","-","40.9N/mm2","20～40N/mm2","－","-","20～50N/mm2","-","（45.2）","15～40N/mm2","-","-","20～40N/mm2","-","-","20～40N/mm2","-","-","20～60N/mm2","-","-","20～40N/mm2","20.0N/mm2以上","101N/mm2以上","20～40N/mm2","－","（49.1）","20～40N/mm2","－",55.8,"20～40N/mm2","－",36.200000000000003,"20～40N/mm2","-","（56.1）","20～40N/mm2","-","（44.3）","20～40N/mm2","-","（45.4N/mm2）","20～40N/mm2","／","／","／","／","／","／","／","／","／","／","／","／"]
[null,null,null,null,"材齢28ｄ","設計基準強度以上","33.2N/mm2","25～60N/mm2","設計基準強度以上","41.6N/mm2","30～60N/mm2","設計基準強度以上","54.2N/mm2","25～50N/mm2","設計基準強度以上","72.7N/mm2","25～60N/mm2","設計基準強度以上","72.7N/mm2","30～60N/mm2","設計基準強度以上","56.5N/mm2","25～60N/mm2","設計基準強度以上","37.8N/mm2","25～60N/mm2","24N/mm2以上","48.5N/mm2","25～60N/mm2","24N/mm2以上","53.5N/mm2","25～60N/mm2","24N/mm2以上","54.5N/mm2","25～60N/mm2","（自社基準）24N/mm2","35.1N/mm2（JISR5201）","25～60N/mm2","（30N/mm2以上）","47.2N/mm2（JISR5201）","30～60N/mm2","設計基準強度以上","62.5N/mm2","30～60N/mm2","21N/m㎡以上","45.6N/m㎡","30～60N/mm2","-","52.3N/m㎡","25～60N/m㎡","-","-","25～40N/mm2","設計基準強度以上","63.4N/mm2","25～60N/mm2","設計基準強度以上","37.5N/mm2","25～60N/mm2","（30N/mm2以上）","46.3N/mm2","30～60N/mm2","設計基準強度以上","34.5N/mm2","25～60N/mm2","設計基準強度以上","34.5N/mm2","30～60N/mm2","JIS A 1172で20N/mm2以上","101N/mm2(JIS A 1171)","45～80N/mm2","JIS A 1172で20N/mm2以上","101N/mm2(JIS A 1171)","35～75N/mm2","既設コンクリート設計基準強度以上であること（21～30N/mm2）","72.1N/mm2","30～60N/mm2","44N/mm2以上","73.2N/mm2","40～75N/mm2","設計基準強度以上","60.1N/mm2（自社）","25～60N/mm2","設計基準強度以上","47.3N/mm2（亜硝酸リチウム混入時：60.6N/mm2）","25～60N/mm2","24N/ｍ㎡以上","（5℃～35℃：51.3～53.2N/m㎡（49.8～50.8N/m㎡））","35～60N/mm2","設計基準強度以上",53.1,"25～50N/mm2","-","-","25～60N/mm2","-","-","30～60N/mm2","設計基準強度以上",64.099999999999994,"45～80N/mm2","-","-","30～60N/mm2","-","-","25～60N/mm2","－",62.4,"25～60N/mm2","－",65.3,"25～60N/mm2","－",45.5,"25～60N/mm2","-",58.1,"30～60N/mm2","-",53.6,"25～60N/mm2","21.0N/mm2以上","38.1N/mm2","25～60N/mm2","／","／","／","／","／","／","／","／","／","／","／","／"]
[null,null,null,null,"その他","-","-","-","-","-","-","-","-","-","-","-","-","-","-","-","-","-","-","-","-","-","2h:10N/mm2,4h:24N/mm2以上","2h：21.9N/mm2、4h：31.6N/mm2","-","2h:10N/mm2,4h:24N/mm2以上","2h：25.4N/mm2、4h：34.4N/mm2","-","2h:10N/mm2,4h:24N/mm2以上","2h：23.0N/mm2、4h：34.1N/mm2","-","-","-","-","-","-","-","-","-","-","-","-","-","材齢2ｈ：10N/m㎡以上、材齢4ｈ：24N/m㎡以上","材齢2ｈ： 26.8N/m㎡、材齢4ｈ： 28.7N/m㎡","-","-","材齢6h、5℃、湿潤面：44.2N/m㎡","-","-","-","-","-","-","-","-","3d：33.9N/mm2","-","-","-","-","-","-","-","-","115N/mm2(JIS A 1108)","-","-","115N/mm2(JIS A 1108)","-","-","-","-","-","-","-","-","-","-","-","-","-","5～35℃：2時間10N/m㎡以上、4時間24N/ｍ㎡以上","5℃～35℃：13.7～30.5N/m㎡（17～30.8N/m㎡）","-","-","-","-","-","-","-","-","-","-","-","-","-","-","-","-","-","-","-","その他（2ｈ）10以上",27.7,"-","その他（4ｈ）24以上",29.4,"-","－",10.1,"-","-","-","-","-","-","-","-","-","-","／","／","／","／","／","／","／","／","／","／","／","／"]
[null,null,null,"付着強度\n（N/mm2）","標準","-","-","1.8～3.4N/mm2","1.5N/mm2以上","2.0N/mm2","2.0～3.5N/mm2","1.5N/mm2以上","1.9N/mm2","2.0～2.3N/mm2","-","-","1.8～3.4N/mm2","-","-","2.0～3.5N/mm2","-","（2.4N/mm2）","1.8～3.4N/mm2","-","（2.6N/mm2）","1.8～3.4N/mm2","1.5N/mm2以上","2.6N/mm2","1.8～3.4N/mm2","1.5N/mm2以上","2.5N/mm2","1.8～3.4N/mm2","1.5N/mm2以上","2.8N/mm2","1.8～3.4N/mm2","湿潤時：1.5N/mm2以上","湿潤時：2.0N/mm2（JISA6909）","1.8～3.4N/mm2","1.5N/mm2以上","2.2N/mm2（JHS432）","2.0～3.5N/mm2","平均値：1.5N/mm2、最低値：1.0N/mm2","平均値：2.2N/mm2、最低値：1.7N/mm2","2.0～3.5N/mm2","1.5N/m㎡以上","2.08N/m㎡","2.0～3.5N/mm2","1.5N/m㎡以上　","2.0N/m㎡","1.8～3.4N/m㎡","-","-","2.0～2.8N/mm2","-","-","1.8～3.4N/mm2","-","-","1.8～3.4N/mm2","1.5N/mm2以上","1.8N/mm2","2.0～3.5N/mm2","-","1.63N/mm2","1.8～3.4N/mm2","1.5N/mm2以上","1.63N/mm2","2.0～3.5N/mm2","2.0～3.5N/mm2以上","3.4N/mm2(JSCE-K561-2010)","1.5～3.0N/mm2","2.0～3.5N/mm2以上","3.4N/mm2(JSCE-K561-2010)","2.0～3.0N/mm2","1.5N/mm2以上","2.41N/mm2","2.0～3.5N/mm2","-","-","1.5～2.7N/mm2","1.5N/mm2以上","2.4N/mm2","1.8～3.4N/mm2","1.5N/mm2以上","2.4N/mm2（亜硝酸リチウム混入時：2.4N/mm2）","1.8～3.4N/mm2","1.5N/m㎡以上","平均3.23N/m㎡（3.57N/m㎡）","1.5～2.5N/mm2","1.5N/mm2以上",3.3,"2.0～2.3N/mm2","-","-","1.8～3.4N/mm2","-","-","2.0～3.5N/mm2","-","-","1.5～3.0N/mm2","-","-","2.0～3.5N/mm2","1.0N/mm2以上","4.7N/m㎡（下地破壊）","1.8～3.4N/mm2","1.5以上",3.6,"1.8～3.4N/mm2","－","－","1.8～3.4N/mm2","－","－","1.8～3.4N/mm2","1.5以上",2.6,"2.0～3.5N/mm2","1.5以上",2.7,"1.8～3.4N/mm2","1.5N/mm2以上","2.77N/mm2","1.8～3.4N/mm2","／","／","／","／","／","／","／","／","／","／","／","／"]
[null,null,null,null,"温冷繰返し","1.5N/mm2以上","1.9N/mm2","1.6～2.4N/mm2","-","-","1.5～2.4N/mm2","-","-","1.6～2.2N/mm2","1.5N/mm2以上","1.5N/mm2","1.6～2.4N/mm2","1.5N/mm2以上","1.5N/mm2","1.5～2.4N/mm2","1.5N/mm2以上","1.8N/mm2","1.6～2.4N/mm2","1.5N/mm2以上","2.3N/mm2","1.6～2.4N/mm2","1.5N/mm2以上","1.7N/mm2","1.6～2.4N/mm2","1.5N/mm2以上","1.7N/mm2","1.6～2.4N/mm2","1.5N/mm2以上","1.3N/mm2","1.6～2.4N/mm2","1.5N/mm2以上","1.8N/mm2（JISA6909）","1.6～2.4N/mm2","-","-","1.5～2.4N/mm2","早強コンクリートでの試験値2.4N/mm2","凍結融解試験後　平均値2.6N/mm2","1.5～2.4N/mm2","1.0N/m㎡以上","1.42N/m㎡","1.5～2.4N/mm2","-","-","1.6～2.4N/m㎡","-","-","1.6～3.0N/mm2","1.5N/mm2以上","2.1N/mm2","1.6～2.4N/mm2","1.5N/mm2以上","2.1N/mm2","1.6～2.4N/mm2","-","1.7N/mm2","1.5～2.4N/mm2","1.5N/mm2以上","0.65N/mm2","1.6～2.4N/mm2","-","0.65N/mm2","1.5～2.4N/mm2","-","2.1N/mm2(JIS A 1171)","1.5～1.9N/mm2","-","2.1N/mm2(JIS A 1171)","1.50N/mm2","-","-","1.5～2.4N/mm2","-","-","1.63N/mm2","1.5N/mm2以上","2.1N/mm2","1.6～2.4N/mm2","1.5N/mm2以上","3.7N/mm2","1.6～2.4N/mm2","－","-","-","-","（3.9）","1.6～2.2N/mm2","-","-","1.6～2.4N/mm2","-","-","1.5～2.4N/mm2","1.5N/mm2以上",1.9,"1.5～1.9N/mm2","-","-","1.5～2.4N/mm2","-","-","1.6～2.4N/mm2","－","－","1.6～2.4N/mm2","－","－","1.6～2.4N/mm2","－","－","1.6～2.4N/mm2","-","-","1.5～2.4N/mm2","1.5以上",1.77,"1.6～2.4N/mm2","1.0N/mm2以上","2.01N/mm2","1.6～2.4N/mm2","／","／","／","／","／","／","／","／","／","／","／","／"]
[null,null,null,null,"その他","湿潤時、耐アルカリ性試験後1.5N/mm2以上","湿潤時1.7N/mm2、耐アルカリ性試験後1.7N/mm2","-","振動試験後、凍結融解試験後1.5N/mm2","振動試験後1.5N/mm2、凍結融解試験後1.6N/mm2","-","凍結融解試験後1.5N/mm2","凍結融解試験後1.6N/mm2","-","湿潤時、耐アルカリ性試験後1.5N/mm2以上","湿潤時1.6N/mm2、耐アルカリ性試験後1.5N/mm2","-","湿潤時、耐アルカリ性試験後1.5N/mm2以上","湿潤時1.6N/mm2、耐アルカリ性試験後1.5N/mm2","-","湿潤時、耐アルカリ性試験後1.5N/mm2以上","湿潤時2.8N/mm2、耐アルカリ性試験後2.9N/mm2","-","湿潤時、耐アルカリ性試験後1.5N/mm2以上","湿潤時3.0N/mm2、耐アルカリ性試験後2.5N/mm2","-","-","-","-","-","-","-","-","-","-","耐アルカリ性試験後：1.5N/mm2以上","耐アルカリ性試験後：2.0N/mm2（JISA6909）","-","-","-","-","早強コンクリートでの試験値2.1N/mm2","乾湿繰返し試験後　平均値2.1N/mm2","-","水中：1.0N/m㎡以上","水中：1.68N/m㎡","-","凍結融解抵抗性試験後：1.5N/m㎡以上　","2.1N/m㎡","-","（材齢6h、5℃、湿潤面：未硬化（0.05N/m㎡））","材齢6h、5℃、湿潤面：1.84N/m㎡","-","湿潤時、耐アルカリ性試験後：1.5N/mm2以上","湿潤時：2.4N/mm2、耐アルカリ性試験後：1.7N/mm2","-","湿潤時、耐アルカリ性試験後：1.5N/mm2以上","湿潤時：2.2N/mm2、耐アルカリ性試験後：2.6N/mm2","-","-","耐海水性：1.9N/mm2","-","湿潤時、耐アルカリ性試験後1.5N/mm2以上","-","-","振動試験後、凍結融解試験後1.5N/mm2","-","-","-","-","-","-","-","-","-","-","-","-","-","-","湿潤時、耐アルカリ性試験後：1.5N/mm2以上","耐アルカリ性：2.1N/mm2","-","湿潤時、耐アルカリ性試験後：1.5N/mm2以上","3.7N/mm2","-","－","-","-","-","-","-","-","-","-","-","-","-","湿潤時、耐アルカリ性試験後1.5N/mm2以上","湿潤時1.8N/mm2、耐アルカリ性試験後1.6N/mm2","-","-","-","-","-","-","-","1.5以上",2.7,"-","－","－","-","－","－","-","振動試験後\n1.5N/mm2以上",2.8,"-","耐ｱﾙｶﾘ性試験後\n1.5N/mm2以上",2.54,"-","1.0N/mm2以上","2.75N/mm2","-","／","／","／","／","／","／","／","／","／","／","／","／"]
[null,null,null,"弾性係数（kN/mm2）",null,"設計値以上","-","16～21kN/mm2","設計値以上","20.3kN/mm2","14～21kN/mm2","-","-","17～21kN/mm2","設計値以上","-","16～21kN/mm2","設計値以上","-","14～21kN/mm2","設計値以上","（26.92kN/mm2）","16～21kN/mm2","設計値以上","（26.92kN/mm2）","16～21kN/mm2","26.5±5kN/mm2","23.7kN/mm2","16～21kN/mm2","26.5±5kN/mm2","25.3kN/mm2","16～21kN/mm2","26.5±5kN/mm2","29.6kN/mm2","16～21kN/mm2","-","-","16～21kN/mm2","-","-","14～21kN/mm2","設計値以上","29.6kN/mm2","14～21kN/mm2","-","-","14～21kN/mm2","材齢28日：26.5±5kN/m㎡","24.9N/m㎡","16～21kN/m㎡","材齢7日、5℃：3ｋN/mm2以上","材齢7日、5℃：4.2kN/mm2","13～21kN/mm2","-","-","16～21kN/mm2","-","-","16～21kN/mm2","-","19.5N/mm2","14～21kN/mm2","設計値以上","-","16～21kN/mm2","設計値以上","-","14～21kN/mm2","-","34.5ｋN/mm2(NEXCO432)","20～30kN/mm2","-","34.5ｋN/mm2(NEXCO432)","19～27kN/mm2","-","29.6kN/mm2","14～21kN/mm2","-","-","23～32kN/mm2","-","-","16～21kN/mm2","設計値以上","21.2kN/mm2","16～21kN/mm2","材齢28日26.5±5kN/m㎡","5℃～35℃：27.9～30.6N/m㎡（29.8～30.6N/m㎡）","15～20kN/mm2","-","（28）","17～21kN/mm2","-","-","16～21kN/mm2","-","-","14～21kN/mm2","設計値以上","-","20～30kN/mm2","-","-","14～21kN/mm2","-","-","16～21kN/mm2","26.5±5",29,"16～21kN/mm2","－",31.4,"16～21kN/mm2","－",29.1,"16～21kN/mm2","-",24.4,"14～21kN/mm2","-","-","16～21kN/mm2","-","-","16～21kN/mm2","／","／","／","／","／","／","／","／","／","／","／","／"]
[null,null,null,"引張強度（N/mm2）",null,"-","-","3～6N/mm2","-","-","3～6N/mm2","-","-","3～6N/mm2","-","-","3～6N/mm2","-","-","3～6N/mm2","-","（4.53N/mm2）","3～6N/mm2","-","（4.53N/mm2）","3～6N/mm2","-","-","3～6N/mm2","-","-","3～6N/mm2","-","-","3～6N/mm2","-","-","3～6N/mm2","-","-","3～6N/mm2","-","-","3～6N/mm2","-","-","3～6N/mm2","-","-","3～6N/m㎡","-","-","3～6N/mm2","-","-","3～6N/mm2","-","-","3～6N/mm2","-","2.7N/mm2","3～6N/mm2","-","-","3～6N/mm2","-","-","3～6N/mm2","-","-","2～6N/mm2","-","-","2～6N/mm2","-","-","3～6N/mm2","-","-","2～6N/mm2","-","-","3～6N/mm2","-","-","3～6N/mm2","－","-","2～6N/mm2","-","-","3～6N/mm2","-","-","3～6N/mm2","-","-","3～6N/mm2","-","-","2～6N/mm2","-","-","3～6N/mm2","-","83.3N/m㎡","3～6N/mm2","－","－","3～6N/mm2","－","－","3～6N/mm2","－","－","3～6N/mm2","-","-","3～6N/mm2","-","-","3～6N/mm2","-","-","3～6N/mm2","／","／","／","／","／","／","／","／","／","／","／","／"]
[null,null,null,"収縮率（×10^-6）",null,"0.05％以下",1.7000000000000001E-4,"0.02％～0.10％","寸法変化率0.05％以下",-2.3500000000000001E-3,"200～1000×10＾-6","-","-","200～1000×10-＾6","0.05％以下",4.0000000000000002E-4,"0.02％～0.10％","0.05％以下",4.0000000000000002E-4,"200～1000×10＾-6","0.05％以下",2.5999999999999998E-4,"0.02％～0.10％","0.05％以下",3.8000000000000002E-4,"0.02％～0.10％","0.025％以下","0.023%","0.02％～0.10％","0.025％以下","0.020%","0.02％～0.10％","0.025％以下","0.016%","0.02％～0.10％","硬化収縮性：0.05％以下","0.04%（JISA1129-3）","0.02％～0.10％","硬化収縮性：0.05％以下","0.037%（JHS432）","200～1000×10＾-6","寸法変化率0.05％以下",3.2000000000000003E-4,"200～1000×10＾-6","寸法安定性：0.05%以下","寸法安定性：0.041%","200～1000×10＾-6","寸法安定性：0.025%以上収縮しないこと",1.6000000000000001E-4,"0.02％～0.10％","-","-","200～1000×10^-6","硬化収縮性：0.05％以下",4.0000000000000002E-4,"0.02％～0.10％","硬化収縮性：0.05％以下",2.9999999999999997E-4,"0.02％～0.10％","硬化収縮性：0.05％以下",1.2999999999999999E-5,"200～1000×10＾-6","0.05％以下",4.0000000000000002E-4,"0.02％～0.10％","寸法変化率0.05％以下",4.0000000000000002E-4,"200～1000×10＾-6","-","0.0347%(NEXCO432)","300～1200×10^-6","-","0.0347%(NEXCO432)","30～1200×10＾-6","-",3.2000000000000003E-4,"200～1000×10＾-6","材齢7日で収縮無し","（収縮無し）","300～1200×10-＾6","硬化収縮性：0.05％以下",2.9999999999999997E-4,"0.02％～0.10％","硬化収縮性：0.05％以下","-0.046％","0.02％～0.10％","－","-","300～1200×10^-6","5×10＾-4以下(3か月)","4.51×10＾-4","200～1000×10-＾6","-","-","200～1000×10^-6","-","-","200～1000×10＾-6","0.05％以下",0.05,"300～1200×10＾-6","-","-","200～1000×10＾-6","-","-","200～1000×10^-6",250,60,"200～1000×10^-6","－","－","200～1000×10^-6","－","－","200～1000×10^-6","0.05％以下",3.5E-4,"200～1000×10＾-6","0.05%以下",2.9999999999999997E-4,"200～1000×10^-6","0.05％以下",450,"200～1000×10^-6","／","／","／","／","／","／","／","／","／","／","／","／"]
[null,null,null,"熱膨張率（×10^-6/℃）",null,"2.0×10-5/℃以下","1.52×10-5/℃","8～17×10^-6/℃","2.0×10＾-5/℃以下","1.6×10＾-5/℃","9～17×10＾-6/℃","2.0×10-5/℃以下","1.3×10-5/℃","-","2.0×10-5/℃以下","1.6×10^-5/℃","8～17×10^-6/℃","2.0×10-5/℃以下","1.6×10^-5/℃","9～17×10＾-6/℃","2.0×10＾-5/℃以下","1.29×10＾-5/℃","8～17×10^-6/℃","2.0×10＾-5/℃以下","1.53×10＾-5/℃","8～17×10^-6/℃","1.0×10^-5/℃±0.5","1.5×10^-5/℃","8～17×10^-6/℃","1.0×10^-5/℃±0.5","1.5×10^-5/℃","8～17×10^-6/℃","1.0×10^-5/℃±0.5","1.5×10^-5/℃","8～17×10^-6/℃","2.0×10^-5/℃以下","1.2×10^-5/℃（JISK6911）","8～17×10^-6/℃","-","-","9～17×10＾-6/℃","2.0×10＾-5/℃以下","1.6×10＾-5/℃","9～17×10＾-6/℃","2.0×10^-5/℃以下","1.33×10^-5/℃以下","9～17×10＾-6/℃","1.0×10^-5/℃±0.5","1.2×10^-5/℃","8～17×10^-6/℃","-","-","8～17×10^-6/℃","2.0×10^-5/℃以下","1.4×10^-5/℃","8～17×10^-6/℃","2.0×10^-5/℃以下","1.5×10^-5/℃","8～17×10^-6/℃","-","13×10^-6/℃","9～17×10＾-6/℃","2.0×10＾-5/℃以下","1.2×10＾-5/℃以下","8～17×10^-6/℃","2.0×10＾-5/℃以下","1.2×10＾-5/℃以下","9～17×10＾-6/℃","-","1.3(NEXCO432)","9～11×10^-6/℃","-","1.3(NEXCO432)","9～10×10＾-6/℃","-","1.6×10^-6/℃","9～17×10＾-6/℃","-","　","11～14×10＾-6/℃","2.0×10-5/℃以下","1.6×10-5/℃","8～17×10^-6/℃","2.0×10^-5/℃以下","亜硝酸リチウム混入時：0.86×10^-5/℃","8～17×10^-6/℃","1.0×10^-5/℃±0.5","1.0×10^-5/℃","7～9×10^-6/℃","2.0×10＾-5/℃以下","1.4×10＾-5/℃","-","-","-","8～17×10^-6/℃","-","-","9～17×10＾-6/℃","2.0×10-5/℃以下","1.4×10-5","9～11×10＾-6/℃","-","-","9～17×10＾-6/℃","-","-","8～17×10^-6/℃","10±5",11,"8～17×10^-6/℃","－","－","8～17×10^-6/℃","－","－","8～17×10^-6/℃","2.0×10＾-5/℃以下","1.2×10＾-5/℃","9～17×10＾-6/℃","2.0×10-5/℃以下","0.1×10-5/℃","8～17×10^-6/℃","-","1.3×10^-5","8～17×10^-6/℃","／","／","／","／","／","／","／","／","／","／","／","／"]
[null,null,null,"その他の試験",null,"・防錆性試験：防錆率基準50％以上に対して90％（防錆ペーストRJ1）（公的機関）\n・鉄筋との付着性：鉄筋に対する付着強度基準7.8N/mm2以上に対して8.7N/mm2（防錆ペーストRJ1）（公的機関）",null,null,"・促進中性化試験：中性化速度係数3.30mm/√週（参考値）に対して0.00mm/√週・凍結融解抵抗性試験：相対動弾性係数基準60％以上に対して100.5％・遮塩性試験：塩化物イオンの見掛けの拡散係数1.50c㎡/年（参考値）に対して0.81c㎡/年（公的機関）\n・防錆性試験：防錆率基準50％以上に対して90％（防錆ペーストRJ1）・鉄筋との付着性：鉄筋に対する付着強度基準7.8N/mm2以上に対して8.7N/mm2（防錆ペーストRJ1）（公的機関）",null,null,"・促進中性化試験：中性化速度係数3.04mm/√週（参考値）に対して1.09mm/√週・凍結融解抵抗性試験：相対動弾性係数基準60％以上に対して89％・遮塩性試験：塩化物イオンの見掛けの拡散係数2.05c㎡/年（参考値）に対して0.50c㎡/年（公的機関）\n・防錆性試験：防錆率基準50％以上に対して90％（防錆ペーストRJ1）・鉄筋との付着性：鉄筋に対する付着強度基準7.8N/mm2以上に対して8.7N/mm2（防錆ペーストRJ1）（公的機関）",null,null,"・促進中性化試験（JISA1153）：30-8-25N（W/C＝45）での中性化速度係数2.4mm/√週（参考値）に対して0.9mm/√週（民間委託）・凍結融解抵抗性試験（JISA148）：市販のポリマーセメントモルタルの相対動弾性係数90～95％（参考値）に対して102.2％（公的機関）\n　・塩化物イオンの実効拡散係数試験（JSCEG571）：市販のポリマーセメントモルタルの塩化物イオンの見掛けの拡散係数0.57c㎡/年（参考値）に対して0.066c㎡/年（民間委託）",null,null,"・促進中性化試験（JISA1153）：30-8-25N（W/C＝45）での中性化速度係数2.4mm/√週（参考値）に対して0.9mm/√週（民間委託）・凍結融解抵抗性試験（JISA148）：市販のポリマーセメントモルタルの相対動弾性係数90～95％（参考値）に対して102.2％（公的機関）\n　・塩化物イオンの実効拡散係数試験（JSCEG571）：市販のポリマーセメントモルタルの塩化物イオンの見掛けの拡散係数0.57c㎡/年（参考値）に対して0.066c㎡/年（民間委託）",null,null,"・促進中性化試験（JISA1153）：コンクリート（24-12-20Ｎ）W/C＝50％での中性化速度係数2.99mm/√週に対して0.63mm/√週　・凍結融解試験（JISA1148）：他社製品の300サイクル時点での相対動弾性係数90％に対して96％（自社試験）\n・耐酸性試験（5%硫酸、28日）：下水道ｺﾝｸﾘｰﾄ構造物の腐食抑制技術及び防食技術マニュアルにおける重量変化率の規格値±10％以内に対して8.8％、浸透深さ3.0mm以下に対して2.2mm（自社試験）",null,null,"・促進中性化試験（JISA1153）：コンクリート（24-12-20Ｎ）W/C＝50％での中性化速度係数2.99mm/√週に対して1.15mm/√週　・凍結融解試験（JISA1148）：他社製品の300サイクル時点での相対動弾性係数90％に対して95％（自社試験）\n・耐酸性試験（5%硫酸、28日）：下水道ｺﾝｸﾘｰﾄ構造物の腐食抑制技術及び防食技術マニュアルにおける重量変化率の規格値±10％以内に対して-3.7％、浸透深さ3.0mm以下に対して4.5mm（自社試験）",null,null,"凍結融解抵抗性試験：相対動弾性係数基準60％以上に対して100％（自社試験）\n中性化抵抗性試験：中性化速度係数3.3mm/√週（自社基準）に対して1.1mm/√週、遮塩性試験：塩化物イオンの拡散係数1.5cm2/年（自社基準）に対して0.1cm2/年（自社試験）",null,null,"凍結融解抵抗性試験：相対動弾性係数基準60％以上に対して99％（自社試験）\n中性化抵抗性試験：中性化速度係数3.3mm/√週（自社基準）に対して0.8mm/√週、遮塩性試験：塩化物イオンの拡散係数1.5cm2/年（自社基準）に対して0.1cm2/年（自社試験）",null,null,"凍結融解抵抗性試験：相対動弾性係数基準60％以上に対して100％（自社試験）\n中性化抵抗性試験：中性化速度係数3.3mm/√週（自社基準）に対して0.6mm/√週、遮塩性試験：塩化物イオンの拡散係数1.5cm2/年（自社基準）に対して0.1cm2/年（自社試験）",null,null,"塩化物イオン浸透性試験（見掛けの拡散係数）：自社基準値0.35ｃｍ2/年以下に対して0.24ｃｍ2/年（自社試験）\n促進鉄筋腐食試験：試験開始から1年後の内部鉄筋は、普通モルタルでは腐食ありに対して腐食なし",null,null,"塩化物イオン浸透性試験（見掛けの拡散係数）：自社基準値0.35ｃｍ2/年以下に対して0.32ｃｍ2/年（自社試験）",null,null,"鉄筋背面への充填性試験：空隙の合計長0.0mm、凍結融解試験：相対動弾性係数の基準値80％以上に対して100.2％、塩化物イオンの見掛けの拡散係数試験：早強コンクリートでの試験値1.43cm2/年に対して0.477cm2/年\n促進中性化試験：中性化深さ0.5㎜、中性化速度係数0.10㎜/√週、耐硫酸性試験：5%硫酸30日浸漬後の中性化深さの基準値3㎜以下に対して1㎜、また質量変化率の基準±10％以内に対して-1％",null,null,"水砂噴流摩耗試験：標準供試体に対する摩耗深さの相対比率の基準値1.5以下に対して0.64、促進中性化試験：中性化深さの基準値5mm以下に対して0.4mm\n耐凍害性試験：相対動弾性係数の基準値85％以上に対して96%、塩水浸漬試験：塩化物イオン浸透深さ（12週）はポリマーセメントモルタルで約7mmに対して約5mm",null,null,"凍結融解抵抗性試験：相対動弾性係数の基準値60％以上に対して100％\n中性化抵抗性試験：中性化速度係数4.0mm/√週、遮塩性試験：塩化物イオンの拡散係数0.118cm2/年",null,null,"曲げ強度試験（材齢7日、気温5℃）：基準値20N/m㎡以上に対して26.7N/m㎡\n曲げ強度試験（材齢6h、5℃、湿潤面：）：21.4N/m㎡",null,null,"-",null,null,"-",null,null,"・促進中性化試験（JISA1153）：従来の湿式吹付工法での中性化速度係数0.0mm/√週に対して0.0mm/√週と同等（公的機関）　\n・遮塩性試験：塩化物イオンの見掛けの拡散係数試験：従来の湿式吹付工法での塩化物イオンの見掛けの拡散係数1.82cm2/年に対して、0.118cm2/年（公的機関）・凍結融解抵抗性試験：相対動弾性係数基準60％以上に対して90％（公的機関）　",null,null,"・電気泳動試験：143時間後の塩素侵入量が通常のモルタル0.2mol/lに対して、0.025mol/l(通常モルタルの1/8)　（民間委託試験）・凍結融解試験（JSCE-G501-1999）：300サイクルで異常なし\n・腐食促進実験：試験開始から1年後の内部鉄筋は普通モルタルでは腐食有に対して腐食なし",null,null,"・電気泳動試験：143時間後の塩素侵入量が通常のモルタル0.2mol/lに対して、0.025mol/l(通常モルタルの1/8)　（民間委託試験）・凍結融解試験（JSCE-G501-1999）：300サイクルで異常なし\n・腐食促進実験：試験開始から1年後の内部鉄筋は普通モルタルでは腐食有に対して腐食なし",null,null,"促進中性化試験（JIS A 1153)：土木学会コンクリートライブラリー119の中性化深さ0～1.3mm/4週に対して、0mm52週\n塩化物イオンの見掛けの拡散係数試験（JIS-G572-2010）：0.046cm2/年（自社試験）　凍結融解抵抗性試験：相対動弾性係数基準95～97%（土木学会ライブラリー119）に対し99%（自社試験）",null,null,"促進中性化試験（JIS A 1153)：土木学会コンクリートライブラリー119の中性化深さ0～1.3mm/4週に対して、0mm52週\n塩化物イオンの見掛けの拡散係数試験（JIS-G572-2010）：0.046cm2/年（自社試験）　凍結融解抵抗性試験：相対動弾性係数基準95～97%（土木学会ライブラリー119）に対し99%（自社試験）",null,null,"・促進中性化試験：中性化速度係数0.10mm/√週（公的機関）・凍結融解抵抗性試験：自社基準80％に対して100.2％（公的機関）\n　・塩化物イオンの見掛けの拡散係数試験：早強コンクリートの塩化物イオンの見掛けの拡散係数0.95c㎡/年に対して0.20c㎡/年（公的機関）・塩化物イオン吸着試験：塩化物イオンの吸着量0.5mg/g以上（自社基準）に対し2.4mg/g以上",null,null,"自己治癒機能確認試験（通水試験）：材齢28日で80%の通水量を抑制",null,null,"実効拡散係数試験（JSCE-G 571）：一般的なポリマーセメントモルタルの実効拡散係数、0.38c㎡/年に対して0.04c㎡/年（民間委託）",null,null,"性能確認実験（NETIS情報より）：塩分濃度5、15kg/m3の鉄筋コンクリートを本製品で断面修復した供試体の自然電位を測定し、\n塩分濃度5kg/m3においては貴（＋）化、15kg/m3においては補修後100日程度で-350ｍVを上回り、580日で-100ｍVを確認している。",null,null,"・中性化抵抗性：23℃で2.33ｍｍ/√週（1.99ｍｍ/√週）を確認（公的機関）。・耐摩耗性：JIS K 7204「テーパー式摩耗試験」を実施し、市販の断面修復材及びモルタル（W/C＝40％）よりも摩耗量が少ないことを確認（自社試験）。\n・凍結融解抵抗性：相対動弾係数60％以上、負荷後の付着強度1.5N/mmの基準に対して、23℃で103％、2.08kN/mm（104％、2.79kN/mm）を確認（公的機関）。・遮塩性：23℃で0.296c㎡/年（0.354c㎡/年）を確認（公的機関）。",null,null,"鉄筋背面への充填性試験：有害な空隙なし 空隙の合計長0mm（公的機関）　モルタルのブリーディング率：0.0％（公的機関）\n凍結融解抵抗性試験　：　相対動弾性係数103％　負荷後のコンクリートとの付着強度2.2N/mm2（公的機関）　遮塩性試験　：　塩化物イオン拡散係数0.187cm2/年\n（公的機関）",null,null,"引張接着性試験：基準値0.6N/mm2以上に対して0.95N/mm2（自社試験）。　疲労耐久性試験：従来技術の疲労寿命485,002回に対して686,751回（自社試験）。\n防水層に対する塗膜厚みばらつき抑制性試験：従来技術（アスファルト系塗膜防水層）（最大塗膜厚み―最小塗膜厚み（ｍｍ））4.3mmに対して2.3mm（自社試験）。",null,null,"引張接着性試験：基準値0.6N/mm2以上に対して0.95N/mm2（自社試験）。　疲労耐久性試験：従来技術の疲労寿命485,002回に対して686,751回（自社試験）。\n防水層に対する塗膜厚みばらつき抑制性試験：従来技術（アスファルト系塗膜防水層）（最大塗膜厚み―最小塗膜厚み（ｍｍ））4.3mmに対して2.3mm（自社試験）。",null,null,"凍結融解抵抗性試験：試験終了時点での300サイクルにおける評価結果は、質量減少率は0.1％、相対動弾性係数は91％、耐久性指数は91％。\n\n-",null,null,"凍結融解抵抗性試験：試験終了時点での300サイクルにおける評価結果は、質量減少率は0.1％、相対動弾性係数は91％、耐久性指数は91％。\n\n-",null,null,"JIS A1106（コンクリートの曲げ強度試験方法）：曲げ強度：69.9N/mm2以上\n-",null,null,"ひび割れ抵抗性（5面拘束：変状なし）凍結融解試験（相対動弾性係数109％）\n遮塩性（1.93cm2/年）促進中性化試験（2.0mm√(週）",null,null,"-\n-",null,null,"-\n-",null,null,"凍結融解抵抗性：300ｻｲｸﾙ後 相対動弾性係数101%（公的機関）\n遮塩性：塩化物イオン拡散係数0.196ｃｍ2/年（公的機関）",null,null,"-\n-",null,null,"耐摩耗性：水砂噴流摩耗試験を実施し、標準供試体に対する平均摩耗深さの比が1.5以下に対して0.91を確認（自社試験）。\n安全性：JWWA Z 108　浸出試験を実施し、基準値内を確認（公的機関）。",null,null,"／",null,null,"／",null,null,"／",null,null,"／"]
[null,"⑮","実施している性能評価試験",null,null,"・NEXCO構造物施工管理要領「左官工法による断面修復の性能照査項目」に準じた試験方法\n・NEXCO構造物施工管理要領「鉄筋防錆材の性能照査項目」に準じた試験方法",null,null,"NEXCO構造物施工管理要領「吹付け工法による断面修復の性能照査項目」に準じた試験方法\nNEXCO構造物施工管理要領「鉄筋防錆材の性能照査項目」に準じた試験方法",null,null,"NEXCO構造物施工管理要領「吹付け工法による断面修復の性能照査項目」に準じた試験方法\nNEXCO構造物施工管理要領「鉄筋防錆材の性能照査項目」に準じた試験方法",null,null,"・NEXCO構造物施工管理要領「左官工法による断面修復の性能照査項目」に準じた試験方法\n・JISA1153「コンクリートの促進中性化試験方法」、・JISA148「コンクリートの凍結融解試験方法」、・JSCEG571「電気泳動によるコンクリート中の塩化物イオンの実効拡散係数試験」",null,null,"・NEXCO構造物施工管理要領「左官工法による断面修復の性能照査項目」に準じた試験方法\n・JISA1153「コンクリートの促進中性化試験方法」、・JISA148「コンクリートの凍結融解試験方法」、・JSCEG571「電気泳動によるコンクリート中の塩化物イオンの実効拡散係数試験」",null,null,"NEXCO構造物施工管理要領「左官工法による断面修復の性能照査項目」に準じた試験方法\nJISA1153「コンクリートの促進中性化試験方法」、JISA1148「コンクリートの凍結融解試験方法」等",null,null,"NEXCO構造物施工管理要領「左官工法による断面修復の性能照査項目」に準じた試験方法\nJISA1153「コンクリートの促進中性化試験方法」、JISA1148「コンクリートの凍結融解試験方法」等",null,null,"NEXCO構造物施工管理要領「床版上面における断面修復の性能照査項目」に準じた試験",null,null,"NEXCO構造物施工管理要領「床版上面における断面修復の性能照査項目」に準じた試験",null,null,"NEXCO構造物施工管理要領「床版上面における断面修復の性能照査項目」に準じた試験",null,null,"JISR5201「セメントの物理試験方法」、JISA6909｢建築用仕上塗材」、JISA1129-3「モルタル及びコンクリートの長さ変化測定方法」\nJISK6911「熱硬化性プラスチック一般試験方法」、JSCE-G572「浸せきによるコンクリート中の塩化物イオンの見掛けの拡散係数試験方法(案)」等",null,null,"JISR5201「セメントの物理試験方法」、JHS432｢断面修復用吹付けモルタルの試験方法」\nJSCE-G572「浸せきによるコンクリート中の塩化物イオンの見掛けの拡散係数試験方法(案)」等",null,null,"｢コンクリート構造物の断面修復の手引き(案)」（平成16年3月）断面修復材の性能確認試験(JHERⅠ416)、｢構造物施工管理要領｣（平成24年7月）に準じた試験\n社団法人地域資源循環技術センター「農業集落排水施設のコンクリート劣化点検・診断・補修の手引き（案）」（平成14年7月）参考資料3.1.2断面修復材（1）（2）",null,null,"農林水産省「開水路補修・補強工事マニュアル（案）」に準じた試験方法",null,null,"NEXCO構造物施工管理要領「床版上面における断面修復の性能照査項目」に準じた試験",null,null,"-",null,null,"NEXCO構造物施工管理要領「左官工法による断面修復の性能照査項目」に準じた試験方法",null,null,"NEXCO構造物施工管理要領「左官工法による断面修復の性能照査項目」に準じた試験方法",null,null,"構造物施工管理要領　平成20年8月（東･中･西日本高速道路㈱）断面修復用吹付けモルタルの試験（JHS432）\n桟橋劣化調査補修マニュアル　平成16年6月　(財)東京港埠頭公社　断面修復材性能試験",null,null,"・NEXCO構造物施工管理要領「左官工法による断面修復の性能照査項目」に準じた試験方法\n・JSCE-G501-1999「コンクリートの凍結融解試験方法」",null,null,"・NEXCO構造物施工管理要領「左官工法による断面修復の性能照査項目」に準じた試験方法\n・JSCE-G501-1999「コンクリートの凍結融解試験方法」",null,null,"-",null,null,"-",null,null,"JIS A 1108「コンクリートの圧縮強度試験方法」、JIS A 1107「コンクリートからのコアの採取方法及び圧縮強度試験方法」に準じた試験",null,null,"-",null,null,"NEXCO構造物施工管理要領「左官工法による断面修復の性能照査項目」に準じた試験方法\nJSCE-G571「電気泳動によるコンクリート中の塩化物イオンの実効拡散係数試験」",null,null,"NEXCO構造物施工管理要領「左官工法による断面修復の性能照査項目」に準じた試験方法、JISR5201「セメントの物理試験方法」\nJISA1129-3「モルタル及びコンクリートの長さ変化測定方法」、JISK6911「熱硬化性プラスチック一般試験方法」、JSCE-K561「コンクリート構造物用断面修復材の試験方法」",null,null,"構造物施工管理要領「床版上面における断面修復の性能照査」（NEXCO）",null,null,"NEXCO構造物施工管理要領｢打込み工法による断面修復｣\n-",null,null,"道路橋床版防水便覧（平成19年3月）\n-",null,null,"道路橋床版防水便覧（平成19年3月）\n-",null,null,"NEXCO構造物施工管理要領「左官工法による断面修復の性能照査項目」に準じた試験\n-",null,null,"NEXCO構造物施工管理要領「左官工法による断面修復の性能照査項目」に準じた試験\n-",null,null,"-\n-",null,null,"NEXCO構造物施工管理要領「床版上面の断面修復の性能照査項目」に準じた試験方法\n-",null,null,"-\n-",null,null,"-\n-",null,null,"NEXCO構造物施工管理要領｢吹付工法による断面修復の性能照査項目｣に準じた試験方法\n-",null,null,"NEXCO構造物施工管理要領\n-",null,null,"農業水利施設の補修・補強に関するマニュアル【開水路補修編】に準じた試験方法\n厚生省令第15号　水道施設の技術的基準に基づく浸出試験",null,null,"／",null,null,"／",null,null,"／",null,null,"／"]
[null,"⑯","耐用年数",null,null,"-",null,null,"-",null,null,"-",null,null,"40年",null,null,"40年",null,null,"-",null,null,"-",null,null,"-",null,null,"-",null,null,"-",null,null,"-",null,null,"-",null,null,"-",null,null,"50年（中性化および耐塩害に関する性能照査により、中性化；被り厚15㎜、耐塩害；被り厚20㎜）",null,null,"-",null,null,"-",null,null,"-",null,null,"-",null,null,"10年（実績）",null,null,"10年（実績）",null,null,"10年（実績）",null,null,"試験結果50年（塩化物イオンの拡散係数により算出）",null,null,"試験結果50年（塩化物イオンの拡散係数により算出）",null,null,"20年以上（実績）",null,null,"-",null,null,"-",null,null,"-",null,null,"-",null,null,"-",null,null,"実績7年：実施工後7年経過後も変状が発生していない",null,null,"実績7年：実施工後7年経過後も変状が発生していない",null,null,"-",null,null,"-",null,null,"-",null,null,"実績20年",null,null,"実績20年",null,null,"実績20年",null,null,"-",null,null,"-",null,null,"実績10年：施工後の現場を確認し浮きや剥がれ等の問題がないことを確認した。",null,null,"／",null,null,"／",null,null,"／",null,null,"／"]
[null,"⑰","施工実績\n（過去３年）",null,"国土交通省：活用効果調査表数","0件（九州で0件）",null,null,"0件（九州で0件）",null,null,"0件（九州で0件）",null,null,"5件（九州で0件）",null,null,"5件（九州で0件）",null,null,"2件（九州で1件）",null,null,"2件（九州で1件）",null,null,"5件（九州で0件）",null,null,"5件（九州で0件）",null,null,"5件（九州で0件）",null,null,"1件（九州で1件）",null,null,"1件（九州で1件）",null,null,"0件（九州で0件）",null,null,"0件（九州で0件）",null,null,"9件（九州で0件）",null,null,"0件（九州で0件）",null,null,"3件（九州で1件）",null,null,"3件（九州で1件）",null,null,"1件（九州で0件）",null,null,"0件（九州で0件）",null,null,"0件（九州で0件）",null,null,"0件（九州で0件）",null,null,"0件（九州で0件）",null,null,"0件（九州で0件）",null,null,"1件（九州で0件）",null,null,"0件（九州で0件）",null,null,"0件（九州で0件）",null,null,"0件（九州で0件）",null,null,"0件（九州で0件）",null,null,"0件（九州で0件）",null,null,"0件（九州で0件）",null,null,"0件（九州で0件）",null,null,"0件（九州で0件）",null,null,"0件（九州で0件）",null,null,"0件（九州で0件）",null,null,"0件（九州で0件）",null,null,"0件（九州で0件）",null,null,"0件（九州で0件）",null,null,"0件（九州で0件）",null,null,"0件（九州で0件）",null,null,"／",null,null,"／",null,null,"／",null,null,"／"]
[null,null,null,null,"地方自治体：開発者ヒアリング","223件（九州で44件）",null,null,"223件（九州で44件）",null,null,"223件（九州で44件）",null,null,"583件（九州で87件）",null,null,"583件（九州で87件）",null,null,"75件（九州で58件）",null,null,"75件（九州で58件）",null,null,"1150件（九州で110件）",null,null,"1150件（九州で110件）",null,null,"1150件（九州で110件）",null,null,"121件（九州で22件）",null,null,"121件（九州で22件）",null,null,"187件（九州で7件）",null,null,"11件（九州で0件）",null,null,"0件（九州で0件）",null,null,"未回答",null,null,"329件以上（九州で5件以上）",null,null,"329件以上（九州で5件以上）",null,null,"60件（九州で5件）",null,null,"10件（九州で2件）",null,null,"10件（九州で2件）",null,null,"0件（九州で0件）",null,null,"0件（九州で0件）",null,null,"8件（九州で1件）",null,null,"16件（九州で0件）",null,null,"10件（九州で0件）",null,null,"177件（九州で26件）",null,null,"61件（九州で0件）",null,null,"550件（九州で65件）",null,null,"167件（九州で24件）",null,null,"167件（九州で24件）",null,null,"92件（九州で0件）",null,null,"92件（九州で0件）",null,null,"0件（九州で0件）",null,null,"39件（九州で10件）",null,null,"39件（九州で10件）",null,null,"39件（九州で10件）",null,null,"33件（九州で4件）",null,null,"33件（九州で4件）",null,null,"1件（九州で0件）",null,null,"／",null,null,"／",null,null,"／",null,null,"／"]
[null,null,null,null,"その他：開発者ヒアリング","96件（九州で5件）",null,null,"96件（九州で5件）",null,null,"96件（九州で5件）",null,null,"382件（九州で42件）",null,null,"382件（九州で42件）",null,null,"4件（九州で5件）",null,null,"4件（九州で5件）",null,null,"610件（九州で90件）",null,null,"610件（九州で90件）",null,null,"610件（九州で90件）",null,null,"0件（九州で0件）",null,null,"0件（九州で0件）",null,null,"21件（九州で0件）",null,null,"10件（九州で0件）",null,null,"0件（九州で0件）",null,null,"未回答",null,null,"18件以上（九州で0件）",null,null,"18件以上（九州で0件）",null,null,"19件（九州で4件）",null,null,"0件（九州で0件）",null,null,"0件（九州で0件）",null,null,"16件（九州で0件）",null,null,"16件（九州で0件）",null,null,"1件（九州で0件）",null,null,"28件（九州で1件）",null,null,"3件（九州で0件）",null,null,"14件（九州で0件）",null,null,"10件（九州で0件）",null,null,"70件（九州で15件）",null,null,"10件（九州で1件）",null,null,"10件（九州で1件）",null,null,"15件（九州で0件）",null,null,"15件（九州で0件）",null,null,"0件（九州で0件）",null,null,"0件（九州で0件）",null,null,"0件（九州で0件）",null,null,"0件（九州で0件）",null,null,"16件（九州で1件）",null,null,"16件（九州で1件）",null,null,"1件（九州で0件）",null,null,"／",null,null,"／",null,null,"／",null,null,"／"]
[null,"⑱","特許等",null,"特許","第4433490号「塩害対策用補修材料及び構造物の補修方法」",null,null,"第4433490号「塩害対策用補修材料及び構造物の補修方法」",null,null,"第4433490号「塩害対策用補修材料及び構造物の補修方法」",null,null,"-",null,null,"-",null,null,"第3518736号 「高炉水砕スラグ砂の製造方法」",null,null,"第3518736号 「高炉水砕スラグ砂の製造方法」",null,null,"-",null,null,"-",null,null,"-",null,null,"第5313623号「セメント混和材及びセメント組成物」",null,null,"第5313623号「セメント混和材及びセメント組成物」",null,null,"-",null,null,"-",null,null,"第5573658号「流込成形用繊維補強セメント複合材料及びその製造方法」",null,null,"第6255139号「ラジカル重合性樹脂組成物、その硬化方法、その製造方法、ラジカル重合性樹脂組成物の用途、及びその使用方法」",null,null,"-",null,null,"-",null,null,"第2562795号、第3563385号、第3942182号",null,null,"-",null,null,"-",null,null,"第6528942　繊維補強材料の吹付け工法",null,null,"第6528942　繊維補強材料の吹付け工法",null,null,"-",null,null,"特開2019-85304：無収縮グラウト組成物、及び無収縮グラウト材",null,null,"-",null,null,"-",null,null,"第7138034号「コンクリート及び既設コンクリート構造物の補修方法」",null,null,"-",null,null,"特許第6933818号　「コンクリート床版の防水補修工法」",null,null,"特許第6933818号　「コンクリート床版の防水補修工法」",null,null,"-",null,null,"-",null,null,"-",null,null,"-",null,null,"-",null,null,"-",null,null,"-",null,null,"-",null,null,"-",null,null,"／",null,null,"／",null,null,"／",null,null,"／"]
[null,null,null,null,"建設技術審査証明","-",null,null,"-",null,null,"-",null,null,"-",null,null,"-",null,null,"-",null,null,"-",null,null,"-",null,null,"-",null,null,"-",null,null,"-",null,null,"-",null,null,"-",null,null,"-",null,null,"-",null,null,"-",null,null,"-",null,null,"-",null,null,"-",null,null,"-",null,null,"-",null,null,"-",null,null,"-",null,null,"-",null,null,"-",null,null,"-",null,null,"-",null,null,"-",null,null,"-",null,null,"-",null,null,"-",null,null,"-",null,null,"-",null,null,"-",null,null,"-",null,null,"-",null,null,"-",null,null,"-",null,null,"-",null,null,"-",null,null,"／",null,null,"／",null,null,"／",null,null,"／"]
[null,"⑲","生産供給体制（機械保有台数等）",null,null,"-",null,null,"-",null,null,"-",null,null,"（全国的）汎用機械により供給（モルタルミキサ、モルタルミキサ）可能",null,null,"（全国的）汎用機械により供給（モルタルミキサ、モルタルミキサ）可能",null,null,"　・全国供給可能　・機械は特になし",null,null,"　・全国供給可能　・機械は特になし",null,null,"汎用機械により供給(練り混ぜ)可能",null,null,"汎用機械により供給(練り混ぜ)可能",null,null,"汎用機械により供給(練り混ぜ)可能",null,null,"汎用機械により供給可能（練り混ぜ機）／添加機は10台以上保有",null,null,"汎用機械により供給可能（練り混ぜ機）／添加機は10台以上保有",null,null,"全国（約70台）",null,null,"汎用機械より供給(練り混ぜ)可能",null,null,"-",null,null,"未回答",null,null,"通常在庫品：数量により受注生産となるため、2週間～1か月の納期が必要となる場合がある。",null,null,"通常在庫品：数量により受注生産となるため、2週間～1か月の納期が必要となる場合がある。",null,null,"全国に47社の工法協会員により運営し全国に供給可能である。（2025年5月末時点）",null,null,"全国",null,null,"全国",null,null,"供給可能地域：全国",null,null,"供給可能地域：全国",null,null,"全国（約70台）",null,null,"受注生産につき、受注後、製品を納入するまで2週間を要する",null,null,"受注生産品",null,null,"供給可能地域：全国、製造拠点：広島県、納期：2週間程度",null,null,"全国で技術提供可能。練混ぜに使用するミキサはコンクリート練混ぜ用のミキサを使用する。(一軸強制練りミキサ，二軸強制練りミキサ，傾動ミキサ等を使用することが可能。)",null,null,"汎用機械により供給(練り混ぜ)可能",null,null,"材料は大阪府内より出荷、定期航路がある離島を含めた国内全域への供給が可能である。汎用機械で練り混ぜ、施工が可能である。",null,null,"材料は大阪府内より出荷、定期航路がある離島を含めた国内全域への供給が可能である。汎用機械で練り混ぜ、施工が可能である。",null,null,"汎用機械により供給(練り混ぜ)可能",null,null,"汎用機械により供給(練り混ぜ)可能",null,null,"-",null,null,"汎用機械により供給（練り混ぜ）可能（大量打設の場合は、専用プラント車による供給が可能）",null,null,"汎用機械により供給（練り混ぜ）可能（大量打設の場合は、専用プラント車による供給が可能）",null,null,"汎用機械により供給（練り混ぜ）可能（大量打設の場合は、専用プラント車による供給が可能）",null,null,"専用機械によって施工実施",null,null,"専用機械によって施工実施",null,null,"全国に供給可能（CE35:12㎏／セット、RP-1:20㎏／袋、RPフィニッシャー：18㎏／缶での提供）",null,null,"／",null,null,"／",null,null,"／",null,null,"／"]
[null,"⑳","備考",null,null,"・海水の飛散など塩化物イオンを含む水分で濡れる個所は、表面保護工（アイゾールＥＸ（CB-030003-V）または　アクアシリカ・エコシリカ（水系アクリルシリコン樹脂塗料）等)を必要とする。\n・注意事項：複数の製品仕様が1技術としてNETISに登録されているため、活用に当たっては各現場ごとの用途について事前に開発者に問合せを行うものとする。",null,null,"・海水の飛散など塩化物イオンを含む水分で濡れる個所は、表面保護工（アイゾールＥＸ（CB-030003-V）または　アクアシリカ・エコシリカ（水系アクリルシリコン樹脂塗料）等)を必要とする。\n★注意事項：複数の製品仕様が1技術としてNETISに登録されているため、活用に当たっては各現場ごとの用途について事前に開発者に問合せを行うものとする。\n-VR評価：2018/02/15～、事後評価2回目（2018/02/15）は本工法比較表には未反映。",null,null,"・海水の飛散など塩化物イオンを含む水分で濡れる個所は、表面保護工（アイゾールＥＸ（CB-030003-V）または　アクアシリカ・エコシリカ（水系アクリルシリコン樹脂塗料）等)を必要とする。\n★注意事項：複数の製品仕様が1技術としてNETISに登録されているため、活用に当たっては各現場ごとの用途について事前に開発者に問合せを行うものとする。\n-VR評価：2018/02/15～、事後評価2回目（2018/02/15）は本工法比較表には未反映。",null,null,"注意事項：複数の製品仕様が1技術としてNETISに登録されているため、活用に当たっては各現場ごとの用途について事前に開発者に問合せを行うものとする（「工法比較表」においてはエフモル05（左官、吹付け用）を代表としている）。",null,null,"注意事項：複数の製品仕様が1技術としてNETISに登録されているため、活用に当たっては各現場ごとの用途について事前に開発者に問合せを行うものとする（「工法比較表」においてはエフモル05（左官、吹付け用）を代表としている）。",null,null,"注意事項：複数の製品仕様が1技術としてNETISに登録されているため、活用に当たっては各現場ごとの用途について事前に開発者に問合せを行うものとする。",null,null,"注意事項：複数の製品仕様が1技術としてNETISに登録されているため、活用に当たっては各現場ごとの用途について事前に開発者に問合せを行うものとする。",null,null,"注意事項：本工法は補修箇所の損傷程度により3種の製品仕様「ゴムラテコンクリート」、「ゴムラテモルタル」、「ポットホール用モルタル」がある（原料はゴムラテコンクリートのみ粗骨材を有する点以外は同等）。\n活用に当たっては各現場ごとの用途について事前に開発者に問合せを行うものとする。",null,null,"注意事項：本工法は補修箇所の損傷程度により3種の製品仕様「ゴムラテコンクリート」、「ゴムラテモルタル」、「ポットホール用モルタル」がある（原料はゴムラテコンクリートのみ粗骨材を有する点以外は同等）。\n活用に当たっては各現場ごとの用途について事前に開発者に問合せを行うものとする。",null,null,"注意事項：本工法は補修箇所の損傷程度により3種の製品仕様「ゴムラテコンクリート」、「ゴムラテモルタル」、「ポットホール用モルタル」がある（原料はゴムラテコンクリートのみ粗骨材を有する点以外は同等）。\n活用に当たっては各現場ごとの用途について事前に開発者に問合せを行うものとする。",null,null,"注意事項：複数の製品仕様が1技術としてNETISに登録されているため、活用に当たっては各現場ごとの用途について事前に開発者に問合せを行うものとする。",null,null,"注意事項：複数の製品仕様が1技術としてNETISに登録されているため、活用に当たっては各現場ごとの用途について事前に開発者に問合せを行うものとする。",null,null,"-",null,null,"・施工費にはユニット鉄筋による補強工は含まれていない（LCモルタルによる断面修復工のみ）。",null,null,"注意事項：本工法は補修厚さが厚い場合は専用骨材を添加してコンクリートタイプにすることも可能である。活用に当たっては各現場ごとの用途について事前に開発者に問合せを行うものとする。",null,null,"-",null,null,"注意事項：複数の製品仕様が1技術としてNETISに登録されているため、活用に当たっては各現場ごとの用途について事前に開発者に問合せを行うものとする。",null,null,"注意事項：複数の製品仕様が1技術としてNETISに登録されているため、活用に当たっては各現場ごとの用途について事前に開発者に問合せを行うものとする。",null,null,"注意事項：コンクリート構造物の種類、部位や部材の劣化状況を考慮し、力学的性能、ひび割れ抵抗性、耐久性を満足すること。複数の製品仕様が1技術としてNETISに登録されているため、活用にあたっては各現場ごとの用途について事前に開発者に問い合わせを行うものとする。",null,null,"-",null,null,"-",null,null,"-",null,null,"-",null,null,"-",null,null,"-",null,null,"-",null,null,"-",null,null,"-",null,null,"-",null,null,"HI-SPECシール工法（KSタイプ）は阪神高速道路株式会社との共同開発技術である。",null,null,"HI-SPECシール工法（KSタイプ）は阪神高速道路株式会社との共同開発技術である。",null,null,"-",null,null,"-",null,null,"-",null,null,"-",null,null,"-",null,null,"-",null,null,"-",null,null,"-",null,null,"-",null,null,"／",null,null,"／",null,null,"／",null,null,"／"]
["総括","㉑","耐久性",null,null,"・本工法の補修材料の一つである遮塩モルタルRP200は、NEXCO構造物施工管理要領「左官工法による断面修復の性能照査項目」に準じた試験を実施し、硬化時間1時間以上、付着強度1.5N/mm2以上、収縮率0.05％以下、熱膨張率2.0×10＾-5/℃以下等の基準を満足している（補完情報より）。\n・本工法の補修材料の一つである防錆ペーストRJ1は、NEXCO構造物施工管理要領「鉄筋防錆材の性能照査項目」に準じた試験を実施し、防錆率50%以上、鉄筋に対する付着強度7.8N/mm2以上等の基準を満足している（補完情報より）。\n・施工後も亜硝酸イオンを放出し続けるため、持続的な品質の確保が期待できる（評価情報より）。",null,null,"・本工法の補修材料の一つである遮塩モルタルRP200は、NEXCO構造物施工管理要領「吹付け工法による断面修復の性能照査項目」に準じた試験を実施し、付着強度1.5N/mm2以上、寸法変化率0.05％以下、熱膨張率2.0×10^-5/℃以下、凍結融解抵抗性試験における相対動弾性係数60％以上等の基準を満足している（補完情報より）。\n・中性化速度係数は、早強コンクリートでの3.30mm/√週に対して、0.00mm/√週である（補完情報より）。\n・塩化物イオンの見掛けの拡散係数は、早強コンクリートでの1.50c㎡/年に対して、0.81c㎡/年である（補完情報より）。\n・本工法の補修材料の一つである防錆ペーストRJ1は、NEXCO構造物施工管理要領「鉄筋防錆材の性能照査項目」に準じた試験を実施し、防錆率50%以上、鉄筋に対する付着強度7.8N/mm2以上等の基準を満足している（補完情報より）。\n・施工後も亜硝酸イオンを放出し続けるため、持続的な品質の確保が期待できる（評価情報より）。",null,null,"・本工法の補修材料の一つである遮塩モルタルRP200は、NEXCO構造物施工管理要領「打込み工法による断面修復の性能照査項目」に準じた試験を実施し、付着強度1.5N/mm2以上、熱膨張率2.0×10^-5/℃以下、凍結融解抵抗性試験における相対動弾性係数60％以上等の基準を満足している（補完情報より）。\n・中性化速度係数は、早強コンクリートでの3.04mm/√週に対して、1.09mm/√週である（補完情報より）。\n・塩化物イオンの見掛けの拡散係数は、早強コンクリートでの2.05c㎡/年に対して、0.50c㎡/年である（補完情報より）。\n・本工法の補修材料の一つである防錆ペーストRJ1は、NEXCO構造物施工管理要領「鉄筋防錆材の性能照査項目」に準じた試験を実施し、防錆率50%以上、鉄筋に対する付着強度7.8N/mm2以上等の基準を満足している（補完情報より）。\n・施工後も亜硝酸イオンを放出し続けるため、持続的な品質の確保が期待できる（評価情報より）。",null,null,"・NEXCO構造物施工管理要領「左官工法による断面修復の性能照査項目」に準じた試験を実施し、硬化時間1時間以上、付着強度1.5N/mm2以上、収縮率0.05％以下、熱膨張率2.0×10＾-5/℃以下等の基準を満足している（補完情報より）。\n・促進中性化試験における中性化速度係数は、30-8-25N（W/C＝45）での2.4mm/√週に対して、0.9mm/√週である（補完情報より）。\n・凍結融解抵抗性試験における相対動弾性係数は、市販のポリマーセメントモルタルでの90～95％に対して102.2％（補完情報より）。\n・電気泳動によるコンクリート中の塩化物イオンの実効拡散係数試験における塩化物イオンの見掛けの拡散係数は、市販のポリマーセメントモルタルの塩化物イオンでの0.57cm2/年に対して、0.066c㎡/年である（NETIS情報、補完情報より）。",null,null,"・NEXCO構造物施工管理要領「左官工法による断面修復の性能照査項目」に準じた試験を実施し、硬化時間1時間以上、付着強度1.5N/mm2以上、収縮率0.05％以下、熱膨張率2.0×10＾-5/℃以下等の基準を満足している（補完情報より）。\n・促進中性化試験における中性化速度係数は、30-8-25N（W/C＝45）での2.4mm/√週に対して、0.9mm/√週である（補完情報より）。\n・凍結融解抵抗性試験における相対動弾性係数は、市販のポリマーセメントモルタルでの90～95％に対して102.2％（補完情報より）。\n・電気泳動によるコンクリート中の塩化物イオンの実効拡散係数試験における塩化物イオンの見掛けの拡散係数は、市販のポリマーセメントモルタルの塩化物イオンでの0.57cm2/年に対して、0.066c㎡/年である（NETIS情報、補完情報より）。",null,null,"・NEXCO構造物施工管理要領「左官工法による断面修復の性能照査項目」に準じた試験を実施し、硬化時間1時間以上、付着強度1.5N/mm2以上、収縮率0.05%以下、熱膨張率2.0×10＾-5/℃以下等の基準を満足している（補完情報より）。\n・促進中性化試験における中性化速度係数は、コンクリート（24-12-20Ｎ）W/C＝50％での2.99mm/√週に対して0.63mm/√週である（補完情報より）。\n・凍結融解試験における相対動弾性係数は、他社製品の300サイクル時点での相対動弾性係数90％に対して96％である（補完情報より）。\n・下水道ｺﾝｸﾘｰﾄ構造物の腐食抑制技術及び防食技術マニュアル 断面修復用モルタルに関する品質試験方法に準じた耐酸性試験（5%硫酸、28日）を実施し、重量変化率±10％以内、硫酸浸透深さ3.0mm以下の基準を満足している（補完情報より）。",null,null,"・NEXCO構造物施工管理要領「左官工法による断面修復の性能照査項目」に準じた試験を実施し、硬化時間1時間以上、付着強度1.5N/mm2以上、収縮率0.05%以下、熱膨張率2.0×10＾-5/℃以下等の基準を満足している（補完情報より）。\n・促進中性化試験における中性化速度係数は、コンクリート（24-12-20Ｎ）W/C＝50％での2.99mm/√週に対して、1.15mm/√週である（補完情報より）。\n・凍結融解試験における相対動弾性係数は、他社製品の300サイクル時点での相対動弾性係数90％に対して95％である（補完情報より）。",null,null,"・［凍害抑制］：NEXCO構造物施工管理要領「床版上面における断面修復の性能照査項目」に準じた試験を実施し、凍結融解抵抗性（相対動弾性係数）60％以上等の基準を満足している（補完情報より）。\n・［中性化抑制］中性化速度係数は、自社基準3.3mm/√週に対して、1.1mm/√週である（補完情報より）。\n・［塩害抑制］塩化物イオンの見掛けの拡散係数は、自社基準1.5c㎡/年に対して、0.1c㎡/年である（補完情報より）。\n・［その他］：NEXCO構造物施工管理要領「床版上面における断面修復の性能照査項目」に準じた試験を実施し、硬化時間30分以上、圧縮強度24N/m2以上、付着強度1.5N/mm2等の基準を満足している（補完情報より）。",null,null,"・［凍害抑制］：NEXCO構造物施工管理要領「床版上面における断面修復の性能照査項目」に準じた試験を実施し、凍結融解抵抗性（相対動弾性係数）60％以上等の基準を満足している（補完情報より）。\n・［中性化抑制］中性化速度係数は、自社基準3.3mm/√週に対して、0.8mm/√週である（補完情報より）。\n・［塩害抑制］塩化物イオンの見掛けの拡散係数は、自社基準1.5c㎡/年に対して、0.1c㎡/年である（補完情報より）。\n・［その他］：NEXCO構造物施工管理要領「床版上面における断面修復の性能照査項目」に準じた試験を実施し、硬化時間30分以上、圧縮強度24N/m2以上、付着強度1.5N/mm2等の基準を満足している（補完情報より）。",null,null,"・［凍害抑制］：NEXCO構造物施工管理要領「床版上面における断面修復の性能照査項目」に準じた試験を実施し、凍結融解抵抗性（相対動弾性係数）60％以上等の基準を満足している（補完情報より）。\n・［中性化抑制］中性化速度係数は、自社基準3.3mm/√週に対して、0.6mm/√週である（補完情報より）。\n・［塩害抑制］塩化物イオンの見掛けの拡散係数は、自社基準1.5c㎡/年に対して、0.1c㎡/年である（補完情報より）。\n・［その他］：NEXCO構造物施工管理要領「床版上面における断面修復の性能照査項目」に準じた試験を実施し、硬化時間30分以上、圧縮強度24N/m2以上、付着強度1.5N/mm2等の基準を満足している（補完情報より）。",null,null,"・［塩害抑制］：塩化物イオン浸透性試験における塩化物イオンの見掛けの拡散係数は、自社基準値0.35ｃｍ2/年以下に対して0.24ｃｍ2/年 （補完情報より）。\n・［その他］：NEXCO構造物施工管理要領「左官工法による断面修復の性能照査項目」に準じた試験を実施し、硬化時間1時間以上、付着強度1.5N/mm2以上、収縮率0.05%以下、熱膨張率2.0×10＾-5/℃以下等の基準を満足している。またフロー値は177mmであり、自社基準の150～190mm以上を満足している（補完情報より）。\n",null,null,"・［塩害抑制］：塩化物イオン浸透性試験における塩化物イオンの見掛けの拡散係数は、自社基準値0.35ｃｍ2/年以下に対して0.32ｃｍ2/年である（補完情報より）。\n・［その他］：NEXCO構造物施工管理要領「吹付け工法による断面修復の性能照査項目」に準じた試験を実施し、付着強度1.5N/mm2以上、収縮率0.05%以下等の基準を満足している。またフロー値は193mmであり、自社基準の170～230mm以上を満足している（補完情報より）。",null,null,"・｢コンクリート構造物の断面修復の手引き(案)」（平成16年3月）断面修復材の性能確認試験(JHERⅠ416)、｢構造物施工管理要領｣（平成24年7月）に準じた試験を実施し、付着強度1.5N/mm2以上、鉄筋背面に有害な空隙がない、寸法変化率0.05％以下、熱膨張率2.0×10＾-5/℃以下、凍結融解抵抗性試験における相対動弾性係数80%以上等の基準を満足している（補完情報より）。\n・塩化物イオンの見かけの拡散係数は早強コンクリートでの試験値1.43cm2/年に対して0.477cm2/年である（補完情報より）。\n\n・社団法人地域資源循環技術センター「農業集落排水施設のコンクリート劣化点検・診断・補修の手引き（案）」に準じた耐硫酸性試験を実施し、5%硫酸30日浸漬後の中性化深さの基準値3㎜以下、質量変化率の基準±10％以内の品質基準を満足している。",null,null,"・［耐摩耗性、中性化抑制、凍害抑制］：農林水産省「開水路補修・補強工事マニュアル（案）」に準じた試験を実施し、標準供試体に対する平均摩耗深さの比が1.5以下、中性化深さ5mm以下、相対動弾性係数85％以上等の基準を満足している（補完情報より）。\n\n・[塩害抑制]：塩水浸漬試験における塩化物イオン浸透深さは、ポリマーセメントモルタルでの約7mmに対して約5mmである（補完情報より）。",null,null,"・［凍害抑制］：NEXCO構造物施工管理要領「床版上面における断面修復の性能照査項目」に準じた試験を実施し、凍結融解抵抗性（相対動弾性係数）60％以上、負荷後の付着強度1.5N/mm2以上の基準を満足している（補完情報より）。\n\n・［その他］：NEXCO構造物施工管理要領「床版上面における断面修復の性能照査項目」に準じた試験を実施し、硬化時間30分以上、圧縮強度24N/m2以上（材齢4時間）、付着強度1.5N/mm2以上等の基準を満足している（補完情報より）。",null,null,"・［速硬性］：材齢6時間、養生温度5℃、湿潤面での付着強度は1.84N/m㎡、圧縮強度は44.2N/m㎡、曲げ強度は21.4N/m㎡であり、湿潤環境下での接着性を確認している（NETIS情報より）。\n・［その他］：材齢7日、養生温度5℃での圧縮強度は58.9N/m㎡であり、自社基準の50N/m㎡以上を満足している（NETIS情報より）。",null,null,"・［速硬性、その他］：NEXCO構造物施工管理要領「左官工法による断面修復の性能照査項目」に準じた試験を実施し、付着強度1.5N/mm2以上、収縮率0.05%以下、熱膨張率2.0×10＾-5/℃以下等の基準を満足している（速硬性であるため硬化時間は1時間以下）（補完情報より）。",null,null,"・［速硬性、その他］：NEXCO構造物施工管理要領「左官工法による断面修復の性能照査項目」に準じた試験を実施し、付着強度1.5N/mm2以上、収縮率0.05%以下、熱膨張率2.0×10＾-5/℃以下等の基準を満足している（速硬性であるため硬化時間は1時間以下）（補完情報より）。",null,null,"・圧縮強度は46.3N/mm2であり、自社基準の30N/mm2以上を満足している（NETIS情報、補完情報より）。\n・付着強度は1.8N/mm2であり、自社基準の1.5N/mm2以上を満足している（NETIS情報、補完情報より）。\n・塩化物イオン浸透性試験における塩化物イオンの見掛けの拡散係数は、従来の湿式吹付工法での1.82cm2/年に対して、0.118ｃｍ2/年である（補完情報より）。\n",null,null,"・腐食促進実験において、試験開始から1年後の内部鉄筋は、普通モルタルでは腐食有に対して、腐食がないことを確認している（補完情報より）。\n・電気泳動試験において、143時間後の塩素侵入量が通常モルタルの1/8であることを確認している（補完情報より）。\n・NEXCO構造物施工管理要領「左官工法による断面修復の性能照査項目」に準じた試験を実施し、硬化時間1時間以上、付着強度1.5N/mm2以上、収縮率0.05%以下、熱膨張率2.0×10＾-5/℃以下等の基準を満足している（補完情報より）。\n・凍結融解試験において、300サイクルで異常ないことを確認している（補完情報より）。",null,null,"・腐食促進実験において、試験開始から1年後の内部鉄筋は、普通モルタルでは腐食有に対して、腐食がないことを確認している（補完情報より）。\n・電気泳動試験において、143時間後の塩素侵入量が通常モルタルの1/8であることを確認している（補完情報より）。\n・NEXCO構造物施工管理要領「左官工法による断面修復の性能照査項目」に準じた試験を実施し、硬化時間1時間以上、付着強度1.5N/mm2以上、収縮率0.05%以下、熱膨張率2.0×10＾-5/℃以下等の基準を満足している（補完情報より）。\n・凍結融解試験において、300サイクルで異常ないことを確認している（補完情報より）。",null,null,"・[中性化抑制]：促進中性化試験（JIS A 1153)を実施し、土木学会コンクリートライブラリー119の基準である中性化深さ0～1.3ｍｍ/4週に対して、0ｍｍ/52週（自社試験）を確認（補完情報より）。\n・[塩害抑制]：塩化物イオンの見掛けの拡散係数試験（JIS-G572-2010）を実施し、0.046cm2/年（自社試験）を確認（補完情報より）。\n・［その他］：国土交通省告示第1372号に準じたJIS A 1172「ポリマーセメントモルタル試験方法」を実施し、圧縮強度20N/mm2以上、付着強度1.0N/mm2以上の基準を満足している（補完情報より）。\n・[凍害抑制]：凍結融解抵抗試験を実施し、土木学会コンクリートライブラリー119の相対弾性係数基準95～97％に対して、99％（自社試験）を確認（補完情報より）。",null,null,"・[中性化抑制]：促進中性化試験（JIS A 1153)を実施し、土木学会コンクリートライブラリー119の基準である中性化深さ0～1.3ｍｍ/4週に対して、0ｍｍ/52週（自社試験）を確認（補完情報より）。\n・[塩害抑制]：塩化物イオンの見掛けの拡散係数試験（JIS-G572-2010）を実施し、0.046cm2/年（自社試験）を確認（補完情報より）。\n・［その他］：国土交通省告示第1372号に準じたJIS A 1172「ポリマーセメントモルタル試験方法」を実施し、圧縮強度20N/mm2以上、付着強度1.0N/mm2以上の基準を満足している（補完情報より）。\n・[凍害抑制]：凍結融解抵抗試験を実施し、土木学会コンクリートライブラリー119の相対弾性係数基準95～97％に対して、99％（自社試験）を確認（補完情報より）。",null,null,"・圧縮強度は、72.1N/mm2であり、既設コンクリートの設計基準強度（21～30N/mm2）以上を満足している（補完情報より）。\n・付着強度は、2.41N/mm2であり、自社基準の1.5N/mm2以上を満足している（補完情報より）。\n・凍結融解抵抗性試験における相対動弾性係数は、100.2％であり、自社基準の80％以上を満足している（補完情報より）。\n・塩化物イオンの見掛けの拡散係数は、早強コンクリートの0.95cm2/年に対して、0.20cm2/年を確認している（補完情報より）。\n・塩化物イオンの吸着量は、2.4mg/g以上であり、自社基準の0.5mg/g以上を満足している（補完情報より）。",null,null,"・通水試験は、模擬的なひび割れを発生させた供試体において、経済的な通水量の変化を測定し、従来の通水量材齢28日で31％に対して、材齢28日で81％を確認し、自己治癒機能があることを確認している（補完情報より）。\n・硬化時間は始発：2時間02分，終結：6時間52分であり、国土交通省無収縮モルタルの規格値始発：1時間以上，終結：10時間以内を満足している（補完情報より）。\n・材齢28日での圧縮強度は73.2N/mm2であり、国土交通省無収縮モルタルの規格値44N/mm2以上を満足している（補完情報より）。",null,null,"・［塩害抑制］：実効拡散係数試験（JSCE-G 571）を実施し、塩化物イオンの実効拡散係数は、一般的なポリマーセメントモルタルの0.38ｃｍ2（コンクリートで0.73cm2/年）に対して、0.04cm2/年である（補完情報より）。\n・［その他］：NEXCO構造物施工管理要領「左官工法による断面修復の性能照査項目」に準じた試験を実施し、硬化時間、付着強度、収縮率、熱膨張率の基準を満足している（補完情報より）。",null,null,"・［防錆性・塩害抑制］：性能確認試験において、塩分濃度5、15kg/m3の鉄筋コンクリートを本製品で断面修復した供試体の自然電位が、塩分濃度5kg/m3においては貴（＋）化、15kg/m3においては補修後100日程度で-350ｍVを上回り、580日で-100ｍVを確認しており、鉄筋の腐食抑制を確認している（NETIS情報より）。\n・［その他］：NEXCO構造物施工管理要領「左官工法による断面修復の性能照査項目」に準じた試験を実施し、硬化時間1時間以上、付着強度1.5N/mm2以上、収縮率0.05％以下、熱膨張率2.0×10^-5/℃以下の基準を満足している（補完情報より）。",null,null,"・［中性化抑制、塩害抑制］：中性化速度係数は2.33ｍｍ/√週、塩化物イオンの見掛けの拡散係数は0.296㎠/年を確認しており、補修設計で定めた中性化速度係数及び塩化物イオン拡散係数と同等である（補完情報より）。\n・［凍害抑制］：NEXCO構造物施工管理要領「床版上面における断面修復の性能照査項目」に準じた試験を実施し、凍結融解抵抗性（相対動弾性係数）60％以上等の基準を満足している（補完情報より）。\n・［その他］：NEXCO構造物施工管理要領「床版上面における断面修復の性能照査項目」に準じた試験を実施し、硬化時間30分以上、圧縮強度24N/m2以上、付着強度1.5N/mm2等の基準を満足している（補完情報より）。\n・[耐摩耗性]：テーバー式摩耗試験(JIS K 7204)に準じた耐摩耗性試験を実施し、市販の断面修復材及びW/C＝40％のﾓﾙﾀﾙよりも摩耗量が少ないことを確認している（補完情報より）。",null,null,"・従来は大断面や暴露面において水和熱や乾燥収縮によるひび割れの発生により、遮塩性、凍結融解抵抗性が低下するという課題があったが、本技術の活用により、水和熱や乾燥収縮によるひび割れが抑制され、遮塩性や凍結融解抵抗性に優れるため品質の向上が図れる（補完情報より）。",null,null,"・道路橋床版防水便覧（平成19年3月）試験方法 6.引張接着試験に準拠して接着強度を実施した結果、基準強度0.6N/mm2以上に対して0.95N/mm2であり、基準を満足していることを確認（補完情報より）。\n・防水層に対する塗膜厚みばらつき抑制性試験を実施した結果、塗膜厚みのばらつきが従来技術4.3mmに対して2.3mmであり、ばらつき減少率は46.5％となり防水層の膜厚ばらつきが低下したことを確認（補完情報より）。\n・HI-SPECシールLを塗布したコンクリート床版の疲労耐久性試験を実施した結果、従来技術の疲労寿命485,002回に対し、686,751回であり疲労寿命が41.59%向上することを確認（補完情報より）。",null,null,"・道路橋床版防水便覧（平成19年3月）試験方法 6.引張接着試験に準拠して接着強度を実施した結果、基準強度0.6N/mm2以上に対して0.95N/mm2であり、基準を満足していることを確認（補完情報より）。\n・防水層に対する塗膜厚みばらつき抑制性試験を実施した結果、塗膜厚みのばらつきが従来技術4.3mmに対して2.3mmであり、ばらつき減少率は46.5％となり防水層の膜厚ばらつきが低下したことを確認（補完情報より）。\n・HI-SPECシールLを塗布したコンクリート床版の疲労耐久性試験を実施した結果、従来技術の疲労寿命485,002回に対し、686,751回であり疲労寿命が41.59%向上することを確認（補完情報より）。",null,null,"・NEXCO構造物施工管理要領「左官工法による断面修復の性能照査項目」に準じた試験を実施し、硬化時間1時間以上、付着強度1.5N/mm2以上、収縮率0.05%以下、熱膨張率2.0×10＾-5/℃以下等の基準を満足している（補完情報より）。\n・凍結融解抵抗性試験において、300サイクルで異常ないことを確認している（補完情報より）。",null,null,"・NEXCO構造物施工管理要領「左官工法による断面修復の性能照査項目」に準じた試験を実施し、硬化時間1時間以上、付着強度1.5N/mm2以上、収縮率0.05%以下、熱膨張率2.0×10＾-5/℃以下等の基準を満足している（補完情報より）。\n・凍結融解抵抗性試験において、300サイクルで異常ないことを確認している（補完情報より）。",null,null,"・国土交通省告示第1372号2項に準じた試験を実施し、（JIS K7181）圧縮強さ20.0N/mm2以上、（JIS K5600-5-7ブルオフ法モルタル）付着強度1.0N/mm2以上、（JIS A1106）曲げ強さ試験、圧縮強度20N/mm2以上、付着強度1.0N/mm2以上の基準を満足している（補完情報より）。",null,null,"・中性化抵抗性：中性化速度係数平均値2.0mm/√週であり、補修設計で定めた中性化速度係数と同等であることを確認（補完情報より）。\n・凍結融解抵抗性：相対動弾性係数平均値109％、負荷後の付着強度平均値2.7N/ｍｍ2であり、負荷後の相対動弾性係数が60％以上かつ負荷後のコンクリートと断面修復材との付着強度が1.5Ｎ／ｍｍ2以上であることを確認（補完情報より）。\n・遮塩性：拡散係数1.93ｃｍ2/年であり、補修設計で定めた塩化物イオンの拡散係数と同等であることを確認（補完情報より）。",null,null,"-",null,null,"-",null,null,"・NEXCO構造物施工管理要領｢吹付工法による断面修復の性能照査項目｣に準じた試験を実施し、付着強度1.5N/mm2以上、収縮率0.05％以下、熱膨張率2.0×10＾-5/℃以下の基準を満足している（補完情報より）。\n・高圧で吹付けられたモルタルは緻密な硬化体となり、劣化因子である水や二酸化炭素、塩化物イオン等の侵入阻止性に優れ、補修後の耐久性が向上する（補完情報より）。",null,null,"・NEXCO構造物施工管理要領｢吹付工法による断面修復の性能照査項目｣に準じた試験を実施し、付着強度1.5N/mm2以上、収縮率0.05％以下、熱膨張率2.0×10＾-5/℃以下の基準を満足している（補完情報より）。\n・高圧で吹付けられたモルタルは緻密な硬化体となり、劣化因子である水や二酸化炭素、塩化物イオン等の侵入阻止性に優れ、補修後の耐久性が向上する（補完情報より）。",null,null,"・耐摩耗性：水砂噴流摩耗試験を実施し、標準供試体に対する平均摩耗深さの比が1.5以下に対して0.91であり、構造物の補修サイクルを延長することができる（補完情報より）。",null,null,"／",null,null,"／",null,null,"／",null,null,"／"]
[null,"㉒","施工性\n(留意事項含む）",null,null,"・水中施工部には適用できない（NETIS情報より）。\n・コンクリート中の塩分吸着が可能な為、鉄筋の全面露出が不要。はつり量および断面修復厚さが減少する（NETIS情報より）。",null,null,"・水中施工部には適用できない（NETIS情報より）。\n・コンクリート中の塩分吸着が可能な為、鉄筋の全面露出が不要。はつり量および断面修復厚さが減少する（NETIS情報より）。",null,null,"・水中施工部には適用できない（NETIS情報より）。\n・コンクリート中の塩分吸着が可能な為、鉄筋の全面露出が不要。はつり量および断面修復厚さが減少する（NETIS情報より）。",null,null,"・水中には適用できない（NETIS情報より）。\n・プライマー工が無いため施工日数が短縮する（NETIS情報より）。",null,null,"・水中には適用できない（NETIS情報より）。\n・プライマー工が無いため施工日数が短縮する（NETIS情報より）。",null,null,"・常時濡れている場所での施工は不可（NETIS情報より）。\n・コテ離れが良く、コテ仕上げ性に優れる（NETIS情報より）。",null,null,"・常時濡れている場所での施工は不可（NETIS情報より）。\n・コテ離れが良く、コテ仕上げ性に優れる（NETIS情報より）。",null,null,"・降雨、降雪時は施工不可（NETIS情報より）。\n・配合分量が予めセット（ポットホール用ゴムラテパウダー1袋25kgに対してゴムラテ混和液1パック3kg）になっているため、現場での計量が不要であり緊急の工事に適する（補完情報より）。",null,null,"・降雨、降雪時は施工不可（NETIS情報より）。",null,null,"・降雨、降雪時は施工不可（NETIS情報より）。",null,null,"・表面が乾燥していないコンクリート構造物は適用不可（NETIS情報より）。",null,null,"・表面が乾燥していないコンクリート構造物は適用不可（NETIS情報より）。\n・1層あたり100mm以上の厚付けが可能（NETIS情報より）。\n・100mまでの長距離圧送が可能（補完情報より）。",null,null,"・施工方法は乾式吹付工法のみである（NETIS情報より）。\n・サイロシステムを使用することにより、資機材の小運搬ならびに移動が少なかった（評価情報より）。\n・吹付け方向が下向きになる範囲、幅や高さが概ね1.2mを切るような狭い箇所には適用できない（評価情報より）。\n・水平方向で 300m、垂直方向で 150m の長距離搬送により、広範囲の施工が可能で、プラントの配置換えも少なくて済む（補完情報より）。",null,null,"・事前調査を行い、ひび割れ処理、湧き水箇所の止水処理の遮断が必要。ただし流出の恐れが無い雨水程度であれば施工可能（NETIS情報、補完情報より）。\n",null,null,"・雨天時もしくは雨天が予想される場合は施工不可（NETIS情報より）。\n・繊維補強超速硬ポリマーセメントモル タルまたは繊維補強超速硬コンクリートに変えたことにより、流動性、コンシステンシーなどのフレッシュ性状が改善し、鉄筋裏に回りやすくなり、施工精度の向上が図られる。（NETIS情報より）。",null,null,"・大雨や強風などの悪天候時には作業を行わないこと（NETIS情報より）。\n・湿潤環境下でも接着性が良く、短時間で急速硬化・高強度が発現するため、施工性の向上が図られる（NETIS情報より）。",null,null,"・施工時に降雨等による 雨がかり、水がかりがないこと（NETIS情報より）。\n・結合材を、アルミナセメントを含む数種類の結合材に変更したことにより、材齢3時間における圧縮強度は5～20N/mm2を発現し、施工現場を早期開放することが可能となり、交通環境等への影響を抑制できる（NETIS情報より）。\n・U-リペアライトEXと比較して、U-リペアパッチEXは28日圧縮強度が高い（NETIS情報より）。",null,null,"・施工時に降雨等による 雨がかり、水がかりがないこと（NETIS情報より）。\n・結合材を、アルミナセメントを含む数種類の結合材に変更したことにより、材齢3時間における圧縮強度は5～20N/mm2を発現し、施工現場を早期開放することが可能となり、交通環境等への影響を抑制できる（NETIS情報より）。\n・U-リペアパッチEXと比較して、U-リペアライトEXはモルタル比重が軽く、厚付け性が良い（NETIS情報より）。",null,null,"・最適設計したプレミックス材料、特殊専用ノズル、高度化した圧送装置の組み合わせにより、乾式工法の欠点であった施工時の粉塵やリバウンド発生を湿式工法と同程度まで抑制し、乾式のメリットである1層あたりの最大施工厚さ200mm、最大圧送距離300mを可能とした（NETIS情報より）。・プラント設置の際は風雨対策としてテントを設けることが望ましい（NETIS情報より）。・夏季、冬季における施工、養生に関しては一般的なコンクリート打設時と同様に対処すること（NETIS情報より）。",null,null,"・施工中に海水や雨水が掛からないこと。粉体の使用の有効期間は購入より6か月を限度とする（NETIS情報より）。\n・コンクリートはつり後の鉄筋ケレンは３種ケレンで対応可能（NETIS情報より）。",null,null,"・施工中に海水や雨水が掛からないこと。粉体の使用の有効期間は購入より6か月を限度とする（NETIS情報より）。\n・コンクリートはつり後の鉄筋ケレンは３種ケレンで対応可能（NETIS情報より）。",null,null,"・モルタルの練上り温度が5～35℃に なるよう、練混ぜ水の温度を調整する。（NETIS情報より）。\n・水中での施工、漏水箇所での施工は不可（NETIS情報より）。",null,null,"・モルタルの練上り温度が5～35℃に なるよう、練混ぜ水の温度を調整する。（NETIS情報より）。\n・水中での施工、漏水箇所での施工は不可（NETIS情報より）。",null,null,"・雨天時の施工は、施工面及び施工箇所に雨がかからないように、シートや仮囲い等で養生を行う（NETIS情報より）。\n・本技術により、残存塩分があっても無害化が可能となり、さらなる耐久性能の向上が期待できる（NETIS情報より）。\n・塩分吸着剤を混合したことにより、塩分を含んだ既設コンクリートのはつり量を低減できるため、周辺環境への影響の低減が図れる（補完情報より）。\n・マテリアルホースの最少ホース長さは40m以上を確保する（NETIS情報より）。",null,null,"・水中コンクリートには適用できない（NETIS情報より）。\n・充填後は急激な乾燥が無い様に養生する（NETIS情報より）。\n・外気温が5℃以下になる場合は、表面にヘアクラックが生じる恐れがあるため、保温養生を行うこと（補完情報より）。",null,null,"・水中や漏水箇所での施工が必要な補修工事では施工不可（NETIS情報より）。・1層あたり壁面で最大40mm、天井面で20mm程度の施工厚付けが可能である（補完情報より）。・降雨による施工箇所への雨がかりがある場合は施工不可（補完情報より）。・最大施工厚40ｍｍが可能な条件は、施工時の気温が20℃の環境下における壁面のパッチ補修（0.5ｍ角程度のハツリ面、混練水量2.6ℓ/袋）を基準としている。適用については、現場条件により適宜検討すること（補完情報・WGからのコメント）。",null,null,"・劣化コンクリートのはつり深さを鉄筋断面の半分程度に低減することができるため、省力化、工期の短縮及びコンクリートがらの発生量の低減が期待できる（NETIS情報より）。",null,null,"・はつり深さが30mm以上50mm未満の場合には、13mm骨材を使用し、50mm以上の場合は通常は20mm骨材を使用するが、必要に応じて50mm以上でも13mm骨材を使用することが可能（NETIS情報より）。\n・練混ぜに使用するミキサは、コンクリート練混ぜ用のミキサを使用すること。また、一軸強制練りミキサ、二軸強制練りミキサ、傾動ミキサ等を使用することができる（NETIS情報より）。",null,null,"・施工前にモルタルの接地面（躯体コンクリートの表面）は目荒らしを行い、レイタンスなど脆弱部の除去および清掃したのち、吸水処置を行うこと（NETIS情報より）。\n・施工後は直射、風などを避け、型枠又は湿潤状態で最低３日以上養生すること（NETIS情報より）。\n・継続的に露出される箇所には、塗布型収縮低減材の塗布など適切な乾燥対策を講じること（NETIS情報より）。",null,null,"・低温時において、乾燥が遅い場合にはブロワー・送風機・ジェットヒーターなどを用いて乾燥促進する（NETIS・補完情報より）。\n・高温時（施工時の気温が25℃を超または床版温度が50℃以上）は以下のような急結防止対策を行う（NETIS・補完情報より）。\n【急結防止対策】\n・材料混合前まで、直射日光に当てず、外気温10～25℃程度の環境下（クーラーが効いた室内等）で保管する（NETIS・補完情報より）。\n・HI-SPECシールL・P混合攪拌時に、冷水を重量比で5～10%添加する（NETIS・補完情報より）。",null,null,"・低温時において、乾燥が遅い場合にはブロワー・送風機・ジェットヒーターなどを用いて乾燥促進する（NETIS・補完情報より）。\n・高温時（施工時の気温が25℃を超または床版温度が50℃以上）は以下のような急結防止対策を行う（NETIS・補完情報より）。\n【急結防止対策】\n・材料混合前まで、直射日光に当てず、外気温10～25℃程度の環境下（クーラーが効いた室内等）で保管する（NETIS・補完情報より）。\n・HI-SPECシールL・P混合攪拌時に、冷水を重量比で5～10%添加する（NETIS・補完情報より）。",null,null,"・「リプロモルタルAZ」の混練時は、規定の水量を遵守すること（NETIS・補完情報より）。\n・「リプロクイック」は、あらかじめ用意した水に分散させること（NETIS・補完情報より）。\n・混練は3分以上行うこと（NETIS・補完情報より）。\n・ミキサーの羽根にはアルミ製のものを使用しないこと（NETIS・補完情報より）。\n・リプロクイック工法の凝結時間は添加量および外気温によって変化するため、事前に確認すること（補完情報より）。",null,null,"・「リプロモルタルAZ」の混練時は、規定の水量を遵守すること（NETIS・補完情報より）。\n・「リプロクイック」は、あらかじめ用意した水に分散させること（NETIS・補完情報より）。\n・混練は3分以上行うこと（NETIS・補完情報より）。\n・ミキサーの羽根にはアルミ製のものを使用しないこと（NETIS・補完情報より）。\n・リプロクイック工法の凝結時間は添加量および外気温によって変化するため、事前に確認すること（補完情報より）。",null,null,"・従来技術と比較して、断面修復材の粒子を100nm以下の微粒子に改良することにより、被塗面との付着性が向上し、防錆処理などが不要となり、作業工程が短縮する（補完情報より）。\n・主剤と硬化剤は使用前によく撹拌し、必ず重量比5:2で配合すること。バランスの悪い配合は硬化不良や密着不良の原因となる（補完情報より）。\n・上塗りは、塗布後 12 時間以上経過して行うこと（補完情報より）。",null,null,"・付属の専用遅延剤を環境温度に応じて添加することで作業時間を確保することが可能。また、専用遅延剤は予め練り水に溶解すること。後から添加した場合、従来の効果は発揮しない（補完情報より）。\n・養生は、打設後2時間以上行うこと。低温環境下では打設後、保温養生を行うこと（補完情報より）。",null,null,"・付属の専用遅延剤を環境温度に応じて添加することで作業時間を確保することが可能。また、専用遅延剤は予め練り水に溶解すること。後から添加した場合、従来の効果は発揮しない（補完情報より）。\n・養生は、打設後2時間以上行うこと。低温環境下では打設後、保温養生を行うこと（補完情報より）。",null,null,"・付属の専用遅延剤を環境温度に応じて添加することで作業時間を確保することが可能。また、専用遅延剤は予め練り水に溶解すること。後から添加した場合、従来の効果は発揮しない（補完情報より）。\n・養生は、打設後2時間以上行うこと。低温環境下では打設後、保温養生を行うこと（補完情報より）。",null,null,"・エアショットワン吹付時は材料のリバウンドや粉塵が発生するので、周囲に飛散しない様に適切な養生を行う。また必要に応じて送風機等の設置も行う（NETIS情報より）。\n・エアショットワンの吹付箇所は、コンクリート躯体はつり除去後に断面修復形状が分かる様に部分型枠や水糸の設置を行う（NETIS情報より）。\n・水ポンプおよび水ホース内部の水が凍結するとポンプが破損するため、施工終了後は水ポンプおよび水ホース内部の水を全て排出する（NETIS情報より）。\n・１層の吹付厚さが大きくなり、特に上向き(天井面)施工における施工能力が大幅に向上する（補完情報より）。",null,null,"・一般の左官工法専用材料と同様に使用でき、材料の練り混ぜも、ハンドミキサーやパン型ミキサー等で問題なく練り混ぜ可能である（補完情報より）。",null,null,"・鉄筋が発錆している場合は錆を落とし、必要に応じて適切な防錆処理を行うこと（NETIS情報より）。",null,null,"補完調査、WGでの検討は未実施",null,null,"補完調査、WGでの検討は未実施",null,null,"補完調査、WGでの検討は未実施",null,null,"補完調査、WGでの検討は未実施"]
[null,"㉓","その他（留意事項含む）",null,null,"・表面保護材は通気性を有すると同時に耐候性に優れた無機質のシリカ系材料（⑳備考を参照）を使用する（評価情報より）。",null,null,"・表面保護材は通気性を有すると同時に耐候性に優れた無機質のシリカ系材料（⑳備考を参照）を使用する（評価情報より）。",null,null,"・表面保護材は通気性を有すると同時に耐候性に優れた無機質のシリカ系材料（⑳備考を参照）を使用する（評価情報より）。",null,null,"・高炉スラグを配合してセメント使用量を少なくしたため、セメント製造にかかる二酸化炭素排出量の削減に寄与している（NETIS情報より）。\n・塩化物イオンの実効拡散係数試験（JSCEG571）の試験結果は民間委託によるものである（補完情報より）。",null,null,"・高炉スラグを配合してセメント使用量を少なくしたため、セメント製造にかかる二酸化炭素排出量の削減に寄与している（NETIS情報より）。\n・NEXCO構造物施工管理要領に準拠した試験結果は左官工法でのものである。\n・塩化物イオンの実効拡散係数試験（JSCEG571）の試験結果は民間委託によるものである（補完情報より）。",null,null,"・NEXCO構造物施工管理要領に準じた試験以外（促進中性化試験等）の試験結果は、自社試験によるものである（補完情報より）。",null,null,"・NEXCO構造物施工管理要領に準じた試験以外（促進中性化試験等）の試験結果は、自社試験によるものである（補完情報より）。",null,null,"-",null,null,"-",null,null,"-",null,null,"・NETISでは中性化抑制に効果があると記載されているが、中性化に関する試験結果がないため、採用に当たっては過去の実証結果、開発者の意見等を勘案して要検討（補完情報より）。\n・試験結果は自社試験によるものである（補完情報より）。",null,null,"・NETISでは中性化抑制に効果があると記載されているが、中性化に関する試験結果がないため、採用に当たっては過去の実証結果、開発者の意見等を勘案して要検討（補完情報より）。\n・試験結果は自社試験によるものである（補完情報より）。",null,null,"・材料は吹付けの際にリバウンド材が発生するため増加した（評価情報より）。\n・九州地方（国土交通省）での活用実績はない（補完情報より）。",null,null,"・九州地方（国土交通省）での活用実績はない（評価情報より）。・NETISでは本技術は「高品質モルタル（LCモルタル）・ユニット鉄筋と専用固定スペーサーを用いた補修・補強技術」とされているが、補強が不要である場合は、鉄筋工を含まないLCモルタルのみによる断面修復工となる（補完情報より）。・試験結果は公的機関によるものである（補完情報より）。",null,null,"・九州地方（国土交通省）での活用実績はない（評価情報より）。\n・試験結果は公的機関によるものである（補完情報より）。",null,null,"・九州地方（国土交通省）での活用実績はない（評価情報より）。\n・試験結果は自社試験によるものである（補完情報より）。",null,null,"・試験結果は、公的機関によるものであるが証明書等は提出されていない（補完情報より）。",null,null,"・試験結果は、公的機関によるものであるが証明書等は提出されていない（補完情報より）。",null,null,"・試験結果は、公的機関によるものであるが証明書等は提出されていない（補完情報より）。\n・九州地方（国土交通省）での活用実績はない（補完情報より）。",null,null,"・九州地方（国土交通省）での活用実績はない（補完情報より）。\n・試験結果は公的機関または民間委託によるものである（補完情報より）。",null,null,"・九州地方（国土交通省）での活用実績はない（補完情報より）。\n・試験結果は公的機関または民間委託によるものである（補完情報より）。",null,null,"・九州地方（国土交通省）での活用実績はない（補完情報より）。\n・施工厚さが100mm程度の厚塗りが可能な技術であり、施工面積当たりの塗布層の減少（1層の施工厚さ：最大50mm（壁面の場合））及び施工量の増加により、工程が短縮できる（WGからのコメント）。",null,null,"・九州地方（国土交通省）での活用実績はない（補完情報より）。\n・施工厚さが100mm程度の厚塗りが可能な技術であり、施工面積当たりの塗布層の減少（1層の施工厚さ：最大50mm（壁面の場合））及び施工量の増加により、工程が短縮できる（WGからのコメント）。",null,null,"・九州地方（国土交通省）での活用実績はない（補完情報より）。\n・弾性係数、収縮率、熱膨張率、促進中性化、塩化物イオンの見掛けの拡散係数試験、凍結融解試験の値は、塩分吸着材混合前の値である（補完情報より）。",null,null,"・九州地方（国土交通省）での活用実績はない（評価情報より）。・試験結果は、圧縮強度試験のみが公的機関、その他は自社試験によるものであるが証明書等は提出されていない（補完情報より）。・開発者は、乾燥収縮、拘束ひび割れ等の自己治癒機能による閉塞が可能なことより中性化抑制効果があるとしているが、実証試験等の提出はされていないため、採用にあたっては過去の結果、開発者の意見等を勘案して要検討（WGからのコメント）。",null,null,"・九州地方（国土交通省）での活用実績はない（評価情報より）。・補修材料の配合は、施工方法、施工条件により混練水量の調整が必要となるため、現場条件に応じ適宜検討が必要である（補完情報より）。・NEXCO構造物施工管理要領に準拠した試験結果は、左官工法によるものである（補完情報より）。・塩化物イオンの実効拡散係数試験（JSCEG571）の試験結果は民間委託によるものである（補完情報より）。・その他の試験は公的機関による（補完情報より）。",null,null,"・九州地方（国土交通省）での活用実績はない（補完情報より）。・試験結果は自社試験によるもの（補完情報より）。・亜硝酸リチウムを含有した断面修復材であり、開発者は中性化抑制の効果があるとしているが、実証実験等の提出はされていないため、採用にあたっては過去の結果、開発者の意見等を勘案して要検討（WGからのコメント）。",null,null,"・九州地方（国土交通省）での活用実績はない（補完情報より）。\n・試験結果は公的機関と自社試験によるものである（補完情報より）。",null,null,"・九州地方（国土交通省）での活用実績はない（評価情報より）。\n・試験結果は、公的機関と自社試験によるものである（補完情報より）。",null,null,"・九州地方（国土交通省）での活用実績はない（評価情報より）。\n・HI-SPECシール工法は、コンクリート舗装とアスファルト舗装の仕様に応じて適用タイプが異なる。コンクリート舗装には、CPタイプとCPタイプ厚塗り仕様が適用可能。アスファルト舗装には、KSタイプと不陸が軽微な場合に適用可能なLTタイプが適用可能となる。なお、いずれのタイプも適用時は必ずアイゾールテクニカに相談すること（補完情報より）。",null,null,"・九州地方（国土交通省）での活用実績はない（評価情報より）。\n・HI-SPECシール工法は、コンクリート舗装とアスファルト舗装の仕様に応じて適用タイプが異なる。コンクリート舗装には、CPタイプとCPタイプ厚塗り仕様が適用可能。アスファルト舗装には、KSタイプと不陸が軽微な場合に適用可能なLTタイプが適用可能となる。なお、いずれのタイプも適用時は必ずアイゾールテクニカに相談すること（補完情報より）。",null,null,"・九州地方（国土交通省）での活用実績はない（補完情報より）。\n・試験結果は、公的機関によるものである（補完情報より）。",null,null,"・九州地方（国土交通省）での活用実績はない（補完情報より）。\n・試験結果は、公的機関によるものである（補完情報より）。",null,null,"・九州地方（国土交通省）での活用実績はない（評価情報より）。\n・試験結果は、公的機関と自社試験によるものである（補完情報より）。\n・該当技術は、コンクリート構造物の欠損部を補修・補強する技術である（NETIS情報より）。",null,null,"・九州地方（国土交通省）での活用実績はない（評価情報より）。\n・試験結果は、フローと圧縮強度の一部については、自社試験でその他は公的機関によるものである（補完情報より）。\n・荷姿は20kg/袋で用途に応じて、通常タイプ、低弾性・無収縮タイプ、２時間開放・無収縮タイプの選択が可能（NETIS情報より）。\n・アルミ製の撹拌羽根・練り容器は、異常膨張の原因となるため使用しないこと（NETIS・補完情報より）。\n・超速硬セメントを用いたプレミックスモルタルに替えたことにより、ブリーディングがなく打設面が沈下しないため、品質の向上が図られる（NETIS情報より）。",null,null,"・九州地方（国土交通省）での活用実績はない（評価情報より）。\n・試験結果は、フローと圧縮強度の一部については、自社試験でその他は公的機関によるものである（補完情報より）。\n・荷姿は20kg/袋で用途に応じて、通常タイプ、低弾性・無収縮タイプ、２時間開放・無収縮タイプの選択が可能（NETIS情報より）。\n・アルミ製の撹拌羽根・練り容器は、異常膨張の原因となるため使用しないこと（NETIS・補完情報より）。\n・超速硬セメントを用いたプレミックスモルタルに替えたことにより、ブリーディングがなく打設面が沈下しないため、品質の向上が図られる（NETIS情報より）。",null,null,"・九州地方（国土交通省）での活用実績はない（評価情報より）。\n・試験結果は、フローと圧縮強度の一部については、自社試験でその他は公的機関によるものである（補完情報より）。\n・荷姿は20kg/袋で用途に応じて、通常タイプ、低弾性・無収縮タイプ、２時間開放・無収縮タイプの選択が可能（NETIS情報より）。\n・アルミ製の撹拌羽根・練り容器は、異常膨張の原因となるため使用しないこと（NETIS・補完情報より）。\n・超速硬セメントを用いたプレミックスモルタルに替えたことにより、ブリーディングがなく打設面が沈下しないため、品質の向上が図られる（NETIS情報より）。",null,null,"・九州地方（国土交通省）での活用実績はない（評価情報より）。\n・試験結果は、公的機関と自社試験によるものである（補完情報より）。",null,null,"・九州地方（国土交通省）での活用実績はない（評価情報より）。\n・試験結果は、公的機関と自社試験によるものである（補完情報より）。",null,null,"・九州地方（国土交通省）での活用実績はない（評価情報より）。\n・試験結果は公的機関と自社試験によるものである（補完情報より）。",null,null,"／",null,null,"／",null,null,"／",null,null,"／"]
["注1）施工費用：2025年4月福岡県久留米市　注2）「土木学会コンクリートライブラリー119　表面保護工法　設計施工指針（案）［工種別マニュアル編］、p199、解説表2.3.1.1　セメントモルタルの性能例、p202、解説表2.3.2.1　ポリマーセメントモルタルの性能例」　注3）／：補完調査未実施"]
[]
[]
[]
[]
[null,null,null,"施工する方向",null,{"$f":"G30","v":"新技術"},null,null,{"$f":"J30","v":"新技術"},null,null,{"$f":"M30","v":"新技術"},null,null,{"$f":"P30","v":"新技術"},null,null,{"$f":"S30","v":"新技術"},null,null,{"$f":"V30","v":"新技術"},null,null,{"$f":"Y30","v":"新技術"},null,null,{"$f":"AB30","v":"新技術"},null,null,{"$f":"AE30","v":"新技術"},null,null,{"$f":"AH30","v":"新技術"},null,null,{"$f":"AK30","v":"新技術"},null,null,{"$f":"AN30","v":"新技術"},null,null,{"$f":"AQ30","v":"新技術"},null,null,{"$f":"AT30","v":"新技術"},null,null,{"$f":"AW30","v":"新技術"},null,null,{"$f":"AZ30","v":"新技術"},null,null,{"$f":"BC30","v":"新技術"},null,null,{"$f":"BF30","v":"新技術"},null,null,{"$f":"BI30","v":"新技術"},null,null,{"$f":"BL30","v":"新技術"},null,null,{"$f":"BO30","v":"新技術"},null,null,{"$f":"BR30","v":"新技術"},null,null,{"$f":"BU30","v":"新技術"},null,null,{"$f":"BX30","v":"新技術"},null,null,{"$f":"CA30","v":"新技術"},null,null,{"$f":"CD30","v":"新技術"},null,null,{"$f":"CG30","v":"新技術"},null,null,{"$f":"CJ30","v":"新技術"},null,null,{"$f":"CM30","v":"新技術"},null,null,{"$f":"CP30","v":"新技術"},null,null,{"$f":"CS30","v":"新技術"},null,null,{"$f":"CV30","v":"新技術"},null,null,{"$f":"CY30","v":"新技術"},null,null,{"$f":"DB30","v":"新技術"},null,null,{"$f":"DE30","v":"新技術"},null,null,{"$f":"DH30","v":"新技術"},null,null,{"$f":"DK30","v":"新技術"},null,null,{"$f":"DN30","v":"新技術"},null,null,{"$f":"DQ30","v":"新技術"},null,null,{"$f":"DT30","v":"新技術"},null,null,{"$f":"DW30","v":"新技術"},null,null,{"$f":"DZ30","v":"新技術"},null,null,{"$f":"EC30","v":"新技術"},null,null,{"$f":"EF30","v":"新技術"}]
[null,"⑪","施工費用　注1）","上向き施工","断面修復厚（ｍｍ）",{"$f":"G31","v":50},null,null,50,null,null,50,null,null,30,null,null,30,null,null,30,null,null,30,null,null,"-",null,null,"-",null,null,"-",null,null,10,null,null,50,null,null,50,null,null,10,null,null,"-",null,null,"未回答",null,null,50,null,null,50,null,null,"60～100mm",null,null,"-",null,null,"-",null,null,100,null,null,100,null,null,50,null,null,"-",null,null,50,null,null,65,null,null,"-",null,null,"-",null,null,"-",null,null,"-",null,null,50,null,null,50,null,null,25,null,null,"-",null,null,"-",null,null,"-",null,null,50,null,null,50,null,null,10,null,null,"／",null,null,"／",null,null,"／",null,null,"／"]
[null,null,null,null,"施工費",1880580,null,null,2235729,null,null,1018740,null,null,3629660,null,null,3465716,null,null,2558710,null,null,2558710,null,null,"-",null,null,"-",null,null,"-",null,null,2927000,null,null,1657000,null,null,1606027,null,null,3324255,null,null,"-",null,null,"未回答",null,null,2535684,null,null,2535684,null,null,1514698,null,null,"-",null,null,"-",null,null,1405000,null,null,889600,null,null,1606107,null,null,"-",null,null,3296389,null,null,3137069,null,null,"-",null,null,2535684,null,null,"-",null,null,"-",null,null,1619885,null,null,325930,null,null,168488,null,null,"-",null,null,"-",null,null,"-",null,null,1523666,null,null,3082921,null,null,2264584,null,null,"／",null,null,"／",null,null,"／",null,null,"／"]
[null,null,null,null,"材料費",678100,null,null,801391,null,null,822760,null,null,639000,null,null,665625,null,null,636020,null,null,794116,null,null,"-",null,null,"-",null,null,"-",null,null,27857,null,null,27857,null,null,1051973,null,null,563745,null,null,"-",null,null,"未回答",null,null,702336,null,null,698088,null,null,815660,null,null,500000,null,null,500000,null,null,459000,null,null,500000,null,null,1240493,null,null,"-",null,null,819672,null,null,980896,null,null,"-",null,null,560500,null,null,"-",null,null,"-",null,null,645750,null,null,652500,null,null,1714286,null,null,"-",null,null,"-",null,null,"-",null,null,763590,null,null,636902,null,null,805932,null,null,"／",null,null,"／",null,null,"／",null,null,"／"]
[null,null,null,null,"合計",2558680,null,null,3037120,null,null,1841500,null,null,4268660,null,null,4131341,null,null,3194730,null,null,3352826,null,null,"-",null,null,"-",null,null,"-",null,null,2954857,null,null,1684857,null,null,2658000,null,null,3888000,null,null,"-",null,null,"未回答",null,null,3238020,null,null,3233772,null,null,2330358,null,null,"-",null,null,"-",null,null,1864000,null,null,1389600,null,null,2846600,null,null,"-",null,null,4116061,null,null,4117965,null,null,"-",null,null,3096184,null,null,"-",null,null,"-",null,null,2265635,null,null,978430,null,null,1882774,null,null,"-",null,null,"-",null,null,"-",null,null,2287256,null,null,3719823,null,null,3070516,null,null,"／",null,null,"／",null,null,"／",null,null,"／"]
[null,null,null,"横向き施工","断面修復厚",50,null,null,50,null,null,50,null,null,30,null,null,30,null,null,30,null,null,30,null,null,"-",null,null,"-",null,null,"-",null,null,20,null,null,100,null,null,50,null,null,10,null,null,"-",null,null,"未回答",null,null,50,null,null,50,null,null,"60～100mm",null,null,"-",null,null,"-",null,null,100,null,null,100,null,null,50,null,null,"-",null,null,50,null,null,65,null,null,"-",null,null,"-",null,null,"-",null,null,"-",null,null,50,null,null,50,null,null,25,null,null,"-",null,null,"-",null,null,"-",null,null,50,null,null,50,null,null,10,null,null,"／",null,null,"／",null,null,"／",null,null,"／"]
[null,null,null,null,"施工費",1675520,null,null,1610209,null,null,1013520,null,null,2600950,null,null,2882554,null,null,2132258,null,null,2132258,null,null,"-",null,null,"-",null,null,"-",null,null,2675000,null,null,1657000,null,null,1271475,null,null,2442255,null,null,"-",null,null,"未回答",null,null,2535684,null,null,2535684,null,null,1423844,null,null,"-",null,null,"-",null,null,1080900,null,null,684300,null,null,1271635,null,null,2893609,null,null,2535684,null,null,3137069,null,null,"-",null,null,2535684,null,null,"-",null,null,"-",null,null,1619885,null,null,325930,null,null,168488,null,null,"-",null,null,"-",null,null,"-",null,null,1216516,null,null,2487450,null,null,2013268,null,null,"／",null,null,"／",null,null,"／",null,null,"／"]
[null,null,null,null,"材料費",678100,null,null,801391,null,null,822760,null,null,628350,null,null,639000,null,null,636020,null,null,794116,null,null,"-",null,null,"-",null,null,"-",null,null,27857,null,null,27857,null,null,995725,null,null,563745,null,null,"-",null,null,"未回答",null,null,702336,null,null,698088,null,null,776204,null,null,500000,null,null,500000,null,null,439000,null,null,478000,null,null,1174165,null,null,309375,null,null,786352,null,null,980896,null,null,"-",null,null,560500,null,null,"-",null,null,"-",null,null,645750,null,null,652500,null,null,1714286,null,null,"-",null,null,"-",null,null,"-",null,null,662240,null,null,586227,null,null,805932,null,null,"／",null,null,"／",null,null,"／",null,null,"／"]
[null,null,null,null,"合計",2353620,null,null,2411600,null,null,1836280,null,null,3229300,null,null,3521554,null,null,2768278,null,null,2926374,null,null,"-",null,null,"-",null,null,"-",null,null,2702857,null,null,1684857,null,null,2267200,null,null,3006000,null,null,"-",null,null,"未回答",null,null,3238020,null,null,3233772,null,null,2200048,null,null,"-",null,null,"-",null,null,1519900,null,null,1162300,null,null,2445800,null,null,3202984,null,null,3322036,null,null,4117965,null,null,"-",null,null,3096184,null,null,"-",null,null,"-",null,null,2265635,null,null,978430,null,null,1882774,null,null,"-",null,null,"-",null,null,"-",null,null,1878756,null,null,3073677,null,null,2819200,null,null,"／",null,null,"／",null,null,"／",null,null,"／"]
[null,null,null,"下向き施工","断面修復厚",50,null,null,50,null,null,50,null,null,30,null,null,30,null,null,30,null,null,30,null,null,50,null,null,50,null,null,50,null,null,20,null,null,100,null,null,"-",null,null,10,null,null,"10～30mm",null,null,"未回答",null,null,50,null,null,50,null,null,"60～100mm",null,null,"-",null,null,"-",null,null,100,null,null,100,null,null,"-",null,null,"-",null,null,50,null,null,65,null,null,50,null,null,"-",null,null,30,null,null,30,null,null,50,null,null,50,null,null,50,null,null,50,null,null,50,null,null,50,null,null,50,null,null,50,null,null,10,null,null,"／",null,null,"／",null,null,"／",null,null,"／"]
[null,null,null,null,"施工費",1675520,null,null,1610209,null,null,1013520,null,null,1913100,null,null,2397345,null,null,1705806,null,null,1705806,null,null,506440,null,null,506530,null,null,506530,null,null,2675000,null,null,1657000,null,null,"-",null,null,1848255,null,null,751080,null,null,"未回答",null,null,2535684,null,null,2535684,null,null,1250078,null,null,"-",null,null,"-",null,null,982650,null,null,622100,null,null,"-",null,null,2893609,null,null,2535684,null,null,3137069,null,null,993960,null,null,2535684,null,null,2594631,null,null,2341952,null,null,1619885,null,null,325930,null,null,84244,null,null,3136760,null,null,3136760,null,null,3136760,null,null,1114133,null,null,1891978,null,null,1845724,null,null,"／",null,null,"／",null,null,"／",null,null,"／"]
[null,null,null,null,"材料費",678100,null,null,801391,null,null,822760,null,null,612375,null,null,628350,null,null,636020,null,null,794116,null,null,921000,null,null,833196,null,null,740795,null,null,27857,null,null,27857,null,null,"-",null,null,563745,null,null,830419,null,null,"未回答",null,null,702336,null,null,698088,null,null,743324,null,null,500000,null,null,500000,null,null,419000,null,null,456000,null,null,"-",null,null,309375,null,null,786352,null,null,980896,null,null,904500,null,null,560500,null,null,629875,null,null,694749,null,null,645750,null,null,652500,null,null,1714286,null,null,733000,null,null,844400,null,null,957200,null,null,662240,null,null,535552,null,null,805932,null,null,"／",null,null,"／",null,null,"／",null,null,"／"]
[null,null,null,null,"合計",2353620,null,null,2411600,null,null,1836280,null,null,2525475,null,null,3025695,null,null,2341826,null,null,2499922,null,null,1427440,null,null,1339726,null,null,1247325,null,null,2702857,null,null,1684857,null,null,"-",null,null,2412000,null,null,1581499,null,null,"未回答",null,null,3238020,null,null,3233772,null,null,1993402,null,null,"-",null,null,"-",null,null,1401650,null,null,1078100,null,null,"-",null,null,3202984,null,null,3322036,null,null,4117965,null,null,1898460,null,null,3096184,null,null,3224506,null,null,3036701,null,null,2265635,null,null,978430,null,null,1798530,null,null,3869760,null,null,3981160,null,null,4093960,null,null,1776373,null,null,2427530,null,null,2651656,null,null,"／",null,null,"／",null,null,"／",null,null,"／"]
[null,"⑫","施工日数","上向き施工",null,9.9670000000000005,null,null,8.8070000000000004,null,null,2.71,null,null,20,null,null,14,null,null,22.8,null,null,22.8,null,null,"-",null,null,"-",null,null,"-",null,null,9.4319999999999986,null,null,"未回答",null,null,7,null,null,28.75,null,null,"-",null,null,"未回答",null,null,23,null,null,23,null,null,4.7300000000000004,null,null,"-",null,null,"-",null,null,4.5,null,null,2.5,null,null,7,null,null,"-",null,null,29.9,null,null,27.8,null,null,"-",null,null,14.49,null,null,"-",null,null,"-",null,null,9.5,null,null,1,null,null,11,null,null,"-",null,null,"-",null,null,"-",null,null,5.7669999999999995,null,null,10.356999999999999,null,null,8.9469999999999992,null,null,"／",null,null,"／",null,null,"／",null,null,"／"]
[null,null,null,"横向き施工",null,8.8870000000000005,null,null,6.7270000000000003,null,null,2.6900000000000004,null,null,14.4,null,null,11.3,null,null,19,null,null,19,null,null,"-",null,null,"-",null,null,"-",null,null,7.032,null,null,"未回答",null,null,6,null,null,23,null,null,"-",null,null,"未回答",null,null,23,null,null,23,null,null,4.63,null,null,"-",null,null,"-",null,null,3.5,null,null,2,null,null,6,null,null,28,null,null,23,null,null,27.8,null,null,"-",null,null,14.49,null,null,"-",null,null,"-",null,null,9.5,null,null,1,null,null,11,null,null,"-",null,null,"-",null,null,"-",null,null,4.9870000000000001,null,null,8.6869999999999994,null,null,8.9469999999999992,null,null,"／",null,null,"／",null,null,"／",null,null,"／"]
[null,null,null,"下向き施工",null,8.8870000000000005,null,null,6.7270000000000003,null,null,2.6900000000000004,null,null,10.6,null,null,8.9,null,null,15.2,null,null,15.2,null,null,2.7,null,null,2.7,null,null,2.7,null,null,7.032,null,null,"未回答",null,null,"-",null,null,17.25,null,null,2.169,null,null,"未回答",null,null,23,null,null,23,null,null,4.41,null,null,"-",null,null,"-",null,null,2.5,null,null,1.5,null,null,"-",null,null,28,null,null,23,null,null,27.8,null,null,4,null,null,14.49,null,null,23.332999999999998,null,null,11.15,null,null,9.5,null,null,1,null,null,11,null,null,14.49,null,null,14.49,null,null,14.49,null,null,4.7270000000000003,null,null,7.0169999999999995,null,null,8.9469999999999992,null,null,"／",null,null,"／",null,null,"／",null,null,"／"]
[null,"備考",null,null,null,"・回答に鉄筋ケレン・防錆処理とコンクリートはつりを加算",null,null,{"$f":"J46","v":"・回答に鉄筋ケレン・防錆処理とコンクリートはつりを加算"},null,null,"・回答に鉄筋ケレン・防錆処理とコンクリートはつりを加算",null,null,"-",null,null,"-",null,null,"-",null,null,"-",null,null,"-",null,null,"-",null,null,"-",null,null,"・回答に鉄筋ケレン・防錆処理とコンクリートはつりを加算",null,null,"-",null,null,"-",null,null,"-",null,null,"-",null,null,"-",null,null,"-",null,null,"-",null,null,"・回答に鉄筋ケレン・防錆処理とコンクリートはつりを加算",null,null,"材料販売のみ",null,null,"材料販売のみ",null,null,"-",null,null,"-",null,null,{"$f":"BX46","v":"-"},null,null,"-",null,null,"-",null,null,"-",null,null,"-",null,null,"-",null,null,"-",null,null,"-",null,null,"-",null,null,"-",null,null,"-",null,null,"-",null,null,"-",null,null,"-",null,null,"・回答に鉄筋ケレン・防錆処理とコンクリートはつりを加算",null,null,"・回答に鉄筋ケレン・防錆処理とコンクリートはつりを加算",null,null,"・回答に鉄筋ケレン・防錆処理とコンクリートはつりを加算",null,null,"／",null,null,"／",null,null,"／",null,null,"／"]
[null,"⑬","統一した従来技術との比較",null,"経済性","（2,421,973-3,571,000）/3,571,000=-32.2%",null,null,"-",null,null,"-",null,null,"（3,341,145-3,571,000）/3,571,000=-6.4%",null,null,"-",null,null,"（2,768,278-3,571,000）/3,571,000=-22.5%",null,null,"（2,926,374-3,571,000）/3,571,000=-18.1%",null,null,"（1,427,440-3,571,000）/3,571,000=-60.0%",null,null,"（1,339,726-3,571,000）/3,571,000=-62.5%",null,null,"（1,247,325-3,571,000）/3,571,000=-65.1%",null,null,"（2,786,857-3,571,000）/3,571,000=-22.0%",null,null,"-",null,null,"-",null,null,"-",null,null,"（1,581,499-3,571,000）/3,571,000=-55.7%",null,null,"-",null,null,"（3,238,020-3,571,000）/3,571,000=-9.3%",null,null,"（3,233,772-3,571,000）/3,571,000=-9.4%",null,null,"-",null,null,"-",null,null,"-",null,null,"（1,595,183-3,571,000）/3,571,000=-55.3%",null,null,"-",null,null,"-",null,null,"-",null,null,"（3,586,711-3,571,000）/3,571,000=0.4%",null,null,"（4,117,965-3,571,000）/3,571,000=15.3%",null,null,"（1,898,460-3,571,000）/3,571,000=-46.8%",null,null,"-",null,null,"（3,224,506-3,571,000）/3,571,000=-9.7%",null,null,"-",null,null,"（2,265,635-3,571,000）/3,571,000=-36.6%",null,null,{"$f":"CY47","v":"-"},null,null,"（1,854,693-3,571,000）/3,571,000=-48.1%",null,null,"（3,869,760-3,571,000）/3,571,000=8.4%",null,null,"（3,981,160-3,571,000）/3,571,000=11.5%",null,null,"（4,093,960-3,571,000）/3,571,000=14.6%",null,null,"-",null,null,"（3,073,677-3,571,000）/3,571,000=-13.9%",null,null,"（2,847,124-3,571,000）/3,571,000=-20.3%",null,null,"／",null,null,"／",null,null,"／",null,null,"／"]
[null,null,null,null,"工程","（9.247-27.780）/27.780=-66.7%",null,null,"-",null,null,"-",null,null,"（15.000-27.780）/27.780=-46.0%",null,null,"-",null,null,"（19.000-27.780）/27.780=-31.6%",null,null,"（19.000-27.780）/27.780=-31.6%",null,null,"（2.700-27.780）/27.780=-90.3%",null,null,"（2.700-27.780）/27.780=-90.3%",null,null,"（2.700-27.780）/27.780=-90.3%",null,null,"（7.832-27.780）/27.780=-71.8%",null,null,"-",null,null,"-",null,null,"-",null,null,"（2.169-27.780）/27.780=-92.2%",null,null,"-",null,null,"（23.000-27.780）/27.780=-17.2%",null,null,"（23.000-27.780）/27.780=-17.2%",null,null,"-",null,null,"-",null,null,"-",null,null,"（3.500-27.780）/27.780=-87.4%",null,null,"-",null,null,"-",null,null,"-",null,null,"（25.300-27.780）/27.780=-8.9%",null,null,"（27.800-27.780）/27.780=0.1%",null,null,"（4.000-27.780）/27.780=-85.6%",null,null,"-",null,null,"（23.333-27.780）/27.780=-16.0%",null,null,"-",null,null,"（9.500-27.780）/27.780=-65.8%",null,null,"-",null,null,"（11.000-27.780）/27.780=-60.4%",null,null,"（14.490-27.780）/27.780=-47.8%",null,null,"（14.490-27.780）/27.780=-47.8%",null,null,"（14.490-27.780）/27.780=-47.8%",null,null,"-",null,null,"（8.687-27.780）/27.780=-68.7%",null,null,"（8.947-27.780）/27.780=-67.8%",null,null,"／",null,null,"／",null,null,"／",null,null,"／"]
[null,null,"判定の凡例 \n  ○：従来技術より優れる\n  △：従来技術と同程度\n  －：上記以外",null,"品質・出来形",{"$f":"LEFT(F49,1)","v":"-"},null,null,{"$f":"LEFT(I49,1)","v":"-"},null,null,{"$f":"LEFT(L49,1)","v":"-"},null,null,{"$f":"LEFT(O49,1)","v":"-"},null,null,{"$f":"LEFT(R49,1)","v":"-"},null,null,{"$f":"LEFT(U49,1)","v":"-"},null,null,{"$f":"LEFT(X49,1)","v":"-"},null,null,{"$f":"LEFT(AA49,1)","v":"-"},null,null,{"$f":"LEFT(AD49,1)","v":"-"},null,null,{"$f":"LEFT(AG49,1)","v":"-"},null,null,{"$f":"LEFT(AJ49,1)","v":"-"},null,null,{"$f":"LEFT(AM49,1)","v":"-"},null,null,{"$f":"LEFT(AP49,1)","v":"-"},null,null,{"$f":"LEFT(AS49,1)","v":"-"},null,null,{"$f":"LEFT(AV49,1)","v":"-"},null,null,{"$f":"LEFT(AY49,1)","v":"-"},null,null,{"$f":"LEFT(BB49,1)","v":"-"},null,null,{"$f":"LEFT(BE49,1)","v":"-"},null,null,{"$f":"LEFT(BH49,1)","v":"-"},null,null,{"$f":"LEFT(BK49,1)","v":"-"},null,null,{"$f":"LEFT(BN49,1)","v":"-"},null,null,{"$f":"LEFT(BQ49,1)","v":"-"},null,null,{"$f":"LEFT(BT49,1)","v":"-"},null,null,{"$f":"LEFT(BW49,1)","v":"-"},null,null,{"$f":"LEFT(BZ49,1)","v":"-"},null,null,{"$f":"LEFT(CC49,1)","v":"-"},null,null,{"$f":"LEFT(CF49,1)","v":"-"},null,null,{"$f":"LEFT(CI49,1)","v":"-"},null,null,{"$f":"LEFT(CL49,1)","v":"-"},null,null,{"$f":"LEFT(CO49,1)","v":"-"},null,null,{"$f":"LEFT(CR49,1)","v":"-"},null,null,{"$f":"LEFT(CU49,1)","v":"-"},null,null,{"$f":"LEFT(CX49,1)","v":"-"},null,null,{"$f":"LEFT(DA49,1)","v":"-"},null,null,{"$f":"LEFT(DD49,1)","v":"-"},null,null,{"$f":"LEFT(DG49,1)","v":"-"},null,null,{"$f":"LEFT(DJ49,1)","v":"-"},null,null,{"$f":"LEFT(DM49,1)","v":"-"},null,null,{"$f":"LEFT(DP49,1)","v":"-"},null,null,{"$f":"LEFT(DS49,1)","v":"-"},null,null,{"$f":"LEFT(DV49,1)","v":"／"},null,null,{"$f":"LEFT(DY49,1)","v":"／"},null,null,{"$f":"LEFT(EB49,1)","v":"／"},null,null,{"$f":"LEFT(EE49,1)","v":"／"}]
[null,null,null,null,"安全性",{"$f":"LEFT(F50,1)","v":"△"},null,null,"△",null,null,"△",null,null,"△",null,null,"-",null,null,"△",null,null,"△",null,null,"△",null,null,"△",null,null,"△",null,null,"△",null,null,"△",null,null,"△",null,null,"△",null,null,"△",null,null,"△",null,null,"△",null,null,"△",null,null,"△",null,null,"△",null,null,"△",null,null,"△",null,null,"△",null,null,"△",null,null,"△",null,null,"△",null,null,"△",null,null,"△",null,null,"△",null,null,"△",null,null,"△",null,null,"△",null,null,"△",null,null,"△",null,null,"△",null,null,"△",null,null,"△",null,null,"△",null,null,"△",null,null,"△",null,null,"／",null,null,"／",null,null,"／",null,null,"／"]
[null,null,null,null,"施工性","○",null,null,"○",null,null,"○",null,null,"○",null,null,"○",null,null,"△",null,null,"△",null,null,"△",null,null,"△",null,null,"△",null,null,"△",null,null,"○",null,null,"○",null,null,"△",null,null,"○",null,null,"○",null,null,"○",null,null,"○",null,null,"○",null,null,"○",null,null,"○",null,null,"○",null,null,"○",null,null,"○",null,null,"△",null,null,"○",null,null,"○",null,null,"○",null,null,"△",null,null,"△",null,null,"△",null,null,"○",null,null,"○",null,null,"△",null,null,"○",null,null,"○",null,null,"○",null,null,"○",null,null,"○",null,null,"△",null,null,"／",null,null,"／",null,null,"／",null,null,"／"]
[null,null,null,null,"環境",{"$f":"LEFT(F52,1)","v":"△"},null,null,{"$f":"LEFT(I52,1)","v":"△"},null,null,{"$f":"LEFT(L52,1)","v":"△"},null,null,{"$f":"LEFT(O52,1)","v":"○"},null,null,{"$f":"LEFT(R52,1)","v":"○"},null,null,{"$f":"LEFT(U52,1)","v":"○"},null,null,{"$f":"LEFT(X52,1)","v":"○"},null,null,{"$f":"LEFT(AA52,1)","v":"△"},null,null,{"$f":"LEFT(AD52,1)","v":"△"},null,null,{"$f":"LEFT(AG52,1)","v":"△"},null,null,{"$f":"LEFT(AJ52,1)","v":"△"},null,null,{"$f":"LEFT(AM52,1)","v":"△"},null,null,{"$f":"LEFT(AP52,1)","v":"△"},null,null,{"$f":"LEFT(AS52,1)","v":"△"},null,null,{"$f":"LEFT(AV52,1)","v":"△"},null,null,{"$f":"LEFT(AY52,1)","v":"△"},null,null,{"$f":"LEFT(BB52,1)","v":"△"},null,null,{"$f":"LEFT(BE52,1)","v":"△"},null,null,{"$f":"LEFT(BH52,1)","v":"△"},null,null,{"$f":"LEFT(BK52,1)","v":"△"},null,null,{"$f":"LEFT(BN52,1)","v":"△"},null,null,{"$f":"LEFT(BQ52,1)","v":"△"},null,null,{"$f":"LEFT(BT52,1)","v":"△"},null,null,{"$f":"LEFT(BW52,1)","v":"△"},null,null,{"$f":"LEFT(BZ52,1)","v":"△"},null,null,{"$f":"LEFT(CC52,1)","v":"△"},null,null,{"$f":"LEFT(CF52,1)","v":"○"},null,null,{"$f":"LEFT(CI52,1)","v":"△"},null,null,{"$f":"LEFT(CL52,1)","v":"○"},null,null,{"$f":"LEFT(CO52,1)","v":"△"},null,null,{"$f":"LEFT(CR52,1)","v":"△"},null,null,{"$f":"LEFT(CU52,1)","v":"△"},null,null,{"$f":"LEFT(CX52,1)","v":"△"},null,null,{"$f":"LEFT(DA52,1)","v":"○"},null,null,{"$f":"LEFT(DD52,1)","v":"○"},null,null,{"$f":"LEFT(DG52,1)","v":"○"},null,null,{"$f":"LEFT(DJ52,1)","v":"○"},null,null,{"$f":"LEFT(DM52,1)","v":"△"},null,null,{"$f":"LEFT(DP52,1)","v":"△"},null,null,{"$f":"LEFT(DS52,1)","v":"○"},null,null,{"$f":"LEFT(DV52,1)","v":"／"},null,null,{"$f":"LEFT(DY52,1)","v":"／"},null,null,{"$f":"LEFT(EB52,1)","v":"／"},null,null,{"$f":"LEFT(EE52,1)","v":"／"}]
[]
[null,null,"断面修復材料","断面修復材料",null,{"$f":"G53","v":"ポリマーセメントモルタル：遮塩モルタルRP200"},null,null,{"$f":"J53","v":"ポリマーセメントモルタル（遮塩モルタルRP200）"},null,null,{"$f":"M53","v":"ポリマーセメントモルタル（遮塩モルタルRP310Ｇ）"},null,null,{"$f":"P53","v":"ポリマーセメントモルタル（エフモル05）"},null,null,{"$f":"S53","v":"ポリマーセメントモルタル（エフモル05）"},null,null,{"$f":"V53","v":"ポリマーセメントモルタル（NC ショットM）"},null,null,{"$f":"Y53","v":"ポリマーセメントモルタル（NC ショットL）"},null,null,{"$f":"AB53","v":"ポリマーセメントモルタル（ポットホール用モルタル）"},null,null,{"$f":"AE53","v":"ポリマーセメントモルタル（ゴムラテモルタル）"},null,null,{"$f":"AH53","v":"ポリマーセメントモルタル（ゴムラテコンクリート）"},null,null,{"$f":"AK53","v":"ポリマーセメントモルタル（RISクロルフィックスエース）"},null,null,{"$f":"AN53","v":"ポリマーセメントモルタル（クロルフィックスショット）"},null,null,{"$f":"AQ53","v":"ポリマーセメントモルタル：StoCrete TS100"},null,null,{"$f":"AT53","v":"LCモルタル"},null,null,{"$f":"AW53","v":"リフレモルセットSF(モルタル)　"},null,null,{"$f":"AZ53","v":"ポリマーモルタル（CR-2000）"},null,null,{"$f":"BC53","v":"ポリマーセメントモルタル（U‐リペアパッチEX）"},null,null,{"$f":"BF53","v":"ポリマーセメントモルタル（U‐リペアライトEX）"},null,null,{"$f":"BI53","v":"ポリマーセメントモルタル"},null,null,{"$f":"BL53","v":"ポリマーセメントモルタル"},null,null,{"$f":"BO53","v":"ポリマーセメントモルタル"},null,null,{"$f":"BR53","v":"セメントモルタル（タフショットクリート）"},null,null,{"$f":"BU53","v":"セメントモルタル（タフショットクリート）"},null,null,{"$f":"BX53","v":"ポリマーセメントモルタル"},null,null,{"$f":"CA53","v":"パワーグラウト(自己治癒補修材)"},null,null,{"$f":"CD53","v":"ポリマーセメントモルタル(U-リペアパッチCT)"},null,null,{"$f":"CG53","v":"ポリマーセメントモルタル"},null,null,{"$f":"CJ53","v":"CPJ-L（コンパクトジェット-L）13mm骨材（20mm骨材）"},null,null,{"$f":"CM53","v":"プレユーロックスDXP"},null,null,{"$f":"CP53","v":"HI-SPECシール工法（KSタイプ）"},null,null,{"$f":"CS53","v":"HI-SPECシール工法（KSタイプ）"},null,null,{"$f":"CV53","v":"リプロモルタルAZ"},null,null,{"$f":"CY53","v":"リプロモルタルAZ"},null,null,{"$f":"DB53","v":"コンクリ補強欠損部066"},null,null,{"$f":"DE53","v":"ジェットモルタル　PF（低弾性・無収縮タイプ）"},null,null,{"$f":"DH53","v":"ジェットモルタル　赤（早期供用・無収縮タイプ）"},null,null,{"$f":"DK53","v":"ジェットモルタル　青（通常タイプ）"},null,null,{"$f":"DN53","v":"エアショットワン"},null,null,{"$f":"DQ53","v":"エアショットワン"},null,null,{"$f":"DT53","v":"RP-1"},null,null,{"$f":"DW53","v":"／"},null,null,{"$f":"DZ53","v":"／"},null,null,{"$f":"EC53","v":"／"},null,null,{"$f":"EF53","v":"／"}]
[null,null,"施工方法","施工方法",null,{"$f":"G54","v":"左官工法"},null,null,"吹付け工法",null,null,"充填工法",null,null,"左官工法",null,null,"左官工法",null,null,"左官工法",null,null,"左官工法",null,null,"左官工法",null,null,"左官工法",null,null,"左官工法",null,null,"左官工法",null,null,"吹付け工法",null,null,"吹付け工法",null,null,"吹付け工法",null,null,"左官工法（床板上面）",null,null,"-",null,null,"左官工法",null,null,"左官工法",null,null,"吹付け工法",null,null,"左官工法",null,null,"吹付け工法",null,null,"左官工法",null,null,"吹付け工法",null,null,"吹付け工法",null,null,"充填工法",null,null,"左官工法",null,null,"左官工法",null,null,"左官工法",null,null,"充填工法",null,null,"-",null,null,"-",null,null,"左官工法",null,null,"-",null,null,"左官工法",null,null,"床版断面修繕工法（下向き）",null,null,"左官工法",null,null,"左官工法",null,null,"吹付け工法",null,null,"左官工法",null,null,"左官工法",null,null,"／",null,null,"／",null,null,"／",null,null,"／"]
[null,null,null,"試験規格",null,"公的機関による試験結果",null,null,"公的機関による試験結果",null,null,"公的機関による試験結果",null,null,"公的機関による試験結果",null,null,"公的機関による試験結果",null,null,"公的機関による試験結果（自社での試験結果）",null,null,"公的機関による試験結果（自社での試験結果）",null,null,"公的機関での試験結果",null,null,"公的機関での試験結果",null,null,"公的機関での試験結果",null,null,"自社での試験結果",null,null,"自社での試験結果",null,null,"公的機関による試験結果",null,null,"公的機関等での試験結果",null,null,"公的機関での試験結果",null,null,"自社での試験結果",null,null,"公的機関での試験結果",null,null,"公的機関での試験結果",null,null,"公的機関による試験結果",null,null,"公的機関または民間委託による試験結果",null,null,"公的機関または民間委託による試験結果",null,null,"公的機関による試験結果（自社での試験結果）",null,null,"公的機関による試験結果（自社での試験結果）",null,null,"公的機関での試験結果",null,null,"公的機関による試験結果（自社）",null,null,"公的機関による試験結果",null,null,"自社試験による試験結果",null,null,"公的機関による試験結果（自社での試験結果）",null,null,"公的機関（自社試験）による試験結果",null,null,"-",null,null,"-",null,null,"公的機関",null,null,"-",null,null,"公的機関（自社試験）による試験結果",null,null,"公的機関（自社試験）",null,null,"自社試験",null,null,"自社試験",null,null,"公的機関（自社試験）による試験結果",null,null,"公的機関（自社試験）による試験結果",null,null,"公的機関（自社試験）による試験結果",null,null,"／",null,null,"／",null,null,"／",null,null,"／"]
[null,null,"フロー","フロー",null,"-",null,null,"-",null,null,"-",null,null,"-",null,null,"-",null,null,"-",null,null,"-",null,null,"-",null,null,"-",null,null,"-",null,null,"177mm（JISR5201）",null,null,"193mm（JISR5201）",null,null,"-",null,null,"-",null,null,"-",null,null,"-",null,null,"-",null,null,"-",null,null,"-",null,null,"157mm",null,null,"157mm",null,null,"-",null,null,"-",null,null,"-",null,null,"（6.6秒）",null,null,"-",null,null,"147.5mm",null,null,"-",null,null,"268mm",null,null,"-",null,null,"-",null,null,"-",null,null,"-",null,null,"-",null,null,"（205）",null,null,210,null,null,190,null,null,"（148mm）",null,null,"（160mm）",null,null,"-",null,null,"／",null,null,"／",null,null,"／",null,null,"／"]
[null,null,"硬化時間\n（時間）","硬化時間（時間）",null,"9時間8分",null,null,"-",null,null,"-",null,null,"2時間32分",null,null,"2時間32分",null,null,"9時間34分",null,null,"2時間27分",null,null,"46分",null,null,"44分",null,null,"54分",null,null,"3時間（JISR5201）",null,null,"-",null,null,"-",null,null,"-",null,null,"5℃：58分、,23℃：33分、35℃：44分",null,null,"-",null,null,"1～1.5時間",null,null,"0.5時間",null,null,"-",null,null,"3時間",null,null,"3時間",null,null,"-",null,null,"-",null,null,"-",null,null,"（始発：2時間02分，終結：6時間52分）",null,null,"4.5時間",null,null,"5時間33分（亜硝酸リチウム混入時：4時間30分）",null,null,"49～71分（40～62分）",null,null,"8時間40分(始発)",null,null,"-",null,null,"-",null,null,"2.0時間",null,null,"-",null,null,"（12時間）",null,null,"45分",null,null,"25－32分",null,null,"40－55分",null,null,"-",null,null,"5時間",null,null,"6時間",null,null,"／",null,null,"／",null,null,"／",null,null,"／"]
[null,null,null,"圧縮強度\n（N/mm2）","材齢3ｈ","-",null,null,"-",null,null,"-",null,null,"-",null,null,"-",null,null,"-",null,null,"-",null,null,"-",null,null,"-",null,null,"-",null,null,"-",null,null,"-",null,null,"-",null,null,"-",null,null,"-",null,null,"-",null,null,"23.6N/mm2",null,null,"21.6N/mm2",null,null,"-",null,null,"-",null,null,"-",null,null,"-",null,null,"-",null,null,"-",null,null,"（49.5N/mm2）",null,null,"-",null,null,"-",null,null,"-",null,null,"-",null,null,"-",null,null,"-",null,null,"-",null,null,"-",null,null,"-",null,null,"（28.9）",null,null,33.5,null,null,21,null,null,"-",null,null,"-",null,null,"-",null,null,"／",null,null,"／",null,null,"／",null,null,"／"]
[null,null,null,null,"材齢1ｄ","-",null,null,"-",null,null,"-",null,null,"-",null,null,"-",null,null,"（15.8N/mm2）",null,null,"（17.6N/mm2）",null,null,"-",null,null,"-",null,null,"-",null,null,"-",null,null,"-",null,null,"-",null,null,"-",null,null,"-",null,null,"-",null,null,"34.3N/mm2",null,null,"26.2N/mm2",null,null,"-",null,null,"-",null,null,"-",null,null,"-",null,null,"-",null,null,"-",null,null,"-",null,null,"-",null,null,"13.1N/mm2",null,null,"-",null,null,"-",null,null,"-",null,null,"-",null,null,"-",null,null,"-",null,null,"-",null,null,"（39.5）",null,null,47.5,null,null,27.8,null,null,"（24.7）",null,null,"（18.5）",null,null,"-",null,null,"／",null,null,"／",null,null,"／",null,null,"／"]
[null,null,null,null,"材齢7ｄ","-",null,null,"-",null,null,"-",null,null,"-",null,null,"-",null,null,"（36.8N/mm2）",null,null,"（32.6N/mm2）",null,null,"-",null,null,"-",null,null,"-",null,null,"22.5N/mm2（JISR5201）",null,null,"36.5N/mm2（JISR5201）",null,null,"-",null,null,"-",null,null,"-",null,null,"5℃：58.9N/mm2以上",null,null,"51.0N/mm2",null,null,"32.2N/mm2",null,null,"37.4N/mm2",null,null,"30.6N/mm2",null,null,"30.6N/mm2",null,null,"-",null,null,"-",null,null,"-",null,null,"-",null,null,"52N/mm2（自社）",null,null,"40.9N/mm2",null,null,"-",null,null,"（45.2）",null,null,"-",null,null,"-",null,null,"-",null,null,"-",null,null,"101N/mm2以上",null,null,"（49.1）",null,null,55.8,null,null,36.200000000000003,null,null,"（56.1）",null,null,"（44.3）",null,null,"（45.4N/mm2）",null,null,"／",null,null,"／",null,null,"／",null,null,"／"]
[null,null,"圧縮強度（N/mm2）\n材齢28ｄ",null,"材齢28ｄ","33.2N/mm2",null,null,"41.6N/mm2",null,null,"54.2N/mm2",null,null,"72.7N/mm2",null,null,"72.7N/mm2",null,null,"56.5N/mm2",null,null,"37.8N/mm2",null,null,"48.5N/mm2",null,null,"53.5N/mm2",null,null,"54.5N/mm2",null,null,"35.1N/mm2（JISR5201）",null,null,"47.2N/mm2（JISR5201）",null,null,"62.5N/mm2",null,null,"45.6N/m㎡",null,null,"52.3N/m㎡",null,null,"-",null,null,"63.4N/mm2",null,null,"37.5N/mm2",null,null,"46.3N/mm2",null,null,"34.5N/mm2",null,null,"34.5N/mm2",null,null,"101N/mm2(JIS A 1171)",null,null,"101N/mm2(JIS A 1171)",null,null,"72.1N/mm2",null,null,"73.2N/mm2",null,null,"60.1N/mm2（自社）",null,null,"47.3N/mm2（亜硝酸リチウム混入時：60.6N/mm2）",null,null,"（5℃～35℃：51.3～53.2N/m㎡（49.8～50.8N/m㎡））",null,null,53.1,null,null,"-",null,null,"-",null,null,64.099999999999994,null,null,"-",null,null,"-",null,null,62.4,null,null,65.3,null,null,45.5,null,null,58.1,null,null,53.6,null,null,"38.1N/mm2",null,null,"／",null,null,"／",null,null,"／",null,null,"／"]
[null,null,null,null,"その他","-",null,null,"-",null,null,"-",null,null,"-",null,null,"-",null,null,"-",null,null,"-",null,null,"2h：21.9N/mm2、4h：31.6N/mm2",null,null,"2h：25.4N/mm2、4h：34.4N/mm2",null,null,"2h：23.0N/mm2、4h：34.1N/mm2",null,null,"-",null,null,"-",null,null,"-",null,null,"-",null,null,"材齢2ｈ： 26.8N/m㎡、材齢4ｈ： 28.7N/m㎡",null,null,"材齢6h、5℃、湿潤面：44.2N/m㎡",null,null,"-",null,null,"-",null,null,"3d：33.9N/mm2",null,null,"-",null,null,"-",null,null,"115N/mm2(JIS A 1108)",null,null,"115N/mm2(JIS A 1108)",null,null,"-",null,null,"-",null,null,"-",null,null,"-",null,null,"5℃～35℃：13.7～30.5N/m㎡（17～30.8N/m㎡）",null,null,"-",null,null,"-",null,null,"-",null,null,"-",null,null,"-",null,null,"-",null,null,27.7,null,null,29.4,null,null,10.1,null,null,"-",null,null,"-",null,null,"-",null,null,"／",null,null,"／",null,null,"／",null,null,"／"]
[null,null,"付着強度（N/mm2）\n標準","付着強度\n（N/mm2）","標準","-",null,null,"2.0N/mm2",null,null,"1.9N/mm2",null,null,"-",null,null,"-",null,null,"（2.4N/mm2）",null,null,"（2.6N/mm2）",null,null,"2.6N/mm2",null,null,"2.5N/mm2",null,null,"2.8N/mm2",null,null,"湿潤時：2.0N/mm2（JISA6909）",null,null,"2.2N/mm2（JHS432）",null,null,"平均値：2.2N/mm2、最低値：1.7N/mm2",null,null,"2.08N/m㎡",null,null,"2.0N/m㎡",null,null,"-",null,null,"-",null,null,"-",null,null,"1.8N/mm2",null,null,"1.63N/mm2",null,null,"1.63N/mm2",null,null,"3.4N/mm2(JSCE-K561-2010)",null,null,"3.4N/mm2(JSCE-K561-2010)",null,null,"2.41N/mm2",null,null,"-",null,null,"2.4N/mm2",null,null,"2.4N/mm2（亜硝酸リチウム混入時：2.4N/mm2）",null,null,"平均3.23N/m㎡（3.57N/m㎡）",null,null,3.3,null,null,"-",null,null,"-",null,null,"-",null,null,"-",null,null,"4.7N/m㎡（下地破壊）",null,null,3.6,null,null,"－",null,null,"－",null,null,2.6,null,null,2.7,null,null,"2.77N/mm2",null,null,"／",null,null,"／",null,null,"／",null,null,"／"]
[null,null,null,null,"温冷繰返し","1.9N/mm2",null,null,"-",null,null,"-",null,null,"1.5N/mm2",null,null,"1.5N/mm2",null,null,"1.8N/mm2",null,null,"2.3N/mm2",null,null,"1.7N/mm2",null,null,"1.7N/mm2",null,null,"1.3N/mm2",null,null,"1.8N/mm2（JISA6909）",null,null,"-",null,null,"凍結融解試験後　平均値2.6N/mm2",null,null,"1.42N/m㎡",null,null,"-",null,null,"-",null,null,"2.1N/mm2",null,null,"2.1N/mm2",null,null,"1.7N/mm2",null,null,"0.65N/mm2",null,null,"0.65N/mm2",null,null,"2.1N/mm2(JIS A 1171)",null,null,"2.1N/mm2(JIS A 1171)",null,null,"-",null,null,"-",null,null,"2.1N/mm2",null,null,"3.7N/mm2",null,null,"-",null,null,"（3.9）",null,null,"-",null,null,"-",null,null,1.9,null,null,"-",null,null,"-",null,null,"－",null,null,"－",null,null,"－",null,null,"-",null,null,1.77,null,null,"2.01N/mm2",null,null,"／",null,null,"／",null,null,"／",null,null,"／"]
[null,null,null,null,"その他","湿潤時1.7N/mm2、耐アルカリ性試験後1.7N/mm2",null,null,"振動試験後1.5N/mm2、凍結融解試験後1.6N/mm2",null,null,"凍結融解試験後1.6N/mm2",null,null,"湿潤時1.6N/mm2、耐アルカリ性試験後1.5N/mm2",null,null,"湿潤時1.6N/mm2、耐アルカリ性試験後1.5N/mm2",null,null,"湿潤時2.8N/mm2、耐アルカリ性試験後2.9N/mm2",null,null,"湿潤時3.0N/mm2、耐アルカリ性試験後2.5N/mm2",null,null,"-",null,null,"-",null,null,"-",null,null,"耐アルカリ性試験後：2.0N/mm2（JISA6909）",null,null,"-",null,null,"乾湿繰返し試験後　平均値2.1N/mm2",null,null,"水中：1.68N/m㎡",null,null,"2.1N/m㎡",null,null,"材齢6h、5℃、湿潤面：1.84N/m㎡",null,null,"湿潤時：2.4N/mm2、耐アルカリ性試験後：1.7N/mm2",null,null,"湿潤時：2.2N/mm2、耐アルカリ性試験後：2.6N/mm2",null,null,"耐海水性：1.9N/mm2",null,null,"-",null,null,"-",null,null,"-",null,null,"-",null,null,"-",null,null,"-",null,null,"耐アルカリ性：2.1N/mm2",null,null,"3.7N/mm2",null,null,"-",null,null,"-",null,null,"-",null,null,"-",null,null,"湿潤時1.8N/mm2、耐アルカリ性試験後1.6N/mm2",null,null,"-",null,null,"-",null,null,2.7,null,null,"－",null,null,"－",null,null,2.8,null,null,2.54,null,null,"2.75N/mm2",null,null,"／",null,null,"／",null,null,"／",null,null,"／"]
[null,null,"弾性係数\n（ｋN/mm2)","弾性係数（kN/mm2）",null,"-",null,null,"20.3kN/mm2",null,null,"-",null,null,"-",null,null,"-",null,null,"（26.92kN/mm2）",null,null,"（26.92kN/mm2）",null,null,"23.7kN/mm2",null,null,"25.3kN/mm2",null,null,"29.6kN/mm2",null,null,"-",null,null,"-",null,null,"29.6kN/mm2",null,null,"-",null,null,"24.9N/m㎡",null,null,"材齢7日、5℃：4.2kN/mm2",null,null,"-",null,null,"-",null,null,"19.5N/mm2",null,null,"-",null,null,"-",null,null,"34.5ｋN/mm2(NEXCO432)",null,null,"34.5ｋN/mm2(NEXCO432)",null,null,"29.6kN/mm2",null,null,"-",null,null,"-",null,null,"21.2kN/mm2",null,null,"5℃～35℃：27.9～30.6N/m㎡（29.8～30.6N/m㎡）",null,null,"（28）",null,null,"-",null,null,"-",null,null,"-",null,null,"-",null,null,"-",null,null,29,null,null,31.4,null,null,29.1,null,null,24.4,null,null,"-",null,null,"-",null,null,"／",null,null,"／",null,null,"／",null,null,"／"]
[null,null,"引張強度\n（N/mm2)","引張強度（N/mm2）",null,"-",null,null,"-",null,null,"-",null,null,"-",null,null,"-",null,null,"（4.53N/mm2）",null,null,"（4.53N/mm2）",null,null,"-",null,null,"-",null,null,"-",null,null,"-",null,null,"-",null,null,"-",null,null,"-",null,null,"-",null,null,"-",null,null,"-",null,null,"-",null,null,"2.7N/mm2",null,null,"-",null,null,"-",null,null,"-",null,null,"-",null,null,"-",null,null,"-",null,null,"-",null,null,"-",null,null,"-",null,null,"-",null,null,"-",null,null,"-",null,null,"-",null,null,"-",null,null,"83.3N/m㎡",null,null,"－",null,null,"－",null,null,"－",null,null,"-",null,null,"-",null,null,"-",null,null,"／",null,null,"／",null,null,"／",null,null,"／"]
[null,null,"収縮率\n（×10＾-6）","収縮率（×10^-6）",null,{"$f":"G68","v":1.7000000000000001E-4},null,null,{"$f":"J68","v":-2.3500000000000001E-3},null,null,{"$f":"M68","v":"-"},null,null,{"$f":"P68","v":4.0000000000000002E-4},null,null,{"$f":"S68","v":4.0000000000000002E-4},null,null,{"$f":"V68","v":2.5999999999999998E-4},null,null,{"$f":"Y68","v":3.8000000000000002E-4},null,null,{"$f":"AB68","v":"0.023%"},null,null,{"$f":"AE68","v":"0.020%"},null,null,{"$f":"AH68","v":"0.016%"},null,null,{"$f":"AK68","v":"0.04%（JISA1129-3）"},null,null,{"$f":"AN68","v":"0.037%（JHS432）"},null,null,{"$f":"AQ68","v":3.2000000000000003E-4},null,null,{"$f":"AT68","v":"寸法安定性：0.041%"},null,null,{"$f":"AW68","v":1.6000000000000001E-4},null,null,{"$f":"AZ68","v":"-"},null,null,{"$f":"BC68","v":4.0000000000000002E-4},null,null,{"$f":"BF68","v":2.9999999999999997E-4},null,null,{"$f":"BI68","v":1.2999999999999999E-5},null,null,{"$f":"BL68","v":4.0000000000000002E-4},null,null,{"$f":"BO68","v":4.0000000000000002E-4},null,null,{"$f":"BR68","v":"0.0347%(NEXCO432)"},null,null,{"$f":"BU68","v":"0.0347%(NEXCO432)"},null,null,{"$f":"BX68","v":3.2000000000000003E-4},null,null,{"$f":"CA68","v":"（収縮無し）"},null,null,{"$f":"CD68","v":2.9999999999999997E-4},null,null,{"$f":"CG68","v":"-0.046％"},null,null,{"$f":"CJ68","v":"-"},null,null,{"$f":"CM68","v":"4.51×10＾-4"},null,null,{"$f":"CP68","v":"-"},null,null,{"$f":"CS68","v":"-"},null,null,{"$f":"CV68","v":0.05},null,null,{"$f":"CY68","v":"-"},null,null,{"$f":"DB68","v":"-"},null,null,{"$f":"DE68","v":60},null,null,{"$f":"DH68","v":"－"},null,null,{"$f":"DK68","v":"－"},null,null,{"$f":"DN68","v":3.5E-4},null,null,{"$f":"DQ68","v":2.9999999999999997E-4},null,null,{"$f":"DT68","v":450},null,null,{"$f":"DW68","v":"／"},null,null,{"$f":"DZ68","v":"／"},null,null,{"$f":"EC68","v":"／"},null,null,{"$f":"EF68","v":"／"}]
[null,null,"熱膨張率\n（×10＾-6/℃）","熱膨張率（×10^-6/℃）",null,"1.52×10-5/℃",null,null,"1.6×10＾-5/℃",null,null,"1.3×10-5/℃",null,null,"1.6×10^-5/℃",null,null,"1.6×10^-5/℃",null,null,"1.29×10＾-5/℃",null,null,"1.53×10＾-5/℃",null,null,"1.5×10^-5/℃",null,null,"1.5×10^-5/℃",null,null,"1.5×10^-5/℃",null,null,"1.2×10^-5/℃（JISK6911）",null,null,"-",null,null,"1.6×10＾-5/℃",null,null,"1.33×10^-5/℃以下",null,null,"1.2×10^-5/℃",null,null,"-",null,null,"1.4×10^-5/℃",null,null,"1.5×10^-5/℃",null,null,"13×10^-6/℃",null,null,"1.2×10＾-5/℃以下",null,null,"1.2×10＾-5/℃以下",null,null,"1.3(NEXCO432)",null,null,"1.3(NEXCO432)",null,null,"1.6×10^-6/℃",null,null,"　",null,null,"1.6×10-5/℃",null,null,"亜硝酸リチウム混入時：0.86×10^-5/℃",null,null,"1.0×10^-5/℃",null,null,"1.4×10＾-5/℃",null,null,"-",null,null,"-",null,null,"1.4×10-5",null,null,"-",null,null,"-",null,null,11,null,null,"－",null,null,"－",null,null,"1.2×10＾-5/℃",null,null,"0.1×10-5/℃",null,null,"1.3×10^-5",null,null,"／",null,null,"／",null,null,"／",null,null,"／"]
[]
[null,null,null,"断面修復材料",null,{"$f":"H53","v":"ポリマーセメントモルタル（普通） 注2）"},null,null,{"$f":"K53","v":"ポリマーセメントモルタル（普通） 注2）"},null,null,{"$f":"N53","v":"ポリマーセメントモルタル（普通） 注2）"},null,null,{"$f":"Q53","v":"ポリマーセメントモルタル（普通） 注2）"},null,null,{"$f":"T53","v":"ポリマーセメントモルタル（普通） 注2）"},null,null,{"$f":"W53","v":"ポリマーセメントモルタル（普通） 注2）"},null,null,{"$f":"Z53","v":"ポリマーセメントモルタル（普通） 注2）"},null,null,{"$f":"AC53","v":"ポリマーセメントモルタル（普通） 注2）"},null,null,{"$f":"AF53","v":"ポリマーセメントモルタル（普通） 注2）"},null,null,{"$f":"AI53","v":"ポリマーセメントモルタル（普通） 注2）"},null,null,{"$f":"AL53","v":"ポリマーセメントモルタル（普通） 注2）"},null,null,{"$f":"AO53","v":"ポリマーセメントモルタル（普通） 注2）"},null,null,{"$f":"AR53","v":"ポリマーセメントモルタル（普通） 注2）"},null,null,{"$f":"AU53","v":"ポリマーセメントモルタル（普通） 注2）"},null,null,{"$f":"AX53","v":"ポリマーセメントモルタル（普通） 注2）"},null,null,{"$f":"BA53","v":"ポリマーセメントモルタル（速硬） 注2）"},null,null,{"$f":"BD53","v":"ポリマーセメントモルタル（普通） 注2）"},null,null,{"$f":"BG53","v":"ポリマーセメントモルタル（普通） 注2）"},null,null,{"$f":"BJ53","v":"ポリマーセメントモルタル（普通） 注2）"},null,null,{"$f":"BM53","v":"ポリマーセメントモルタル（普通） 注2）"},null,null,{"$f":"BP53","v":"ポリマーセメントモルタル（普通） 注2）"},null,null,{"$f":"BS53","v":"セメントモルタル（普通） 注2）"},null,null,{"$f":"BV53","v":"セメントモルタル（普通） 注2）"},null,null,{"$f":"BY53","v":"ポリマーセメントモルタル（普通） 注2）"},null,null,{"$f":"CB53","v":"セメントモルタル（普通） 注2）"},null,null,{"$f":"CE53","v":"ポリマーセメントモルタル（普通） 注2）"},null,null,{"$f":"CH53","v":"ポリマーセメントモルタル（普通） 注2）"},null,null,{"$f":"CK53","v":"セメントモルタル（速硬） 注2）"},null,null,{"$f":"CN53","v":"ポリマーセメントモルタル（普通）"},null,null,{"$f":"CQ53","v":"ポリマーセメントモルタル（普通）"},null,null,{"$f":"CT53","v":"ポリマーセメントモルタル（普通）"},null,null,{"$f":"CW53","v":"ポリマーセメントモルタル（普通）"},null,null,{"$f":"CZ53","v":"ポリマーセメントモルタル（普通）"},null,null,{"$f":"DC53","v":"ポリマ-セメントモルタル（普通）"},null,null,{"$f":"DF53","v":"ポリマーセメントモルタル（普通）"},null,null,{"$f":"DI53","v":"ポリマーセメントモルタル（普通）"},null,null,{"$f":"DL53","v":"ポリマーセメントモルタル（普通）"},null,null,{"$f":"DO53","v":"ポリマーセメントモルタル（普通）"},null,null,{"$f":"DR53","v":"ポリマーセメントモルタル（普通）"},null,null,{"$f":"DU53","v":"ポリマ-セメントモルタル（普通）"},null,null,{"$f":"DX53","v":"／"},null,null,{"$f":"EA53","v":"／"},null,null,{"$f":"ED53","v":"／"},null,null,{"$f":"EG53","v":"／"}]
[null,null,null,"施工方法",null,{"$f":"H54","v":"左官工法"},null,null,"吹付け工法",null,null,"充填工法",null,null,"左官工法",null,null,"吹付け工法",null,null,"左官工法",null,null,"左官工法",null,null,"左官工法",null,null,"左官工法",null,null,"左官工法",null,null,"左官工法",null,null,"吹付け工法",null,null,"吹付け工法",null,null,"吹付け工法",null,null,"左官工法",null,null,"左官工法",null,null,"左官工法",null,null,"左官工法",null,null,"吹付け工法",null,null,"左官工法",null,null,"吹付け工法",null,null,"左官工法",null,null,"吹付け工法",null,null,"吹付け工法",null,null,"充填工法",null,null,"左官工法",null,null,"左官工法",null,null,"左官工法",null,null,"充填工法",null,null,"左官工法",null,null,"吹付け工法",null,null,"左官工法",null,null,"吹付け工法",null,null,"左官工法",null,null,"左官工法",null,null,"左官工法",null,null,"左官工法",null,null,"吹付け工法",null,null,"左官工法",null,null,"左官工法",null,null,"／",null,null,"／",null,null,"／",null,null,"／"]
[null,null,null,"試験規格",null,"基準",null,null,"基準",null,null,"基準",null,null,"基準",null,null,"基準",null,null,"基準",null,null,"基準",null,null,"基準",null,null,"基準",null,null,"基準",null,null,"基準",null,null,"基準",null,null,"基準",null,null,"基準",null,null,"基準",null,null,"基準",null,null,"基準",null,null,"基準",null,null,"基準",null,null,"基準",null,null,"基準",null,null,"基準",null,null,"基準",null,null,"基準",null,null,"基準",null,null,"基準",null,null,"基準",null,null,"基準",null,null,"基準",null,null,"基準",null,null,"基準",null,null,"基準",null,null,"基準",null,null,"基準",null,null,"基準",null,null,"基準",null,null,"基準",null,null,"基準",null,null,"基準",null,null,"基準",null,null,"／",null,null,"／",null,null,"／",null,null,"／"]
[null,null,null,"フロー",null,"120～160mm",null,null,"140～250",null,null,"～300mm",null,null,"120～160mm",null,null,"140～250",null,null,"120～160mm",null,null,"120～160mm",null,null,"120～160mm",null,null,"120～160mm",null,null,"120～160mm",null,null,"120～160mm",null,null,"140～250",null,null,"140～250",null,null,"140～250",null,null,"120～160mm",null,null,"120～160mm",null,null,"120～160mm",null,null,"120～160mm",null,null,"140～250",null,null,"120～160mm",null,null,"140～250",null,null,"120～160mm",null,null,"140～250",null,null,"140～250",null,null,"-",null,null,"120～160mm",null,null,"120～160mm",null,null,"120～180mm",null,null,"～300mm",null,null,"120～160mm",null,null,"140～250",null,null,"120～180mm",null,null,"140～250",null,null,"120～160mm",null,null,"120～160mm",null,null,"120～160mm",null,null,"120～160mm",null,null,"140～250",null,null,"120～160mm",null,null,"120～160mm",null,null,"／",null,null,"／",null,null,"／",null,null,"／"]
[null,null,null,"硬化時間（時間）",null,"3～8時間",null,null,"3～8時間",null,null,"4～15時間",null,null,"3～8時間",null,null,"3～8時間",null,null,"3～8時間",null,null,"3～8時間",null,null,"3～8時間",null,null,"3～8時間",null,null,"3～8時間",null,null,"3～8時間",null,null,"3～8時間",null,null,"3～8時間",null,null,"3～8時間",null,null,"3～8時間",null,null,"0.5～2時間",null,null,"3～8時間",null,null,"3～8時間",null,null,"3～8時間",null,null,"3～8時間",null,null,"3～8時間",null,null,"2～7時間",null,null,"2～7時間",null,null,"3～8時間",null,null,"3～12時間",null,null,"3～8時間",null,null,"3～8時間",null,null,"0.5～2時間",null,null,"4～15時間",null,null,"3～8時間",null,null,"3～8時間",null,null,"2～7時間",null,null,"3～8時間",null,null,"3～8時間",null,null,"3～8時間",null,null,"3～8時間",null,null,"3～8時間",null,null,"3～8時間",null,null,"3～8時間",null,null,"3～8時間",null,null,"／",null,null,"／",null,null,"／",null,null,"／"]
[null,null,null,"圧縮強度\n（N/mm2）","材齢3ｈ","-",null,null,"-",null,null,"-",null,null,"-",null,null,"-",null,null,"-",null,null,"-",null,null,"-",null,null,"-",null,null,"-",null,null,"-",null,null,"-",null,null,"-",null,null,"-",null,null,"-",null,null,"3～15N/mm2",null,null,"-",null,null,"-",null,null,"-",null,null,"-",null,null,"-",null,null,"-",null,null,"-",null,null,"-",null,null,"-",null,null,"-",null,null,"-",null,null,"1～10N/mm2",null,null,"-",null,null,"-",null,null,"-",null,null,"-",null,null,"-",null,null,"-",null,null,"-",null,null,"-",null,null,"-",null,null,"-",null,null,"-",null,null,"-",null,null,"／",null,null,"／",null,null,"／",null,null,"／"]
[null,null,null,null,"材齢1ｄ","5～25N/mm2",null,null,"5～15N/mm2",null,null,"5～10N/mm2",null,null,"5～25N/mm2",null,null,"5～15N/mm2",null,null,"5～25N/mm2",null,null,"5～25N/mm2",null,null,"5～25N/mm2",null,null,"5～25N/mm2",null,null,"5～25N/mm2",null,null,"5～25N/mm2",null,null,"5～15N/mm2",null,null,"5～15N/mm2",null,null,"5～15N/mm2",null,null,"5～25N/m㎡",null,null,"10～30N/mm2",null,null,"5～25N/mm2",null,null,"5～25N/mm2",null,null,"5～15N/mm2",null,null,"5～25N/mm2",null,null,"5～15N/mm2",null,null,"15～25N/mm2",null,null,"10～25N/mm2",null,null,"5～15N/mm2",null,null,"5～40N/mm2",null,null,"5～25N/mm2",null,null,"5～25N/mm2",null,null,"5～30N/mm2",null,null,"5～10N/mm2",null,null,"5～25N/mm2",null,null,"5～15N/mm2",null,null,"15～25N/mm2",null,null,"5～15N/mm2",null,null,"5～25N/mm2",null,null,"5～25N/mm2",null,null,"5～25N/mm2",null,null,"5～25N/mm2",null,null,"5～15N/mm2",null,null,"5～25N/mm2",null,null,"5～25N/mm2",null,null,"／",null,null,"／",null,null,"／",null,null,"／"]
[null,null,null,null,"材齢7ｄ","20～40N/mm2",null,null,"20～40N/mm2",null,null,"15～40N/mm2",null,null,"20～40N/mm2",null,null,"20～40N/mm2",null,null,"20～40N/mm2",null,null,"20～40N/mm2",null,null,"20～40N/mm2",null,null,"20～40N/mm2",null,null,"20～40N/mm2",null,null,"20～40N/mm2",null,null,"20～40N/mm2",null,null,"20～40N/mm2",null,null,"20～40N/mm2",null,null,"20～40N/m㎡",null,null,"20～40N/mm2",null,null,"20～40N/mm2",null,null,"20～40N/mm2",null,null,"20～40N/mm2",null,null,"20～40N/mm2",null,null,"20～40N/mm2",null,null,"20～60N/mm2",null,null,"30～50N/mm2",null,null,"20～40N/mm2",null,null,"30～65N/mm2",null,null,"20～40N/mm2",null,null,"20～40N/mm2",null,null,"20～50N/mm2",null,null,"15～40N/mm2",null,null,"20～40N/mm2",null,null,"20～40N/mm2",null,null,"20～60N/mm2",null,null,"20～40N/mm2",null,null,"20～40N/mm2",null,null,"20～40N/mm2",null,null,"20～40N/mm2",null,null,"20～40N/mm2",null,null,"20～40N/mm2",null,null,"20～40N/mm2",null,null,"20～40N/mm2",null,null,"／",null,null,"／",null,null,"／",null,null,"／"]
[null,null,null,null,"材齢28ｄ","25～60N/mm2",null,null,"30～60N/mm2",null,null,"25～50N/mm2",null,null,"25～60N/mm2",null,null,"30～60N/mm2",null,null,"25～60N/mm2",null,null,"25～60N/mm2",null,null,"25～60N/mm2",null,null,"25～60N/mm2",null,null,"25～60N/mm2",null,null,"25～60N/mm2",null,null,"30～60N/mm2",null,null,"30～60N/mm2",null,null,"30～60N/mm2",null,null,"25～60N/m㎡",null,null,"25～40N/mm2",null,null,"25～60N/mm2",null,null,"25～60N/mm2",null,null,"30～60N/mm2",null,null,"25～60N/mm2",null,null,"30～60N/mm2",null,null,"45～80N/mm2",null,null,"35～75N/mm2",null,null,"30～60N/mm2",null,null,"40～75N/mm2",null,null,"25～60N/mm2",null,null,"25～60N/mm2",null,null,"35～60N/mm2",null,null,"25～50N/mm2",null,null,"25～60N/mm2",null,null,"30～60N/mm2",null,null,"45～80N/mm2",null,null,"30～60N/mm2",null,null,"25～60N/mm2",null,null,"25～60N/mm2",null,null,"25～60N/mm2",null,null,"25～60N/mm2",null,null,"30～60N/mm2",null,null,"25～60N/mm2",null,null,"25～60N/mm2",null,null,"／",null,null,"／",null,null,"／",null,null,"／"]
[null,null,null,null,"その他","-",null,null,"-",null,null,"-",null,null,"-",null,null,"-",null,null,"-",null,null,"-",null,null,"-",null,null,"-",null,null,"-",null,null,"-",null,null,"-",null,null,"-",null,null,"-",null,null,"-",null,null,"-",null,null,"-",null,null,"-",null,null,"-",null,null,"-",null,null,"-",null,null,"-",null,null,"-",null,null,"-",null,null,"-",null,null,"-",null,null,"-",null,null,"-",null,null,"-",null,null,"-",null,null,"-",null,null,"-",null,null,"-",null,null,"-",null,null,"-",null,null,"-",null,null,"-",null,null,"-",null,null,"-",null,null,"-",null,null,"／",null,null,"／",null,null,"／",null,null,"／"]
[null,null,null,"付着強度\n（N/mm2）","標準","1.8～3.4N/mm2",null,null,"2.0～3.5N/mm2",null,null,"2.0～2.3N/mm2",null,null,"1.8～3.4N/mm2",null,null,"2.0～3.5N/mm2",null,null,"1.8～3.4N/mm2",null,null,"1.8～3.4N/mm2",null,null,"1.8～3.4N/mm2",null,null,"1.8～3.4N/mm2",null,null,"1.8～3.4N/mm2",null,null,"1.8～3.4N/mm2",null,null,"2.0～3.5N/mm2",null,null,"2.0～3.5N/mm2",null,null,"2.0～3.5N/mm2",null,null,"1.8～3.4N/m㎡",null,null,"2.0～2.8N/mm2",null,null,"1.8～3.4N/mm2",null,null,"1.8～3.4N/mm2",null,null,"2.0～3.5N/mm2",null,null,"1.8～3.4N/mm2",null,null,"2.0～3.5N/mm2",null,null,"1.5～3.0N/mm2",null,null,"2.0～3.0N/mm2",null,null,"2.0～3.5N/mm2",null,null,"1.5～2.7N/mm2",null,null,"1.8～3.4N/mm2",null,null,"1.8～3.4N/mm2",null,null,"1.5～2.5N/mm2",null,null,"2.0～2.3N/mm2",null,null,"1.8～3.4N/mm2",null,null,"2.0～3.5N/mm2",null,null,"1.5～3.0N/mm2",null,null,"2.0～3.5N/mm2",null,null,"1.8～3.4N/mm2",null,null,"1.8～3.4N/mm2",null,null,"1.8～3.4N/mm2",null,null,"1.8～3.4N/mm2",null,null,"2.0～3.5N/mm2",null,null,"1.8～3.4N/mm2",null,null,"1.8～3.4N/mm2",null,null,"／",null,null,"／",null,null,"／",null,null,"／"]
[null,null,null,null,"温冷繰返し","1.6～2.4N/mm2",null,null,"1.5～2.4N/mm2",null,null,"1.6～2.2N/mm2",null,null,"1.6～2.4N/mm2",null,null,"1.5～2.4N/mm2",null,null,"1.6～2.4N/mm2",null,null,"1.6～2.4N/mm2",null,null,"1.6～2.4N/mm2",null,null,"1.6～2.4N/mm2",null,null,"1.6～2.4N/mm2",null,null,"1.6～2.4N/mm2",null,null,"1.5～2.4N/mm2",null,null,"1.5～2.4N/mm2",null,null,"1.5～2.4N/mm2",null,null,"1.6～2.4N/m㎡",null,null,"1.6～3.0N/mm2",null,null,"1.6～2.4N/mm2",null,null,"1.6～2.4N/mm2",null,null,"1.5～2.4N/mm2",null,null,"1.6～2.4N/mm2",null,null,"1.5～2.4N/mm2",null,null,"1.5～1.9N/mm2",null,null,"1.50N/mm2",null,null,"1.5～2.4N/mm2",null,null,"1.63N/mm2",null,null,"1.6～2.4N/mm2",null,null,"1.6～2.4N/mm2",null,null,"-",null,null,"1.6～2.2N/mm2",null,null,"1.6～2.4N/mm2",null,null,"1.5～2.4N/mm2",null,null,"1.5～1.9N/mm2",null,null,"1.5～2.4N/mm2",null,null,"1.6～2.4N/mm2",null,null,"1.6～2.4N/mm2",null,null,"1.6～2.4N/mm2",null,null,"1.6～2.4N/mm2",null,null,"1.5～2.4N/mm2",null,null,"1.6～2.4N/mm2",null,null,"1.6～2.4N/mm2",null,null,"／",null,null,"／",null,null,"／",null,null,"／"]
[null,null,null,null,"その他","-",null,null,"-",null,null,"-",null,null,"-",null,null,"-",null,null,"-",null,null,"-",null,null,"-",null,null,"-",null,null,"-",null,null,"-",null,null,"-",null,null,"-",null,null,"-",null,null,"-",null,null,"-",null,null,"-",null,null,"-",null,null,"-",null,null,"-",null,null,"-",null,null,"-",null,null,"-",null,null,"-",null,null,"-",null,null,"-",null,null,"-",null,null,"-",null,null,"-",null,null,"-",null,null,"-",null,null,"-",null,null,"-",null,null,"-",null,null,"-",null,null,"-",null,null,"-",null,null,"-",null,null,"-",null,null,"-",null,null,"／",null,null,"／",null,null,"／",null,null,"／"]
[null,null,null,"弾性係数（kN/mm2）",null,"16～21kN/mm2",null,null,"14～21kN/mm2",null,null,"17～21kN/mm2",null,null,"16～21kN/mm2",null,null,"14～21kN/mm2",null,null,"16～21kN/mm2",null,null,"16～21kN/mm2",null,null,"16～21kN/mm2",null,null,"16～21kN/mm2",null,null,"16～21kN/mm2",null,null,"16～21kN/mm2",null,null,"14～21kN/mm2",null,null,"14～21kN/mm2",null,null,"14～21kN/mm2",null,null,"16～21kN/m㎡",null,null,"13～21kN/mm2",null,null,"16～21kN/mm2",null,null,"16～21kN/mm2",null,null,"14～21kN/mm2",null,null,"16～21kN/mm2",null,null,"14～21kN/mm2",null,null,"20～30kN/mm2",null,null,"19～27kN/mm2",null,null,"14～21kN/mm2",null,null,"23～32kN/mm2",null,null,"16～21kN/mm2",null,null,"16～21kN/mm2",null,null,"15～20kN/mm2",null,null,"17～21kN/mm2",null,null,"16～21kN/mm2",null,null,"14～21kN/mm2",null,null,"20～30kN/mm2",null,null,"14～21kN/mm2",null,null,"16～21kN/mm2",null,null,"16～21kN/mm2",null,null,"16～21kN/mm2",null,null,"16～21kN/mm2",null,null,"14～21kN/mm2",null,null,"16～21kN/mm2",null,null,"16～21kN/mm2",null,null,"／",null,null,"／",null,null,"／",null,null,"／"]
[null,null,null,"引張強度（N/mm2）",null,"3～6N/mm2",null,null,"3～6N/mm2",null,null,"3～6N/mm2",null,null,"3～6N/mm2",null,null,"3～6N/mm2",null,null,"3～6N/mm2",null,null,"3～6N/mm2",null,null,"3～6N/mm2",null,null,"3～6N/mm2",null,null,"3～6N/mm2",null,null,"3～6N/mm2",null,null,"3～6N/mm2",null,null,"3～6N/mm2",null,null,"3～6N/mm2",null,null,"3～6N/m㎡",null,null,"3～6N/mm2",null,null,"3～6N/mm2",null,null,"3～6N/mm2",null,null,"3～6N/mm2",null,null,"3～6N/mm2",null,null,"3～6N/mm2",null,null,"2～6N/mm2",null,null,"2～6N/mm2",null,null,"3～6N/mm2",null,null,"2～6N/mm2",null,null,"3～6N/mm2",null,null,"3～6N/mm2",null,null,"2～6N/mm2",null,null,"3～6N/mm2",null,null,"3～6N/mm2",null,null,"3～6N/mm2",null,null,"2～6N/mm2",null,null,"3～6N/mm2",null,null,"3～6N/mm2",null,null,"3～6N/mm2",null,null,"3～6N/mm2",null,null,"3～6N/mm2",null,null,"3～6N/mm2",null,null,"3～6N/mm2",null,null,"3～6N/mm2",null,null,"／",null,null,"／",null,null,"／",null,null,"／"]
[null,null,null,"収縮率（×10^-6）",null,"0.02％～0.10％",null,null,"200～1000×10＾-6",null,null,"200～1000×10-＾6",null,null,"0.02％～0.10％",null,null,"200～1000×10＾-6",null,null,"0.02％～0.10％",null,null,"0.02％～0.10％",null,null,"0.02％～0.10％",null,null,"0.02％～0.10％",null,null,"0.02％～0.10％",null,null,"0.02％～0.10％",null,null,"200～1000×10＾-6",null,null,"200～1000×10＾-6",null,null,"200～1000×10＾-6",null,null,"0.02％～0.10％",null,null,"200～1000×10^-6",null,null,"0.02％～0.10％",null,null,"0.02％～0.10％",null,null,"200～1000×10＾-6",null,null,"0.02％～0.10％",null,null,"200～1000×10＾-6",null,null,"300～1200×10^-6",null,null,"30～1200×10＾-6",null,null,"200～1000×10＾-6",null,null,"300～1200×10-＾6",null,null,"0.02％～0.10％",null,null,"0.02％～0.10％",null,null,"300～1200×10^-6",null,null,"200～1000×10-＾6",null,null,"200～1000×10^-6",null,null,"200～1000×10＾-6",null,null,"300～1200×10＾-6",null,null,"200～1000×10＾-6",null,null,"200～1000×10^-6",null,null,"200～1000×10^-6",null,null,"200～1000×10^-6",null,null,"200～1000×10^-6",null,null,"200～1000×10＾-6",null,null,"200～1000×10^-6",null,null,"200～1000×10^-6",null,null,"／",null,null,"／",null,null,"／",null,null,"／"]
[null,null,null,"熱膨張率（×10^-6/℃）",null,"8～17×10^-6/℃",null,null,"9～17×10＾-6/℃",null,null,"-",null,null,"8～17×10^-6/℃",null,null,"9～17×10＾-6/℃",null,null,"8～17×10^-6/℃",null,null,"8～17×10^-6/℃",null,null,"8～17×10^-6/℃",null,null,"8～17×10^-6/℃",null,null,"8～17×10^-6/℃",null,null,"8～17×10^-6/℃",null,null,"9～17×10＾-6/℃",null,null,"9～17×10＾-6/℃",null,null,"9～17×10＾-6/℃",null,null,"8～17×10^-6/℃",null,null,"8～17×10^-6/℃",null,null,"8～17×10^-6/℃",null,null,"8～17×10^-6/℃",null,null,"9～17×10＾-6/℃",null,null,"8～17×10^-6/℃",null,null,"9～17×10＾-6/℃",null,null,"9～11×10^-6/℃",null,null,"9～10×10＾-6/℃",null,null,"9～17×10＾-6/℃",null,null,"11～14×10＾-6/℃",null,null,"8～17×10^-6/℃",null,null,"8～17×10^-6/℃",null,null,"7～9×10^-6/℃",null,null,"-",null,null,"8～17×10^-6/℃",null,null,"9～17×10＾-6/℃",null,null,"9～11×10＾-6/℃",null,null,"9～17×10＾-6/℃",null,null,"8～17×10^-6/℃",null,null,"8～17×10^-6/℃",null,null,"8～17×10^-6/℃",null,null,"8～17×10^-6/℃",null,null,"9～17×10＾-6/℃",null,null,"8～17×10^-6/℃",null,null,"8～17×10^-6/℃",null,null,"／",null,null,"／",null,null,"／",null,null,"／"]

{"sheet":"仕様の整理","index":5,"n_rows":47,"n_cols":55,"rows_kept":47,"cut":false,"hidden":false,"merged":[[1,39,2,39],[1,20,1,22],[1,16,1,19],[1,13,1,15],[1,10,1,12],[1,24,2,24],[1,23,2,23],[1,29,2,29],[1,34,2,34]]}
[null," 対象工種の仕様の整理",null,null,"登録技術：",{"$f":"SUMPRODUCT((E4:E1000<>\"\")/COUNTIF(E4:E1000,E4:E1000&\"\"))&\"技術\"&MAX(B:B)&\"仕様\"","v":"29技術44仕様"},"検索結果：",{"$f":"\"\"&SUM(IF((A4:A1000<>\"\")*(A4:A1000<>\"-\")*(E4:E1000<>\"\"),1/COUNTIFS(A4:A1000,\"<>\",A4:A1000,\"<>-\",E4:E1000,E4:E1000)))&\"技術\"&COUNT(A:A)&\"仕様\"","v":"29技術44仕様"},null,null,null,null,null,null,null,null,null,null,null,null,null,null,null,"→検索結果",null,null,null,null,null,null,null,null,null,null,null,null,null,null,null,null,null,null,null,null,"→絶対順位"]
[null,"基本情報",null,null,null,null,null,null,null,null,"補修規模",null,null,"劣化機構",null,null,"現場で必要とされる性能",null,null,null,"補修部位の位置（施工の方向）",null,null,"条件一致","補修規模","特に指定しない","小規模","中規模","大規模","劣化機構","特に指定しない","中性化","塩害","凍害","現場","特に指定しない","防錆性","速硬性","その他","施工方向","特に指定しない","﻿上向き","横向き","下向き"]
["検索順位","番号","技術\n番号","技術名","NETIS番号","技術の種類","審議終了技術","更新日","種類","補修材料","小規模","中規模","大規模","中性化","塩害","凍害","防錆性","速硬性","耐摩耗性","プライマー処理不要","﻿上向き","横向き","下向き",null,null,{"$f":"検索!S6","v":false},{"$f":"検索!S7","v":false},{"$f":"検索!S8","v":false},{"$f":"検索!S9","v":false},null,{"$f":"検索!S10","v":false},{"$f":"検索!S11","v":false},{"$f":"検索!S12","v":false},{"$f":"検索!S13","v":false},null,{"$f":"検索!S14","v":false},{"$f":"検索!S15","v":false},{"$f":"検索!S16","v":false},{"$f":"検索!S17","v":false},null,{"$f":"検索!S18","v":false},{"$f":"検索!S19","v":false},{"$f":"検索!S20","v":false},{"$f":"検索!S21","v":false},"九州本社","Aの技術","九州でA","記号","登録年度","登録番号","審議終了","仕様","地整","重み付け","絶対順位"]
[{"$f":"IF(検索!$U$1=\"条件検索\", IF(X4=\"○\", COUNTIFS(X:X,\"○\",BC:BC,\"<\"&BC4)+1, \"-\"), IF(検索!$U$1=\"技術名検索\", IF(検索!$B$30=仕様の整理!E4, 仕様の整理!BC4, \"-\"), \"-\"))","v":40},1,"1-1","N-SSI工法","KK-100009-VG","NETIS掲載期間終了技術","○","令和7年11月","左官工法","遮塩モルタルRP200（ポリマーセメントモルタル系）","○","○",null,null,null,null,"○",null,null,null,"○","○","○",{"$f":"IF(AND(Y4=\"○\",AD4=\"○\",AI4=\"○\",AN4=\"○\"),\"○\",\"×\")","v":"○"},{"$f":"IF(OR(Z4=\"○\", COUNTIF(AA4:AC4,\"○\")>0,COUNTIF($Z$3:$AC$3,FALSE)=4),\"○\",\"×\")","v":"○"},{"$f":"IF(Z$3=TRUE,\"○\",\"×\")","v":"×"},{"$f":"IF(AND(AA$3=TRUE,K4=\"○\"),\"○\",\"×\")","v":"×"},{"$f":"IF(AND(AB$3=TRUE,L4=\"○\"),\"○\",\"×\")","v":"×"},{"$f":"IF(AND(AC$3=TRUE,M4=\"○\"),\"○\",\"×\")","v":"×"},{"$f":"IF(OR(AE4=\"○\", COUNTIF(AF4:AH4,\"○\")>0,COUNTIF($AE$3:$AH$3,FALSE)=4),\"○\",\"×\")","v":"○"},{"$f":"IF(AE$3=TRUE,\"○\",\"×\")","v":"×"},{"$f":"IF(AND(AF$3=TRUE,N4=\"○\"),\"○\",\"×\")","v":"×"},{"$f":"IF(AND(AG$3=TRUE,O4=\"○\"),\"○\",\"×\")","v":"×"},"×",{"$f":"IF(OR(AJ4=\"○\", COUNTIF(AK4:AM4,\"○\")>0,COUNTIF($AJ$3:$AM$3,FALSE)=4),\"○\",\"×\")","v":"○"},{"$f":"IF(AJ$3=TRUE,\"○\",\"×\")","v":"×"},{"$f":"IF(AND(AK$3=TRUE,Q4=\"○\"),\"○\",\"×\")","v":"×"},{"$f":"IF(AND(AL$3=TRUE,R4=\"○\"),\"○\",\"×\")","v":"×"},{"$f":"IF(AND(AM$3=TRUE,OR(S4=\"○\",T4=\"○\")),\"○\",\"×\")","v":"×"},{"$f":"IF(OR(AO4=\"○\", COUNTIF(AP4:AR4,\"○\")>0,COUNTIF($AO$3:$AR$3,FALSE)=4),\"○\",\"×\")","v":"○"},{"$f":"IF(AO$3=TRUE,\"○\",\"×\")","v":"×"},{"$f":"IF(AND(AP$3=TRUE,U4=\"○\"),\"○\",\"×\")","v":"×"},{"$f":"IF(AND(AQ$3=TRUE,V4=\"○\"),\"○\",\"×\")","v":"×"},"×",{"$f":"HLOOKUP($C4,DB!$1:$1048576,9,0)","v":"-"},{"$f":"RIGHT(E4,LEN(E4)-FIND(\"-\",E4,FIND(\"-\",E4)+1))","v":"VG"},{"$f":"IF(AND(AS4=\"◎\",AT4=\"A\"),1,2)","v":2},{"$f":"VLOOKUP(AT4,条件!D:E,2,0)","v":2},{"$f":"IFERROR(IF(VALUE(LEFT(MID(E4,FIND(\"-\",E4)+1,FIND(\"-\",E4,FIND(\"-\",E4)+1)-FIND(\"-\",E4)-1),2))>=90,\"19\"&LEFT(MID(E4,FIND(\"-\",E4)+1,FIND(\"-\",E4,FIND(\"-\",E4)+1)-FIND(\"-\",E4)-1),2),\"20\"&LEFT(MID(E4,FIND(\"-\",E4)+1,FIND(\"-\",E4,FIND(\"-\",E4)+1)-FIND(\"-\",E4)-1),2)),\"\")","v":"2010"},{"$f":"MID(E4, FIND(\"-\", E4) + 3, FIND(\"-\", E4, FIND(\"-\", E4) + 1) - FIND(\"-\", E4) - 3)","v":"0009"},{"$f":"IF(G4=\"\",2,1)","v":1},{"$f":"MID(C4,FIND(\"-\",C4)+1,LEN(C4))","v":"1"},{"$f":"VLOOKUP(LEFT(E4,2),条件!A:B,2,0)","v":"04"},{"$f":"(AU4&AV4&AW4&AX4&AY4&TEXT(AZ4,\"00\")&BA4)*1","v":222010000910104},{"$f":"_xlfn.RANK.EQ(BB4,BB:BB,1)","v":40}]
[{"$f":"IF(検索!$U$1=\"条件検索\", IF(X5=\"○\", COUNTIFS(X:X,\"○\",BC:BC,\"<\"&BC5)+1, \"-\"), IF(検索!$U$1=\"技術名検索\", IF(検索!$B$30=仕様の整理!E5, 仕様の整理!BC5, \"-\"), \"-\"))","v":41},2,"1-2","N-SSI工法","KK-100009-VG","NETIS掲載期間終了技術","○","令和7年11月","吹付け工法（湿式）","遮塩モルタルRP200（ポリマーセメントモルタル系）",null,"○","○","○","○","○","○",null,null,null,"○","○","○",{"$f":"IF(AND(Y5=\"○\",AD5=\"○\",AI5=\"○\",AN5=\"○\"),\"○\",\"×\")","v":"○"},{"$f":"IF(OR(Z5=\"○\", COUNTIF(AA5:AC5,\"○\")>0,COUNTIF($Z$3:$AC$3,FALSE)=4),\"○\",\"×\")","v":"○"},{"$f":"IF(Z$3=TRUE,\"○\",\"×\")","v":"×"},{"$f":"IF(AND(AA$3=TRUE,K5=\"○\"),\"○\",\"×\")","v":"×"},{"$f":"IF(AND(AB$3=TRUE,L5=\"○\"),\"○\",\"×\")","v":"×"},{"$f":"IF(AND(AC$3=TRUE,M5=\"○\"),\"○\",\"×\")","v":"×"},{"$f":"IF(OR(AE5=\"○\", COUNTIF(AF5:AH5,\"○\")>0,COUNTIF($AE$3:$AH$3,FALSE)=4),\"○\",\"×\")","v":"○"},{"$f":"IF(AE$3=TRUE,\"○\",\"×\")","v":"×"},{"$f":"IF(AND(AF$3=TRUE,N5=\"○\"),\"○\",\"×\")","v":"×"},{"$f":"IF(AND(AG$3=TRUE,O5=\"○\"),\"○\",\"×\")","v":"×"},{"$f":"IF(AND(AH$3=TRUE,P5=\"○\"),\"○\",\"×\")","v":"×"},{"$f":"IF(OR(AJ5=\"○\", COUNTIF(AK5:AM5,\"○\")>0,COUNTIF($AJ$3:$AM$3,FALSE)=4),\"○\",\"×\")","v":"○"},{"$f":"IF(AJ$3=TRUE,\"○\",\"×\")","v":"×"},{"$f":"IF(AND(AK$3=TRUE,Q5=\"○\"),\"○\",\"×\")","v":"×"},{"$f":"IF(AND(AL$3=TRUE,R5=\"○\"),\"○\",\"×\")","v":"×"},{"$f":"IF(AND(AM$3=TRUE,OR(S5=\"○\",T5=\"○\")),\"○\",\"×\")","v":"×"},{"$f":"IF(OR(AO5=\"○\", COUNTIF(AP5:AR5,\"○\")>0,COUNTIF($AO$3:$AR$3,FALSE)=4),\"○\",\"×\")","v":"○"},{"$f":"IF(AO$3=TRUE,\"○\",\"×\")","v":"×"},{"$f":"IF(AND(AP$3=TRUE,U5=\"○\"),\"○\",\"×\")","v":"×"},{"$f":"IF(AND(AQ$3=TRUE,V5=\"○\"),\"○\",\"×\")","v":"×"},{"$f":"IF(AND(AR$3=TRUE,W5=\"○\"),\"○\",\"×\")","v":"×"},{"$f":"HLOOKUP($C5,DB!$1:$1048576,9,0)","v":"-"},"VG",{"$f":"IF(AND(AS5=\"◎\",AT5=\"A\"),1,2)","v":2},{"$f":"VLOOKUP(AT5,条件!D:E,2,0)","v":2},"2010","0009",{"$f":"IF(G5=\"\",2,1)","v":1},"2",{"$f":"VLOOKUP(LEFT(E5,2),条件!A:B,2,0)","v":"04"},{"$f":"(AU5&AV5&AW5&AX5&AY5&TEXT(AZ5,\"00\")&BA5)*1","v":222010000910204},{"$f":"_xlfn.RANK.EQ(BB5,BB:BB,1)","v":41}]
[{"$f":"IF(検索!$U$1=\"条件検索\", IF(X6=\"○\", COUNTIFS(X:X,\"○\",BC:BC,\"<\"&BC6)+1, \"-\"), IF(検索!$U$1=\"技術名検索\", IF(検索!$B$30=仕様の整理!E6, 仕様の整理!BC6, \"-\"), \"-\"))","v":42},3,"1-3","N-SSI工法","KK-100009-VG","NETIS掲載期間終了技術","○","令和7年11月","充填工法","遮塩モルタルRP310Ｇ（ポリマーセメントモルタル系）",null,"○","○","○","○","○","○",null,null,null,null,"○","○",{"$f":"IF(AND(Y6=\"○\",AD6=\"○\",AI6=\"○\",AN6=\"○\"),\"○\",\"×\")","v":"○"},"○","×","×","×","×","○","×","×","×","×","○","×","×","×","×","○","×","×","×","×",{"$f":"HLOOKUP($C6,DB!$1:$1048576,9,0)","v":"-"},"VG",2,{"$f":"VLOOKUP(AT6,条件!D:E,2,0)","v":2},"2010","0009",1,"3",{"$f":"VLOOKUP(LEFT(E6,2),条件!A:B,2,0)","v":"04"},222010000910304,42]
[{"$f":"IF(検索!$U$1=\"条件検索\", IF(X7=\"○\", COUNTIFS(X:X,\"○\",BC:BC,\"<\"&BC7)+1, \"-\"), IF(検索!$U$1=\"技術名検索\", IF(検索!$B$30=仕様の整理!E7, 仕様の整理!BC7, \"-\"), \"-\"))","v":43},4,"3-1","高炉スラグ・繊維入りポリマーセメントモルタル「エフモル」","HK-110049-VG","NETIS掲載期間終了技術","○","令和7年11月","左官工法","タフショットクリート（セメントモルタル系）","○","○",null,"○","○","○",null,null,null,"○","○","○","○","○","○","×","×","×","×","○","×","×","×","×","○","×","×","×","×","○","×","×","×","×",{"$f":"HLOOKUP($C7,DB!$1:$1048576,9,0)","v":"-"},"VG",2,{"$f":"VLOOKUP(AT7,条件!D:E,2,0)","v":2},"2011","0049",1,"1",{"$f":"VLOOKUP(LEFT(E7,2),条件!A:B,2,0)","v":"09"},222011004910109,43]
[{"$f":"IF(検索!$U$1=\"条件検索\", IF(X8=\"○\", COUNTIFS(X:X,\"○\",BC:BC,\"<\"&BC8)+1, \"-\"), IF(検索!$U$1=\"技術名検索\", IF(検索!$B$30=仕様の整理!E8, 仕様の整理!BC8, \"-\"), \"-\"))","v":44},5,"3-2","高炉スラグ・繊維入りポリマーセメントモルタル「エフモル」","HK-110049-VG","NETIS掲載期間終了技術","○","令和7年11月","吹付け工法（湿式）","タフショットクリート（セメントモルタル系）",null,"○","○","○","○","○",null,null,null,"○","○","○","○","○","○","×","×","×","×","○","×","×","×","×","○","×","×","×","×","○","×","×","×","×",{"$f":"HLOOKUP($C8,DB!$1:$1048576,9,0)","v":"-"},"VG",2,{"$f":"VLOOKUP(AT8,条件!D:E,2,0)","v":2},"2011","0049",1,"2",{"$f":"VLOOKUP(LEFT(E8,2),条件!A:B,2,0)","v":"09"},222011004910209,44]
[{"$f":"IF(検索!$U$1=\"条件検索\", IF(X9=\"○\", COUNTIFS(X:X,\"○\",BC:BC,\"<\"&BC9)+1, \"-\"), IF(検索!$U$1=\"技術名検索\", IF(検索!$B$30=仕様の整理!E9, 仕様の整理!BC9, \"-\"), \"-\"))","v":1},6,"7-1","NCショット","QS-150001-VE","有用な新技術","○","令和7年11月","左官工法","NC ショットM（標準タイプ）","○","○",null,"○",null,"○",null,null,null,null,"○","○","○","○","○","×","×","×","×","○","×","×","×","×","○","×","×","×","×","○","×","×","×","×",{"$f":"HLOOKUP($C9,DB!$1:$1048576,9,0)","v":"◎"},"VE",2,{"$f":"VLOOKUP(AT9,条件!D:E,2,0)","v":1},"2015","0001",1,"1",{"$f":"VLOOKUP(LEFT(E9,2),条件!A:B,2,0)","v":"01"},212015000110101,1]
[{"$f":"IF(検索!$U$1=\"条件検索\", IF(X10=\"○\", COUNTIFS(X:X,\"○\",BC:BC,\"<\"&BC10)+1, \"-\"), IF(検索!$U$1=\"技術名検索\", IF(検索!$B$30=仕様の整理!E10, 仕様の整理!BC10, \"-\"), \"-\"))","v":2},7,"7-2","NCショット","QS-150001-VE","有用な新技術","○","令和7年11月","左官工法","NC ショットL（速硬・軽量タイプ）","○","○",null,"○",null,"○",null,"○",null,null,"○","○","○","○","○","×","×","×","×","○","×","×","×","×","○","×","×","×","×","○","×","×","×","×",{"$f":"HLOOKUP($C10,DB!$1:$1048576,9,0)","v":"◎"},"VE",2,{"$f":"VLOOKUP(AT10,条件!D:E,2,0)","v":1},"2015","0001",1,"2",{"$f":"VLOOKUP(LEFT(E10,2),条件!A:B,2,0)","v":"01"},212015000110201,2]
[{"$f":"IF(検索!$U$1=\"条件検索\", IF(X11=\"○\", COUNTIFS(X:X,\"○\",BC:BC,\"<\"&BC11)+1, \"-\"), IF(検索!$U$1=\"技術名検索\", IF(検索!$B$30=仕様の整理!E11, 仕様の整理!BC11, \"-\"), \"-\"))","v":3},8,"9-1","コンクリート構造物の断面修復材料「ゴムラテシリーズ」用モルタル）","QS-150017-VE","有用な新技術","○","令和7年11月","左官工法","ポットホール用モルタル［損傷程度：小(ポットホール)］（ポリマーセメントモルタル系）","○","○",null,"○","○","○",null,"○",null,null,null,null,"○","○","○","×","×","×","×","○","×","×","×","×","○","×","×","×","×","○","×","×","×","×",{"$f":"HLOOKUP($C11,DB!$1:$1048576,9,0)","v":"-"},"VE",2,{"$f":"VLOOKUP(AT11,条件!D:E,2,0)","v":1},"2015","0017",1,"1",{"$f":"VLOOKUP(LEFT(E11,2),条件!A:B,2,0)","v":"01"},212015001710101,3]
[{"$f":"IF(検索!$U$1=\"条件検索\", IF(X12=\"○\", COUNTIFS(X:X,\"○\",BC:BC,\"<\"&BC12)+1, \"-\"), IF(検索!$U$1=\"技術名検索\", IF(検索!$B$30=仕様の整理!E12, 仕様の整理!BC12, \"-\"), \"-\"))","v":4},9,"9-2","コンクリート構造物の断面修復材料「ゴムラテシリーズ」用モルタル）","QS-150017-VE","有用な新技術","○","令和7年11月","左官工法","ゴムラテモルタル［損傷程度：中(鉄筋上面まで)］（ポリマーセメントモルタル系）","○","○",null,"○","○","○",null,"○",null,null,null,null,"○","○","○","×","×","×","×","○","×","×","×","×","○","×","×","×","×","○","×","×","×","×",{"$f":"HLOOKUP($C12,DB!$1:$1048576,9,0)","v":"-"},"VE",2,{"$f":"VLOOKUP(AT12,条件!D:E,2,0)","v":1},"2015","0017",1,"2",{"$f":"VLOOKUP(LEFT(E12,2),条件!A:B,2,0)","v":"01"},212015001710201,4]
[{"$f":"IF(検索!$U$1=\"条件検索\", IF(X13=\"○\", COUNTIFS(X:X,\"○\",BC:BC,\"<\"&BC13)+1, \"-\"), IF(検索!$U$1=\"技術名検索\", IF(検索!$B$30=仕様の整理!E13, 仕様の整理!BC13, \"-\"), \"-\"))","v":5},10,"9-3","コンクリート構造物の断面修復材料「ゴムラテシリーズ」用モルタル）","QS-150017-VE","有用な新技術","○","令和7年11月","左官工法","ゴムラテコンクリート［損傷程度：大(鉄筋下面まで)］（ポリマーセメントモルタル系）","○","○",null,"○","○","○",null,"○",null,null,null,null,"○","○","○","×","×","×","×","○","×","×","×","×","○","×","×","×","×","○","×","×","×","×",{"$f":"HLOOKUP($C13,DB!$1:$1048576,9,0)","v":"-"},"VE",2,{"$f":"VLOOKUP(AT13,条件!D:E,2,0)","v":1},"2015","0017",1,"3",{"$f":"VLOOKUP(LEFT(E13,2),条件!A:B,2,0)","v":"01"},212015001710301,5]
[{"$f":"IF(検索!$U$1=\"条件検索\", IF(X14=\"○\", COUNTIFS(X:X,\"○\",BC:BC,\"<\"&BC14)+1, \"-\"), IF(検索!$U$1=\"技術名検索\", IF(検索!$B$30=仕様の整理!E14, 仕様の整理!BC14, \"-\"), \"-\"))","v":6},11,"10-1","塩害対策用断面修復材「デンカクロルフィックス」","KT-150080-VR","事後評価済技術","○","令和7年11月","左官工法","RISクロルフィックスエース（ポリマーセメントモルタル系）","○","○",null,"○","○",null,null,null,null,null,"○","○","○","○","○","×","×","×","×","○","×","×","×","×","○","×","×","×","×","○","×","×","×","×",{"$f":"HLOOKUP($C14,DB!$1:$1048576,9,0)","v":"-"},"VR",2,{"$f":"VLOOKUP(AT14,条件!D:E,2,0)","v":1},"2015","0080",1,"1",{"$f":"VLOOKUP(LEFT(E14,2),条件!A:B,2,0)","v":"07"},212015008010107,6]
[{"$f":"IF(検索!$U$1=\"条件検索\", IF(X15=\"○\", COUNTIFS(X:X,\"○\",BC:BC,\"<\"&BC15)+1, \"-\"), IF(検索!$U$1=\"技術名検索\", IF(検索!$B$30=仕様の整理!E15, 仕様の整理!BC15, \"-\"), \"-\"))","v":7},12,"10-2","塩害対策用断面修復材「デンカクロルフィックス」","KT-150080-VR","事後評価済技術","○","令和7年11月","吹付け工法（湿式）","クロルフィックスショット（ポリマーセメントモルタル系）",null,"○","○","○","○",null,null,null,null,null,"○","○","○","○","○","×","×","×","×","○","×","×","×","×","○","×","×","×","×","○","×","×","×","×",{"$f":"HLOOKUP($C15,DB!$1:$1048576,9,0)","v":"-"},"VR",2,{"$f":"VLOOKUP(AT15,条件!D:E,2,0)","v":1},"2015","0080",1,"2",{"$f":"VLOOKUP(LEFT(E15,2),条件!A:B,2,0)","v":"07"},212015008010207,7]
[{"$f":"IF(検索!$U$1=\"条件検索\", IF(X16=\"○\", COUNTIFS(X:X,\"○\",BC:BC,\"<\"&BC16)+1, \"-\"), IF(検索!$U$1=\"技術名検索\", IF(検索!$B$30=仕様の整理!E16, 仕様の整理!BC16, \"-\"), \"-\"))","v":39},13,"13-1","コンクリート構造物の断面修復乾式吹付け工法","CB-020040-VG","NETIS掲載期間終了技術","○","令和7年11月","吹付け工法（乾式）","StoCrete TS100（ポリマーセメントモルタル系）",null,"○","○","○","○","○",null,null,null,null,"○","○",null,"○","○","×","×","×","×","○","×","×","×","×","○","×","×","×","×","○","×","×","×","×",{"$f":"HLOOKUP($C16,DB!$1:$1048576,9,0)","v":"-"},"VG",2,{"$f":"VLOOKUP(AT16,条件!D:E,2,0)","v":2},"2002","0040",1,"1",{"$f":"VLOOKUP(LEFT(E16,2),条件!A:B,2,0)","v":"05"},222002004010105,39]
[{"$f":"IF(検索!$U$1=\"条件検索\", IF(X17=\"○\", COUNTIFS(X:X,\"○\",BC:BC,\"<\"&BC17)+1, \"-\"), IF(検索!$U$1=\"技術名検索\", IF(検索!$B$30=仕様の整理!E17, 仕様の整理!BC17, \"-\"), \"-\"))","v":8},14,"14-1","LCユニット工法","SK-170011-A","事後評価未実施技術","○","令和7年11月","吹付け工法","LCモルタル（ポリマーモルタル系）",null,"○","○","○","○","○",null,null,"○",null,"○","○","○","○","○","×","×","×","×","○","×","×","×","×","○","×","×","×","×","○","×","×","×","×",{"$f":"HLOOKUP($C17,DB!$1:$1048576,9,0)","v":"-"},"A",2,{"$f":"VLOOKUP(AT17,条件!D:E,2,0)","v":1},"2017","0011",1,"1",{"$f":"VLOOKUP(LEFT(E17,2),条件!A:B,2,0)","v":"02"},212017001110102,8]
[{"$f":"IF(検索!$U$1=\"条件検索\", IF(X18=\"○\", COUNTIFS(X:X,\"○\",BC:BC,\"<\"&BC18)+1, \"-\"), IF(検索!$U$1=\"技術名検索\", IF(検索!$B$30=仕様の整理!E18, 仕様の整理!BC18, \"-\"), \"-\"))","v":9},15,"15-1","繊維補強超速硬ポリマーセメントモルタル「リフレモルセットSF」","KT-170058-VE","有用な新技術","○","令和7年11月","左官工法","リフレモルセットSF（ポリマーセメントモルタル系）","○","○",null,null,null,"○",null,"○",null,null,null,null,"○","○","○","×","×","×","×","○","×","×","×","×","○","×","×","×","×","○","×","×","×","×",{"$f":"HLOOKUP($C18,DB!$1:$1048576,9,0)","v":"-"},"VE",2,{"$f":"VLOOKUP(AT18,条件!D:E,2,0)","v":1},"2017","0058",1,"1",{"$f":"VLOOKUP(LEFT(E18,2),条件!A:B,2,0)","v":"07"},212017005810107,9]
[{"$f":"IF(検索!$U$1=\"条件検索\", IF(X19=\"○\", COUNTIFS(X:X,\"○\",BC:BC,\"<\"&BC19)+1, \"-\"), IF(検索!$U$1=\"技術名検索\", IF(検索!$B$30=仕様の整理!E19, 仕様の整理!BC19, \"-\"), \"-\"))","v":10},16,"16-1","湿潤面対応急速硬化補修材","KT-170061-A","事後評価未実施技術","○","令和7年11月","左官工法","湿潤面対応急速硬化補修材（ポリマーモルタル系）","○","○",null,null,null,null,null,"○",null,null,null,"○",null,"○","○","×","×","×","×","○","×","×","×","×","○","×","×","×","×","○","×","×","×","×",{"$f":"HLOOKUP($C19,DB!$1:$1048576,9,0)","v":"-"},"A",2,{"$f":"VLOOKUP(AT19,条件!D:E,2,0)","v":1},"2017","0061",1,"1",{"$f":"VLOOKUP(LEFT(E19,2),条件!A:B,2,0)","v":"07"},212017006110107,10]
[{"$f":"IF(検索!$U$1=\"条件検索\", IF(X20=\"○\", COUNTIFS(X:X,\"○\",BC:BC,\"<\"&BC20)+1, \"-\"), IF(検索!$U$1=\"技術名検索\", IF(検索!$B$30=仕様の整理!E20, 仕様の整理!BC20, \"-\"), \"-\"))","v":11},17,"17-1","速硬系ポリマーセメントモルタル「U-リペアパッチEX、U-リペアライトEX」","TH-180003-VE","事後評価済技術","○","令和7年11月","左官工法","U‐リペアパッチEX（ポリマーモルタル系）","○","○",null,null,null,null,null,"○",null,null,null,"○",null,"○","○","×","×","×","×","○","×","×","×","×","○","×","×","×","×","○","×","×","×","×",{"$f":"HLOOKUP($C20,DB!$1:$1048576,9,0)","v":"-"},"VE",2,{"$f":"VLOOKUP(AT20,条件!D:E,2,0)","v":1},"2018","0003",1,"1",{"$f":"VLOOKUP(LEFT(E20,2),条件!A:B,2,0)","v":"08"},212018000310108,11]
[{"$f":"IF(検索!$U$1=\"条件検索\", IF(X21=\"○\", COUNTIFS(X:X,\"○\",BC:BC,\"<\"&BC21)+1, \"-\"), IF(検索!$U$1=\"技術名検索\", IF(検索!$B$30=仕様の整理!E21, 仕様の整理!BC21, \"-\"), \"-\"))","v":12},18,"17-2","速硬系ポリマーセメントモルタル「U-リペアパッチEX、U-リペアライトEX」","TH-180003-VE","事後評価済技術","○","令和7年11月","左官工法","U‐リペアライトEX（ポリマーモルタル系）","○","○",null,null,null,null,null,"○",null,null,null,"○",null,"○","○","×","×","×","×","○","×","×","×","×","○","×","×","×","×","○","×","×","×","×",{"$f":"HLOOKUP($C21,DB!$1:$1048576,9,0)","v":"-"},"VE",2,{"$f":"VLOOKUP(AT21,条件!D:E,2,0)","v":1},"2018","0003",1,"2",{"$f":"VLOOKUP(LEFT(E21,2),条件!A:B,2,0)","v":"08"},212018000310208,12]
[{"$f":"IF(検索!$U$1=\"条件検索\", IF(X22=\"○\", COUNTIFS(X:X,\"○\",BC:BC,\"<\"&BC22)+1, \"-\"), IF(検索!$U$1=\"技術名検索\", IF(検索!$B$30=仕様の整理!E22, 仕様の整理!BC22, \"-\"), \"-\"))","v":13},19,"18-1","エマルジョン型ポリマー乾式吹付け工法","KTK-180004-VE","事後評価済技術","○","令和7年11月","吹付け工法","ポリマーセメントモルタル系",null,"○","○","○","○","○",null,null,null,null,"○","○","○","○","○","×","×","×","×","○","×","×","×","×","○","×","×","×","×","○","×","×","×","×",{"$f":"HLOOKUP($C22,DB!$1:$1048576,9,0)","v":"-"},"VE",2,{"$f":"VLOOKUP(AT22,条件!D:E,2,0)","v":1},"2018","0004",1,"1",{"$f":"VLOOKUP(LEFT(E22,2),条件!A:B,2,0)","v":"07"},212018000410107,13]
[{"$f":"IF(検索!$U$1=\"条件検索\", IF(X23=\"○\", COUNTIFS(X:X,\"○\",BC:BC,\"<\"&BC23)+1, \"-\"), IF(検索!$U$1=\"技術名検索\", IF(検索!$B$30=仕様の整理!E23, 仕様の整理!BC23, \"-\"), \"-\"))","v":16},20,"19-1","セルガード","KT-180077-A","事後評価未実施技術","○","令和7年11月","左官工法","セルガード（ポリマーセメントモルタル系）","○","○",null,null,"○","○","○",null,null,null,"○","○","○","○","○","×","×","×","×","○","×","×","×","×","○","×","×","×","×","○","×","×","×","×",{"$f":"HLOOKUP($C23,DB!$1:$1048576,9,0)","v":"-"},"A",2,{"$f":"VLOOKUP(AT23,条件!D:E,2,0)","v":1},"2018","0077",1,"1",{"$f":"VLOOKUP(LEFT(E23,2),条件!A:B,2,0)","v":"07"},212018007710107,16]
[{"$f":"IF(検索!$U$1=\"条件検索\", IF(X24=\"○\", COUNTIFS(X:X,\"○\",BC:BC,\"<\"&BC24)+1, \"-\"), IF(検索!$U$1=\"技術名検索\", IF(検索!$B$30=仕様の整理!E24, 仕様の整理!BC24, \"-\"), \"-\"))","v":17},21,"19-2","セルガード","KT-180077-A","事後評価未実施技術","○","令和7年11月","吹付け工法","セルガード（ポリマーセメントモルタル系）",null,"○","○",null,"○","○","○",null,null,null,"○","○","○","○","○","×","×","×","×","○","×","×","×","×","○","×","×","×","×","○","×","×","×","×",{"$f":"HLOOKUP($C24,DB!$1:$1048576,9,0)","v":"-"},"A",2,{"$f":"VLOOKUP(AT24,条件!D:E,2,0)","v":1},"2018","0077",1,"2",{"$f":"VLOOKUP(LEFT(E24,2),条件!A:B,2,0)","v":"07"},212018007710207,17]
[{"$f":"IF(検索!$U$1=\"条件検索\", IF(X25=\"○\", COUNTIFS(X:X,\"○\",BC:BC,\"<\"&BC25)+1, \"-\"), IF(検索!$U$1=\"技術名検索\", IF(検索!$B$30=仕様の整理!E25, 仕様の整理!BC25, \"-\"), \"-\"))","v":14},22,"20-1","高耐久性断面修復工法「タフショットクリート工法」","QS-180044-A","事後評価未実施技術","○","令和7年11月","左官工法","タフショットクリート（セメントモルタル系）","○","○",null,"○","○","○",null,null,null,null,"○","○","○","○","○","×","×","×","×","○","×","×","×","×","○","×","×","×","×","○","×","×","×","×",{"$f":"HLOOKUP($C25,DB!$1:$1048576,9,0)","v":"-"},"A",2,{"$f":"VLOOKUP(AT25,条件!D:E,2,0)","v":1},"2018","0044",1,"1",{"$f":"VLOOKUP(LEFT(E25,2),条件!A:B,2,0)","v":"01"},212018004410101,14]
[{"$f":"IF(検索!$U$1=\"条件検索\", IF(X26=\"○\", COUNTIFS(X:X,\"○\",BC:BC,\"<\"&BC26)+1, \"-\"), IF(検索!$U$1=\"技術名検索\", IF(検索!$B$30=仕様の整理!E26, 仕様の整理!BC26, \"-\"), \"-\"))","v":15},23,"20-2","高耐久性断面修復工法「タフショットクリート工法」","QS-180044-A","事後評価未実施技術","○","令和7年11月","吹付け工法","タフショットクリート（セメントモルタル系）",null,"○","○","○","○","○",null,null,null,null,"○","○","○","○","○","×","×","×","×","○","×","×","×","×","○","×","×","×","×","○","×","×","×","×",{"$f":"HLOOKUP($C26,DB!$1:$1048576,9,0)","v":"-"},"A",2,{"$f":"VLOOKUP(AT26,条件!D:E,2,0)","v":1},"2018","0044",1,"2",{"$f":"VLOOKUP(LEFT(E26,2),条件!A:B,2,0)","v":"01"},212018004410201,15]
[{"$f":"IF(検索!$U$1=\"条件検索\", IF(X27=\"○\", COUNTIFS(X:X,\"○\",BC:BC,\"<\"&BC27)+1, \"-\"), IF(検索!$U$1=\"技術名検索\", IF(検索!$B$30=仕様の整理!E27, 仕様の整理!BC27, \"-\"), \"-\"))","v":18},24,"21-1","塩分吸着型 乾式吹付工法","KT-190023-A","事後評価未実施技術","○","令和7年11月","吹付け工法","塩分吸着剤を混合したポリマーセメントモルタル（ポリマーセメントモルタル系）",null,"○","○",null,"○",null,null,null,null,"○","○","○",null,"○","○","×","×","×","×","○","×","×","×","×","○","×","×","×","×","○","×","×","×","×",{"$f":"HLOOKUP($C27,DB!$1:$1048576,9,0)","v":"-"},"A",2,{"$f":"VLOOKUP(AT27,条件!D:E,2,0)","v":1},"2019","0023",1,"1",{"$f":"VLOOKUP(LEFT(E27,2),条件!A:B,2,0)","v":"07"},212019002310107,18]
[{"$f":"IF(検索!$U$1=\"条件検索\", IF(X28=\"○\", COUNTIFS(X:X,\"○\",BC:BC,\"<\"&BC28)+1, \"-\"), IF(検索!$U$1=\"技術名検索\", IF(検索!$B$30=仕様の整理!E28, 仕様の整理!BC28, \"-\"), \"-\"))","v":19},25,"22-1","パワーグラウト(自己治癒補修材)","QS-190036-A","事後評価未実施技術","○","令和7年11月","充填工法","自己閉塞(自己治癒)する機能を有した高流動のモルタル",null,"○","○","○","○","○","○",null,null,null,null,"○",null,"○","○","×","×","×","×","○","×","×","×","×","○","×","×","×","×","○","×","×","×","×",{"$f":"HLOOKUP($C28,DB!$1:$1048576,9,0)","v":"-"},"A",2,{"$f":"VLOOKUP(AT28,条件!D:E,2,0)","v":1},"2019","0036",1,"1",{"$f":"VLOOKUP(LEFT(E28,2),条件!A:B,2,0)","v":"01"},212019003610101,19]
[{"$f":"IF(検索!$U$1=\"条件検索\", IF(X29=\"○\", COUNTIFS(X:X,\"○\",BC:BC,\"<\"&BC29)+1, \"-\"), IF(検索!$U$1=\"技術名検索\", IF(検索!$B$30=仕様の整理!E29, 仕様の整理!BC29, \"-\"), \"-\"))","v":20},26,"23-1","耐塩害タイプポリマーセメントモルタル「U-リペアパッチCT」","CG-200019-A","事後評価未実施技術","○","令和7年11月","左官工法","結合材(セメント等)、骨材、繊維、ポリマーで構成される耐塩害タイプポリマーセメントモルタル","○","○",null,null,"○",null,"○",null,null,null,"○","○","○","○","○","×","×","×","×","○","×","×","×","×","○","×","×","×","×","○","×","×","×","×",{"$f":"HLOOKUP($C29,DB!$1:$1048576,9,0)","v":"-"},"A",2,{"$f":"VLOOKUP(AT29,条件!D:E,2,0)","v":1},"2020","0019",1,"1",{"$f":"VLOOKUP(LEFT(E29,2),条件!A:B,2,0)","v":"03"},212020001910103,20]
[{"$f":"IF(検索!$U$1=\"条件検索\", IF(X30=\"○\", COUNTIFS(X:X,\"○\",BC:BC,\"<\"&BC30)+1, \"-\"), IF(検索!$U$1=\"技術名検索\", IF(検索!$B$30=仕様の整理!E30, 仕様の整理!BC30, \"-\"), \"-\"))","v":21},27,"24-1","亜硝酸リチウム併用型断面修復工法「リハビリ断面修復工法」","CG-220003-A","事後評価未実施技術","○","令和7年11月","左官工法","亜硝酸リチウムを混入した断面修復材（ポリマーセメントモルタル系）","○","○",null,"○","○",null,"○",null,null,null,"○","○",null,"○","○","×","×","×","×","○","×","×","×","×","○","×","×","×","×","○","×","×","×","×",{"$f":"HLOOKUP($C30,DB!$1:$1048576,9,0)","v":"-"},"A",2,{"$f":"VLOOKUP(AT30,条件!D:E,2,0)","v":1},"2022","0003",1,"1",{"$f":"VLOOKUP(LEFT(E30,2),条件!A:B,2,0)","v":"03"},212022000310103,21]
[{"$f":"IF(検索!$U$1=\"条件検索\", IF(X31=\"○\", COUNTIFS(X:X,\"○\",BC:BC,\"<\"&BC31)+1, \"-\"), IF(検索!$U$1=\"技術名検索\", IF(検索!$B$30=仕様の整理!E31, 仕様の整理!BC31, \"-\"), \"-\"))","v":22},28,"28-1","CPJ-L（コンパクトジェット－L）","CG-230003-A","事後評価未実施技術","○","令和7年11月","左官工法","低弾性ラテックス改質超速硬コンクリート","○","○",null,"○","○","○",null,null,"○",null,null,null,"○","○","○","×","×","×","×","○","×","×","×","×","○","×","×","×","×","○","×","×","×","×",{"$f":"HLOOKUP($C31,DB!$1:$1048576,9,0)","v":"-"},"A",2,{"$f":"VLOOKUP(AT31,条件!D:E,2,0)","v":1},"2023","0003",1,"1",{"$f":"VLOOKUP(LEFT(E31,2),条件!A:B,2,0)","v":"03"},212023000310103,22]
[{"$f":"IF(検索!$U$1=\"条件検索\", IF(X32=\"○\", COUNTIFS(X:X,\"○\",BC:BC,\"<\"&BC32)+1, \"-\"), IF(検索!$U$1=\"技術名検索\", IF(検索!$B$30=仕様の整理!E32, 仕様の整理!BC32, \"-\"), \"-\"))","v":23},29,"29-1","ポリマーセメント系無収縮グラウト材「プレユーロックスDXP」","KK-230050-A","事後評価未実施技術","○","令和7年12月","充填工法","ポリマーセメント系無収縮グラウト材",null,"○","○","○","○","○",null,null,null,null,"○","○","○","○","○","×","×","×","×","○","×","×","×","×","○","×","×","×","×","○","×","×","×","×",{"$f":"HLOOKUP($C32,DB!$1:$1048576,9,0)","v":"-"},"A",2,{"$f":"VLOOKUP(AT32,条件!D:E,2,0)","v":1},"2023","0050",1,"1",{"$f":"VLOOKUP(LEFT(E32,2),条件!A:B,2,0)","v":"04"},212023005010104,23]
[{"$f":"IF(検索!$U$1=\"条件検索\", IF(X33=\"○\", COUNTIFS(X:X,\"○\",BC:BC,\"<\"&BC33)+1, \"-\"), IF(検索!$U$1=\"技術名検索\", IF(検索!$B$30=仕様の整理!E33, 仕様の整理!BC33, \"-\"), \"-\"))","v":24},30,"30-1","HI-SPECシール工法","KK-230060-A","事後評価未実施技術","○","令和7年12月","左官工法","HI-SPECシール＋ポリマーセメントモル\nタル","○","○",null,"○","○","○",null,null,null,null,null,null,"○","○","○","×","×","×","×","○","×","×","×","×","○","×","×","×","×","○","×","×","×","×",{"$f":"HLOOKUP($C33,DB!$1:$1048576,9,0)","v":"-"},"A",2,{"$f":"VLOOKUP(AT33,条件!D:E,2,0)","v":1},"2023","0060",1,"1",{"$f":"VLOOKUP(LEFT(E33,2),条件!A:B,2,0)","v":"04"},212023006010104,24]
[{"$f":"IF(検索!$U$1=\"条件検索\", IF(X34=\"○\", COUNTIFS(X:X,\"○\",BC:BC,\"<\"&BC34)+1, \"-\"), IF(検索!$U$1=\"技術名検索\", IF(検索!$B$30=仕様の整理!E34, 仕様の整理!BC34, \"-\"), \"-\"))","v":25},31,"30-2","HI-SPECシール工法","KK-230060-A","事後評価未実施技術","○","令和7年12月","吹付け工法","HI-SPECシール＋ポリマーセメントモル\nタル",null,"○","○","○","○","○",null,null,null,null,null,null,"○","○","○","×","×","×","×","○","×","×","×","×","○","×","×","×","×","○","×","×","×","×",{"$f":"HLOOKUP($C34,DB!$1:$1048576,9,0)","v":"-"},"A",2,{"$f":"VLOOKUP(AT34,条件!D:E,2,0)","v":1},"2023","0060",1,"2",{"$f":"VLOOKUP(LEFT(E34,2),条件!A:B,2,0)","v":"04"},212023006010204,25]
[{"$f":"IF(検索!$U$1=\"条件検索\", IF(X35=\"○\", COUNTIFS(X:X,\"○\",BC:BC,\"<\"&BC35)+1, \"-\"), IF(検索!$U$1=\"技術名検索\", IF(検索!$B$30=仕様の整理!E35, 仕様の整理!BC35, \"-\"), \"-\"))","v":26},32,"31-1","断面修復材の施工間隔の短縮を図る「リプロクイック工法」","KK-230077-A","事後評価未実施技術","○","令和7年12月","左官工法","ポリマーセメントモルタル+天然無機物系凝結促進材「リプロクイック」","○","○",null,null,null,null,null,"○",null,null,"○","○","○","○","○","×","×","×","×","○","×","×","×","×","○","×","×","×","×","○","×","×","×","×",{"$f":"HLOOKUP($C35,DB!$1:$1048576,9,0)","v":"-"},"A",2,{"$f":"VLOOKUP(AT35,条件!D:E,2,0)","v":1},"2023","0077",1,"1",{"$f":"VLOOKUP(LEFT(E35,2),条件!A:B,2,0)","v":"04"},212023007710104,26]
[{"$f":"IF(検索!$U$1=\"条件検索\", IF(X36=\"○\", COUNTIFS(X:X,\"○\",BC:BC,\"<\"&BC36)+1, \"-\"), IF(検索!$U$1=\"技術名検索\", IF(検索!$B$30=仕様の整理!E36, 仕様の整理!BC36, \"-\"), \"-\"))","v":27},33,"31-2","断面修復材の施工間隔の短縮を図る「リプロクイック工法」","KK-230077-A","事後評価未実施技術","○","令和7年12月","吹付け工法","ポリマーセメントモルタル+天然無機物系凝結促進材「リプロクイック」",null,"○","○",null,null,null,null,"○",null,null,"○","○","○","○","○","×","×","×","×","○","×","×","×","×","○","×","×","×","×","○","×","×","×","×",{"$f":"HLOOKUP($C36,DB!$1:$1048576,9,0)","v":"-"},"A",2,{"$f":"VLOOKUP(AT36,条件!D:E,2,0)","v":1},"2023","0077",1,"2",{"$f":"VLOOKUP(LEFT(E36,2),条件!A:B,2,0)","v":"04"},212023007710204,27]
[{"$f":"IF(検索!$U$1=\"条件検索\", IF(X37=\"○\", COUNTIFS(X:X,\"○\",BC:BC,\"<\"&BC37)+1, \"-\"), IF(検索!$U$1=\"技術名検索\", IF(検索!$B$30=仕様の整理!E37, 仕様の整理!BC37, \"-\"), \"-\"))","v":28},34,"32-1","コンクリ欠損部補強066","KT-240012-A","事後評価未実施技術","○","令和7年12月","左官工法","変性エポキシ樹脂","○","○",null,null,null,null,"○",null,"○",null,null,"○","○","○","○","×","×","×","×","○","×","×","×","×","○","×","×","×","×","○","×","×","×","×",{"$f":"HLOOKUP($C37,DB!$1:$1048576,9,0)","v":"-"},"A",2,{"$f":"VLOOKUP(AT37,条件!D:E,2,0)","v":1},"2024","0012",1,"1",{"$f":"VLOOKUP(LEFT(E37,2),条件!A:B,2,0)","v":"07"},212024001210107,28]
[{"$f":"IF(検索!$U$1=\"条件検索\", IF(X38=\"○\", COUNTIFS(X:X,\"○\",BC:BC,\"<\"&BC38)+1, \"-\"), IF(検索!$U$1=\"技術名検索\", IF(検索!$B$30=仕様の整理!E38, 仕様の整理!BC38, \"-\"), \"-\"))","v":33},35,"33-1","ジェットモルタルシリーズ","KT-240042-A","事後評価未実施技術","○","令和7年12月","左官工法","超速硬セメントを用いたプレミックスモルタル","○","○",null,null,null,null,null,"○",null,null,null,null,"○","○","○","×","×","×","×","○","×","×","×","×","○","×","×","×","×","○","×","×","×","×",{"$f":"HLOOKUP($C38,DB!$1:$1048576,9,0)","v":"-"},"A",2,{"$f":"VLOOKUP(AT38,条件!D:E,2,0)","v":1},"2024","0042",1,"1",{"$f":"VLOOKUP(LEFT(E38,2),条件!A:B,2,0)","v":"07"},212024004210107,33]
[{"$f":"IF(検索!$U$1=\"条件検索\", IF(X39=\"○\", COUNTIFS(X:X,\"○\",BC:BC,\"<\"&BC39)+1, \"-\"), IF(検索!$U$1=\"技術名検索\", IF(検索!$B$30=仕様の整理!E39, 仕様の整理!BC39, \"-\"), \"-\"))","v":34},36,"33-2","ジェットモルタルシリーズ","KT-240042-A","事後評価未実施技術","○","令和7年12月","左官工法","超速硬セメントを用いたプレミックスモルタル","○","○",null,null,null,null,null,"○",null,null,null,null,"○","○","○","×","×","×","×","○","×","×","×","×","○","×","×","×","×","○","×","×","×","×",{"$f":"HLOOKUP($C39,DB!$1:$1048576,9,0)","v":"-"},"A",2,{"$f":"VLOOKUP(AT39,条件!D:E,2,0)","v":1},"2024","0042",1,"2",{"$f":"VLOOKUP(LEFT(E39,2),条件!A:B,2,0)","v":"07"},212024004210207,34]
[{"$f":"IF(検索!$U$1=\"条件検索\", IF(X40=\"○\", COUNTIFS(X:X,\"○\",BC:BC,\"<\"&BC40)+1, \"-\"), IF(検索!$U$1=\"技術名検索\", IF(検索!$B$30=仕様の整理!E40, 仕様の整理!BC40, \"-\"), \"-\"))","v":35},37,"33-3","ジェットモルタルシリーズ","KT-240042-A","事後評価未実施技術","○","令和7年12月","左官工法","超速硬セメントを用いたプレミックスモルタル","○","○",null,null,null,null,null,"○",null,null,null,null,"○","○","○","×","×","×","×","○","×","×","×","×","○","×","×","×","×","○","×","×","×","×",{"$f":"HLOOKUP($C40,DB!$1:$1048576,9,0)","v":"-"},"A",2,{"$f":"VLOOKUP(AT40,条件!D:E,2,0)","v":1},"2024","0042",1,"3",{"$f":"VLOOKUP(LEFT(E40,2),条件!A:B,2,0)","v":"07"},212024004210307,35]
[{"$f":"IF(検索!$U$1=\"条件検索\", IF(X41=\"○\", COUNTIFS(X:X,\"○\",BC:BC,\"<\"&BC41)+1, \"-\"), IF(検索!$U$1=\"技術名検索\", IF(検索!$B$30=仕様の整理!E41, 仕様の整理!BC41, \"-\"), \"-\"))","v":31},38,"34-1","断面修復工法「エアショットワン」","KK-240029-A","事後評価未実施技術","○","令和7年12月","吹付け工法","ポリマーセメントモルタル",null,"○","○","○","○","○",null,null,null,null,"○","○","○","○","○","×","×","×","×","○","×","×","×","×","○","×","×","×","×","○","×","×","×","×",{"$f":"HLOOKUP($C41,DB!$1:$1048576,9,0)","v":"-"},"A",2,{"$f":"VLOOKUP(AT41,条件!D:E,2,0)","v":1},"2024","0029",1,"1",{"$f":"VLOOKUP(LEFT(E41,2),条件!A:B,2,0)","v":"04"},212024002910104,31]
[{"$f":"IF(検索!$U$1=\"条件検索\", IF(X42=\"○\", COUNTIFS(X:X,\"○\",BC:BC,\"<\"&BC42)+1, \"-\"), IF(検索!$U$1=\"技術名検索\", IF(検索!$B$30=仕様の整理!E42, 仕様の整理!BC42, \"-\"), \"-\"))","v":32},39,"34-2","断面修復工法「エアショットワン」","KK-240029-A","事後評価未実施技術","○","令和7年12月","左官工法","ポリマーセメントモルタル","○","○",null,"○","○","○",null,null,null,null,"○","○","○","○","○","×","×","×","×","○","×","×","×","×","○","×","×","×","×","○","×","×","×","×",{"$f":"HLOOKUP($C42,DB!$1:$1048576,9,0)","v":"-"},"A",2,{"$f":"VLOOKUP(AT42,条件!D:E,2,0)","v":1},"2024","0029",1,"2",{"$f":"VLOOKUP(LEFT(E42,2),条件!A:B,2,0)","v":"04"},212024002910204,32]
[{"$f":"IF(検索!$U$1=\"条件検索\", IF(X43=\"○\", COUNTIFS(X:X,\"○\",BC:BC,\"<\"&BC43)+1, \"-\"), IF(検索!$U$1=\"技術名検索\", IF(検索!$B$30=仕様の整理!E43, 仕様の整理!BC43, \"-\"), \"-\"))","v":36},40,"35-1","耐摩耗性を向上させた水路補修用「ショウワRP-1工法」","KK-240067-A","事後評価未実施技術","○","令和7年12月","左官工法","ポリマーセメントモルタル","○","○",null,null,null,null,null,null,"○",null,"○","○","○","○","○","×","×","×","×","○","×","×","×","×","○","×","×","×","×","○","×","×","×","×",{"$f":"HLOOKUP($C43,DB!$1:$1048576,9,0)","v":"-"},"A",2,{"$f":"VLOOKUP(AT43,条件!D:E,2,0)","v":1},"2024","0067",1,"1",{"$f":"VLOOKUP(LEFT(E43,2),条件!A:B,2,0)","v":"04"},212024006710104,36]
[{"$f":"IF(検索!$U$1=\"条件検索\", IF(X44=\"○\", COUNTIFS(X:X,\"○\",BC:BC,\"<\"&BC44)+1, \"-\"), IF(検索!$U$1=\"技術名検索\", IF(検索!$B$30=仕様の整理!E44, 仕様の整理!BC44, \"-\"), \"-\"))","v":37},41,"36-1","シラン系鉄筋腐食抑制混和剤「プロテクトシル＠ WA CIT」","KK-250012-A","事後評価未実施技術",null,"令和7年5月","吹付け工法","ポリマーセメントモルタル",null,"○","○","○","○",null,"○",null,null,null,"○","○","○","○","○","×","×","×","×","○","×","×","×","×","○","×","×","×","×","○","×","×","×","×",{"$f":"HLOOKUP($C44,DB!$1:$1048576,9,0)","v":"-"},"A",2,{"$f":"VLOOKUP(AT44,条件!D:E,2,0)","v":1},"2025","0012",2,"1",{"$f":"VLOOKUP(LEFT(E44,2),条件!A:B,2,0)","v":"04"},212025001220104,37]
[{"$f":"IF(検索!$U$1=\"条件検索\", IF(X45=\"○\", COUNTIFS(X:X,\"○\",BC:BC,\"<\"&BC45)+1, \"-\"), IF(検索!$U$1=\"技術名検索\", IF(検索!$B$30=仕様の整理!E45, 仕様の整理!BC45, \"-\"), \"-\"))","v":38},42,"37-1","低炭素型無収縮モルタル「プレユーロックス GX」","KK-250043-A","事後評価未実施技術",null,"令和7年10月","左官工法","低炭素型無収縮モルタル","○","○",null,null,null,null,null,null,null,null,"○","○","○","○","○","×","×","×","×","○","×","×","×","×","○","×","×","×","×","○","×","×","×","×",{"$f":"HLOOKUP($C45,DB!$1:$1048576,9,0)","v":"-"},"A",2,{"$f":"VLOOKUP(AT45,条件!D:E,2,0)","v":1},"2025","0043",2,"1",{"$f":"VLOOKUP(LEFT(E45,2),条件!A:B,2,0)","v":"04"},212025004320104,38]
[{"$f":"IF(検索!$U$1=\"条件検索\", IF(X46=\"○\", COUNTIFS(X:X,\"○\",BC:BC,\"<\"&BC46)+1, \"-\"), IF(検索!$U$1=\"技術名検索\", IF(検索!$B$30=仕様の整理!E46, 仕様の整理!BC46, \"-\"), \"-\"))","v":29},43,"38-1","水溶性錆転換型防錆プライマー「リプロチェンジコート」","KK-240019-A","事後評価未実施技術",null,"令和7年10月","左官工法","防錆材","○","○",null,null,null,null,"○",null,null,null,"○","○","○","○","○","×","×","×","×","○","×","×","×","×","○","×","×","×","×","○","×","×","×","×",{"$f":"HLOOKUP($C46,DB!$1:$1048576,9,0)","v":"-"},"A",2,{"$f":"VLOOKUP(AT46,条件!D:E,2,0)","v":1},"2024","0019",2,"1",{"$f":"VLOOKUP(LEFT(E46,2),条件!A:B,2,0)","v":"04"},212024001920104,29]
[{"$f":"IF(検索!$U$1=\"条件検索\", IF(X47=\"○\", COUNTIFS(X:X,\"○\",BC:BC,\"<\"&BC47)+1, \"-\"), IF(検索!$U$1=\"技術名検索\", IF(検索!$B$30=仕様の整理!E47, 仕様の整理!BC47, \"-\"), \"-\"))","v":30},44,"39-1","複合型ケイ酸塩系鉄筋防錆材「リフレ防錆コートZN」","CB-240020-A","事後評価未実施技術",null,"令和7年10月","左官工法","防錆材","○","○",null,null,null,null,"○",null,null,null,"○","○","○","○","○","×","×","×","×","○","×","×","×","×","○","×","×","×","×","○","×","×","×","×",{"$f":"HLOOKUP($C47,DB!$1:$1048576,9,0)","v":"-"},"A",2,{"$f":"VLOOKUP(AT47,条件!D:E,2,0)","v":1},"2024","0020",2,"1",{"$f":"VLOOKUP(LEFT(E47,2),条件!A:B,2,0)","v":"05"},212024002020105,30]

{"sheet":"条件","index":6,"n_rows":30,"n_cols":9,"rows_kept":30,"cut":false,"hidden":false,"merged":[]}
[null,null,null,null,null,"検索用"]
["QS","01",null,"VR",1,null,"KK-100009-VG","N-SSI工法",{"$f":"IF(LEN(G2)-LEN(SUBSTITUTE(G2,\"-\",\"\"))>=2,LEFT(G2,FIND(\"-\",G2,FIND(\"-\",G2)+1)-1),G2)","v":"KK-100009"}]
["QSK","01",null,"VE",1,null,"HK-110049-VG","高炉スラグ・繊維入りポリマーセメントモルタル「エフモル」",{"$f":"IF(LEN(G3)-LEN(SUBSTITUTE(G3,\"-\",\"\"))>=2,LEFT(G3,FIND(\"-\",G3,FIND(\"-\",G3)+1)-1),G3)","v":"HK-110049"}]
["SK","02",null,"AE",1,null,"QS-150001-VE","NCショット","QS-150001"]
["SKK","02",null,"A",1,null,"QS-150017-VE","コンクリート構造物の断面修復材料「ゴムラテシリーズ」用モルタル）","QS-150017"]
["CG","03",null,"VG",2,null,"KT-150080-VR","塩害対策用断面修復材「デンカクロルフィックス」","KT-150080"]
["CGK","03",null,null,null,null,"CB-020040-VG","コンクリート構造物の断面修復乾式吹付け工法","CB-020040"]
["KK","04",null,null,null,null,"SK-170011-A","LCユニット工法","SK-170011"]
["KKK","04",null,null,null,null,"KT-170058-VE","繊維補強超速硬ポリマーセメントモルタル「リフレモルセットSF」","KT-170058"]
["CB","05",null,null,null,null,"KT-170061-A","湿潤面対応急速硬化補修材","KT-170061"]
["CBK","05",null,null,null,null,"TH-180003-VE","速硬系ポリマーセメントモルタル「U-リペアパッチEX、U-リペアライトEX」","TH-180003"]
["HR","06",null,null,null,null,"KTK-180004-VE","エマルジョン型ポリマー乾式吹付け工法","KTK-180004"]
["HRK","06",null,null,null,null,"KT-180077-A","セルガード","KT-180077"]
["KT","07",null,null,null,null,"QS-180044-A","高耐久性断面修復工法「タフショットクリート工法」","QS-180044"]
["KTK","07",null,null,null,null,"KT-190023-A","塩分吸着型 乾式吹付工法","KT-190023"]
["TH","08",null,null,null,null,"QS-190036-A","パワーグラウト(自己治癒補修材)","QS-190036"]
["THK","08",null,null,null,null,"CG-200019-A","耐塩害タイプポリマーセメントモルタル「U-リペアパッチCT」","CG-200019"]
["HK","09",null,null,null,null,"CG-220003-A","亜硝酸リチウム併用型断面修復工法「リハビリ断面修復工法」","CG-220003"]
["HKK","09",null,null,null,null,"CG-230003-A","CPJ-L（コンパクトジェット－L）","CG-230003"]
["TS",10,null,null,null,null,"KK-230050-A","ポリマーセメント系無収縮グラウト材「プレユーロックスDXP」","KK-230050"]
[null,null,null,null,null,null,"KK-230060-A","HI-SPECシール工法","KK-230060"]
[null,null,null,null,null,null,"KK-230077-A","断面修復材の施工間隔の短縮を図る「リプロクイック工法」","KK-230077"]
[null,null,null,null,null,null,"KT-240012-A","コンクリ欠損部補強066","KT-240012"]
[null,null,null,null,null,null,"KT-240042-A","ジェットモルタルシリーズ","KT-240042"]
[null,null,null,null,null,null,"KK-240029-A","断面修復工法「エアショットワン」","KK-240029"]
[null,null,null,null,null,null,"KK-240067-A","耐摩耗性を向上させた水路補修用「ショウワRP-1工法」","KK-240067"]
[null,null,null,null,null,null,"KK-250012-A","シラン系鉄筋腐食抑制混和剤「プロテクトシル＠ WA CIT」","KK-250012"]
[null,null,null,null,null,null,"KK-250043-A","低炭素型無収縮モルタル「プレユーロックス GX」","KK-250043"]
[null,null,null,null,null,null,"KK-240019-A","水溶性錆転換型防錆プライマー「リプロチェンジコート」","KK-240019"]
[null,null,null,null,null,null,"CB-240020-A","複合型ケイ酸塩系鉄筋防錆材「リフレ防錆コートZN」","CB-240020"]

{"sheet":"同意書","index":7,"n_rows":22,"n_cols":3,"rows_kept":22,"cut":false,"hidden":false,"merged":[[3,2,3,18],[4,2,4,18],[5,2,5,18]]}
[]
[null,"工法比較表データベース借用同意書"]
[]
[null,"業務名・工事名"]
[null,"会社名"]
[null,"氏名"]
[]
[]
[]
[null,"借用者は、工法比較法データベース（以下「DB」と称する）を九州技術事務所から借用する場合に際し、以下の事項を遵守することを同意いたします。 "]
[null,"（使用目的）","1).借用者は、DBを借用申請書に記載された業務・工事にのみ使用します。なお、DBのリバースエンジニアリング、配布及び公衆送信等はいかなる目的においても行いません。"]
[null,"（使用範囲)","2).DBの使用は、九州地方整備局管内の業務・工事における関係者に限定します。"]
[null,"（データの複製）","3).借用者は、九州技術事務所から借用したデータの複製は行いません。"]
[null,"（権利関係）","4).DB及びDBを利用したものに係わる権利は、いずれも借用者に帰属しないことを確認します。"]
[null,"（守秘義務）","5).借用者は、DBによって知り得た情報を他に漏らしません。"]
[null,"（免責事項）","6).借用者は、DBの使用によって損害及び紛争等が生じても、九州技術事務所が一切責任を負わないことに同意します。 "]
[null,"（同意内容の変更）","7).借用者は、この同意書の内容に変更が生じた場合、その変更が生じた日から２週間以内に九州技術事務所（qsr-kyugi-netis@ki.mlit.go.jp）へ報告します。"]
[null,"（利用実態調査の記入）","8).借用者は、利用実態調査を正確かつ誠実に記入し、利用期限内に提出することを同意します。"]
[null,"（協議事項）","9).借用者は、本同意書に定めのない事項及び本同意書に関して疑義が生じた事項に関しては、九州技術事務所（qsr-kyugi-netis@ki.mlit.go.jp）と協議します。  "]
[]
[]
[null,"同意"]