{"text_format":"1","workbook":"xlsx","n_sheets":8,"sheets":["検索","更新履歴","詳細版","簡易版","DB","仕様の整理","条件","同意書"],"not_rendered":{"charts":0,"images":20,"macros":1,"external_links":0,"defined_names":15,"comments":0,"pivot_tables":0},"unopened":[],"bounds":{"document_bytes":16777216,"sheet_cells":100000,"rows_first":2000,"rows_last":500,"rows_between":2000,"halvings":0,"cell_chars":16384,"cell_head_chars":4096},"cells_cut":0,"cells_raw":0,"read":"whole","date_system":"1900"}

{"sheet":"検索","index":0,"n_rows":30,"n_cols":21,"rows_kept":30,"cut":false,"hidden":false,"merged":[[32,1,32,3],[32,6,32,12],[3,13,3,14]]}
[null,null,null,null,null,null,null,null,null,null,null,null,"ver.",4.8499999999999996,null,"借用同意書：",null,"問い合わせ先："," kouhouhikakuhyou-db@kyugikyo.or.jp",null,"条件検索"]
[null,null,null,null,null,null,null,null,null,null,null,null,null,null,null,"ご利用期間：","2026-02-10","～",{"$f":"IF(Q2=\"\",\"\",EOMONTH(Q2, 0))","v":"2026-02-28"}]
[null,null,null,null,null,null,null,null,null,null,null,null,null,null,null,{"$f":"仕様の整理!F1","v":"19技術24仕様"},{"$f":"仕様の整理!H1","v":"19技術24仕様"},{"$f":"\"検索結果：全\"&$P$3&\"仕様の内、\"&$Q$3&\"が検索されました。\"","v":"検索結果：全19技術24仕様仕様の内、19技術24仕様が検索されました。"},{"$f":"Q5&_xlfn.TEXTJOIN(\",\",,S5,S6,S7)&\"／\"&Q10&_xlfn.TEXTJOIN(\",\",,T10,T11,T12)","v":"対象工法：／現場の条件："}]
["本システムは、毎月NETIS情報を確認し、追加があれば更新していきますので、最新版を入手してお使いください。",null,null,null,null,null,null,null,null,null,null,null,null,"令和8年1月現在",null,null,null,null,{"$f":"\"工法比較表検索結果[\"&$P$3&\"の内、\"&$Q$3&\"]\"","v":"工法比較表検索結果[19技術24仕様の内、19技術24仕様]"}]
[null,null,null,null,null,null,null,null,null,null,null,null,null,null,null,null,"対象工法：",false,{"$f":"IF(R5=TRUE,\"ひび割れ被覆工法\",\"\")","v":""}]
[null,null,null,null,null,null,null,null,null,null,null,null,null,null,null,null,null,false,{"$f":"IF(R6=TRUE,\"ひび割れ注入工法\",\"\")","v":""}]
[null,null,null,null,null,null,null,null,null,null,null,null,null,null,null,null,null,false,{"$f":"IF(R7=TRUE,\"ひび割れ充填工法\",\"\")","v":""}]
[]
[]
[null,null,null,null,null,null,null,null,null,null,null,null,null,null,null,null,"現場の条件：",false,{"$f":"IF(R10=TRUE,\"○\",\"\")","v":""},{"$f":"IF(R10=TRUE,\"湿潤状態\",\"\")","v":""}]
[null,null,null,null,null,null,null,null,null,null,null,null,null,null,null,null,null,false,{"$f":"IF(R11=TRUE,\"○\",\"\")","v":""},{"$f":"IF(R11=TRUE,\"漏水状態\",\"\")","v":""}]
[null,null,null,null,null,null,null,null,null,null,null,null,null,null,null,null,null,false,"",{"$f":"IF(R12=TRUE,\"温度変化等によるひび割れ幅の変化がある\",\"\")","v":""}]
[]
[null,null,null,null,null,null,null,null,null,"※本工法比較表検索条件入力シートは「非進行性」のひび割れを対象としている。"]
[null,"各ひび割れ補修工法の適用可能なひび割れ幅の目安",null,null,null,null,null,null,{"$f":"REPT(\"■\",27)","v":"■■■■■■■■■■■■■■■■■■■■■■■■■■■"},"従来技術での適用可能なひび割れ幅"]
[null,null,null,null,null,null,null,null,{"$f":"REPT(\"■\",7)","v":"■■■■■■■"},"新技術で適用可能とされているひび割れ幅"]
[null,null,"0.0ｍｍ","0.1ｍｍ","0.2ｍｍ","0.3ｍｍ","0.4ｍｍ","0.5ｍｍ","0.6ｍｍ","0.7ｍｍ","0.8ｍｍ","0.9ｍｍ","0.10ｍｍ"]
[null,"ひび割れ被覆工法",null,null,{"$f":"REPT(\"■\",27)","v":"■■■■■■■■■■■■■■■■■■■■■■■■■■■"}]
[]
[null,"ひび割れ注入工法",{"$f":"\"　　　\"&REPT(\"■\",9)","v":"　　　■■■■■■■■■"},null,null,null,null,null,null,null,null,null,{"$f":"REPT(\"■\",3)","v":"■■■"}]
[]
[null,"ひび割れ充填工法"]
[]
[]
[]
[]
[]
[]
[]
["新技術の検索"]

{"sheet":"更新履歴","index":1,"n_rows":298,"n_cols":2,"rows_kept":298,"cut":false,"hidden":false,"merged":[]}
[null,"■更新履歴"]
[null,"2016/10/05＜Ver1.00＞"]
[null,"・Ver1.00アップロード"]
[null,"2017/6/20\n＜Ver1.00からVer2.00への変更点について＞"]
[null,"・平成27年にNETIS登録技術された1技術を追加し、「平成27年11月現在」を「平成28年10月現在」に変更しました。"]
[null,"・NETIS掲載期間終了技術（有用な新技術、活用の多い技術）を工法比較表検索結果の後尾にNETIS登録番号を削除し、グレーの背景で掲載しました。"]
[null,"・各技術の工法比較表作成日及び、新技術の単価の年月及び地域を記載しました。"]
[null,"・NETIS掲載期間終了技術（有用な新技術、活用の多い技術以外）を2技術削除しました。"]
[]
[null,"2018/3/15\n＜Ver2.00からVer3.00への変更点について＞"]
[null,"・平成29年10月までにNETIS登録技術された4技術を追加し、「平成28年10月現在」を「平成29年10月現在」に変更しました。"]
[null,"・NETIS掲載期間終了技術（有用な新技術、活用の多い技術以外）を1技術削除しました。"]
[]
[null,"2018/4/27\n＜Ver3.04＞"]
[null,"・NETIS掲載期間終了技術（有用な新技術、活用の多い技術）1技術の掲載様式を変更しました。"]
[]
[null,"2018/05/29\n＜Ver3.05＞"]
[null,"・新規登録は無し。"]
[]
[null,"2018/06/28\n＜Ver3.06＞"]
[null,"・新規登録は無し。"]
[]
[null,"2018/07/31\n＜Ver3.07＞"]
[null,"・新規登録は無し。"]
[]
[null,"2018/08/31\n＜Ver3.08＞"]
[null,"・新規登録は無し。"]
[]
[null,"2018/09/28\n＜Ver3.09＞"]
[null,"・ＮＥＴＩＳ登録状況を確認し1技術を新規登録しました（NETIS申請情報のみ）。"]
[]
[null,"2018/10/31\n＜Ver3.10＞"]
[null,"・新規登録は無し。"]
[]
[null,"2018/11/30\n＜Ver3.11＞"]
[null,"・ＮＥＴＩＳ掲載中止となっている1技術を非表示としました。"]
[]
[null,"2018/12/25\n＜Ver3.12＞"]
[null,"・新規登録は無し。"]
[]
[null,"2019/1/31\n＜Ver3.13＞"]
[null,"・NETIS登録状況を確認し1技術を新規登録しました（NETIS申請情報のみ）。"]
[null,"・NETIS掲載期間終了技術（有用な新技術、活用の多い技術以外）を2技術削除しました。"]
[]
[null,"2019/2/28\n＜Ver3.14＞"]
[null,"・新規登録は無し。"]
[]
[null,"2019/3/29\n＜Ver3.15＞"]
[null,"・ＮＥＴＩＳ掲載中止から再掲載された1技術を再表示しました。"]
[]
[null,"2019/4/26\n＜Ver4.04＞"]
[null,"・NETIS登録状況を確認し1技術を新規登録しました（NETIS申請情報のみ）。"]
[]
[null,"2019/5/31\n＜Ver4.05＞"]
[null,"・新規登録は無し。"]
[]
[null,"2019/6/28\n＜Ver4.06＞"]
[null,"・新規登録は無し。"]
[]
[null,"2019/7/31\n＜Ver4.07＞"]
[null,"・新規登録は無し。"]
[]
[null,"2019/8/30\n＜Ver4.08＞"]
[null,"・新規登録は無し。"]
[]
[null,"2019/9/30\n＜Ver4.09＞"]
[null,"・新規登録は無し。"]
[]
[null,"2019/10/31\n＜Ver4.10＞"]
[null,"・新規登録は無し。"]
[]
[null,"2019/11/29\n＜Ver4.11＞"]
[null,"・新規登録は無し。"]
[]
[null,"2019/12/31\n＜Ver4.12＞"]
[null,"・ＮＥＴＩＳ登録状況を確認し1技術を新規登録しました（NETIS申請情報のみ）。"]
[]
[null,"2020/1/31\n＜Ver4.13＞"]
[null,"・新規登録は無し。"]
[]
[null,"2020/2/28\n＜Ver4.14＞"]
[null,"・新規登録は無し。"]
[]
[null,"2020/3/31\n＜Ver4.15＞"]
[null,"・新規登録は無し。"]
[]
[null,"2020/4/30\n＜Ver4.16＞"]
[null,"・新規登録は無し。"]
[]
[null,"2020/5/29\n＜Ver4.17＞"]
[null,"・新規登録は無し。"]
[]
[null,"2020/6/30\n＜Ver4.18＞"]
[null,"・新規登録は無し。"]
[]
[null,"2020/7/31\n＜Ver4.19＞"]
[null,"・新規登録は無し。"]
[]
[null,"2020/8/31\n＜Ver4.20＞"]
[null,"・新規登録は無し。"]
[]
[null,"2020/9/30\n＜Ver4.21＞"]
[null,"・ＮＥＴＩＳ登録状況を確認し1技術を新規登録しました（NETIS申請情報のみ）。"]
[]
[null,"2020/10/31\n＜Ver4.22＞"]
[null,"・ＮＥＴＩＳ登録状況を確認し1技術を新規登録しました（NETIS申請情報のみ）。"]
[]
[null,"2020/11/30\n＜Ver4.23＞"]
[null,"・新規登録は無し。"]
[]
[null,"2020/12/31\n＜Ver4.24＞"]
[null,"・新規登録は無し。"]
[]
[null,"2021/1/31\n＜Ver4.25＞"]
[null,"・新規登録は無し。"]
[]
[null,"2021/2/26\n＜Ver4.26＞"]
[null,"・新規登録は無し。"]
[]
[null,"2021/3/31\n＜Ver4.27＞"]
[null,"・新規登録は無し。"]
[]
[null,"2021/4/30\n＜Ver4.28＞"]
[null,"・新規登録は無し。"]
[]
[null,"2021/5/31\n＜Ver4.29＞"]
[null,"・新規登録は無し。"]
[]
[null,"2021/6/30\n＜Ver4.30＞"]
[null,"・新規登録は無し。"]
[]
[null,"2021/7/31\n＜Ver4.31＞"]
[null,"・新規登録は無し。"]
[]
[null,"2021/8/31\n＜Ver4.32＞"]
[null,"・新規登録は無し。"]
[]
[null,"2021/9/30\n＜Ver4.33＞"]
[null,"・新規登録は無し。"]
[]
[null,"2021/10/31\n＜Ver4.34＞"]
[null,"・新規登録は無し。"]
[]
[null,"2021/11/30\n＜Ver4.35＞"]
[null,"・新規登録は無し。"]
[]
[null,"2021/12/31\n＜Ver4.36＞"]
[null,"・新規登録は無し。"]
[]
[null,"2022/1/31\n＜Ver4.37＞"]
[null,"・新規登録は無し。"]
[]
[null,"2022/2/28\n＜Ver4.38＞"]
[null,"・新規登録は無し。"]
[]
[null,"2022/3/31\n＜Ver4.39＞"]
[null,"・新規登録は無し。"]
[]
[null,"2022/4/30\n＜Ver4.40＞"]
[null,"・新規登録は無し。"]
[]
[null,"2022/5/31\n＜Ver4.41＞"]
[null,"・新規登録は無し。"]
[]
[null,"2022/6/30\n＜Ver4.42＞"]
[null,"・新規登録は無し。"]
[]
[null,"2022/7/31\n＜Ver4.43＞"]
[null,"・新規登録は無し。"]
[]
[null,"2022/8/31\n＜Ver4.44＞"]
[null,"・新規登録は無し。"]
[]
[null,"2022/9/30\n＜Ver4.45＞"]
[null,"・新規登録は無し。"]
[]
[null,"2022/10/31\n＜Ver4.46＞"]
[null,"・新規登録は無し。"]
[]
[null,"2022/11/30\n＜Ver4.47＞"]
[null,"・新規登録は無し。"]
[]
[null,"2022/12/31\n＜Ver4.48＞"]
[null,"・新規登録は無し。"]
[]
[null,"2023/1/31\n＜Ver4.49＞"]
[null,"・新規登録は無し。"]
[]
[null,"2023/2/28\n＜Ver4.50＞"]
[null,"・新規登録は無し。"]
[]
[null,"2023/3/31\n＜Ver4.51＞"]
[null,"・新規登録は無し。"]
[]
[null,"2023/4/30\n＜Ver4.52＞"]
[null,"・新規登録は無し。"]
[]
[null,"2023/5/31\n＜Ver4.53＞"]
[null,"・新規登録は無し。"]
[]
[null,"2023/6/30\n＜Ver4.54＞"]
[null,"・新規登録は無し。"]
[]
[null,"2023/7/31\n＜Ver4.55＞"]
[null,"・新規登録は無し。"]
[]
[null,"2023/8/31\n＜Ver4.56＞"]
[null,"・新規登録は無し。"]
[]
[null,"2023/9/30\n＜Ver4.57＞"]
[null,"・ＮＥＴＩＳ登録状況を確認し1技術を新規登録しました（NETIS申請情報のみ）。"]
[]
[null,"2023/10/31\n＜Ver4.58＞"]
[null,"・新規登録は無し。"]
[]
[null,"2023/11/30\n＜Ver4.59＞"]
[null,"・新規登録は無し。"]
[]
[null,"2023/12/31\n＜Ver4.60＞"]
[null,"・新規登録は無し。"]
[]
[null,"2024/1/31\n＜Ver4.61＞"]
[null,"・新規登録は無し。"]
[]
[null,"2024/2/29\n＜Ver4.62＞"]
[null,"・新規登録は無し。"]
[]
[null,"2024/3/31\n＜Ver4.63＞"]
[null,"・ＮＥＴＩＳ登録状況を確認し1技術を新規登録しました（NETIS申請情報のみ）。"]
[]
[null,"2024/4/30\n＜Ver4.64＞"]
[null,"・ＮＥＴＩＳ登録状況を確認し1技術を新規登録しました（NETIS申請情報のみ）。"]
[]
[null,"2024/5/31\n＜Ver4.65＞"]
[null,"・新規登録は無し。"]
[]
[null,"2024/6/30\n＜Ver4.66＞"]
[null,"・新規登録は無し。"]
[]
[null,"2024/7/31\n＜Ver4.67＞"]
[null,"・新規登録は無し。"]
[]
[null,"2024/8/31\n＜Ver4.68＞"]
[null,"・新規登録は無し。"]
[]
[null,"2024/9/30\n＜Ver4.69＞"]
[null,"・新規登録は無し。"]
[]
[null,"2024/10/31\n＜Ver4.70＞"]
[null,"・新規登録は無し。"]
[null,"・施工費用および施工日数等を令和6度の情報に更新"]
[]
[null,"2024/11/30\n＜Ver4.71＞"]
[null,"・新規登録は無し。"]
[null,"・施工費用および施工日数等を令和6年度の情報に更新"]
[]
[null,"2024/12/31\n＜Ver4.72＞"]
[null,"・新規登録は無し。"]
[]
[null,"2025/1/31\n＜Ver4.73＞"]
[null,"・新規登録は無し。"]
[]
[null,"2025/2/28\n＜Ver4.74＞"]
[null,"・新規登録は無し。"]
[]
[null,"2025/3/31\n＜Ver4.75＞"]
[null,"・新規登録は無し。"]
[]
[null,"2025/4/30\n＜Ver4.76＞"]
[null,"・新規登録は無し。"]
[]
[null,"2025/5/31\n＜Ver4.77＞"]
[null,"・新規登録は無し。"]
[]
[null,"2025/6/30\n＜Ver4.78＞"]
[null,"・新規登録は無し。"]
[]
[null,"2025/7/31\n＜Ver4.79＞"]
[null,"・新規登録は無し。"]
[]
[null,"2025/8/31\n＜Ver4.80＞"]
[null,"・新規登録は無し。"]
[]
[null,"2025/9/30\n＜Ver4.81＞"]
[null,"・新規登録は無し。"]
[]
[null,"2025/10/31\n＜Ver4.82＞"]
[null,"・新規登録は無し。"]
[]
[null,"2025/11/30\n＜Ver4.83＞"]
[null,"・新規登録は無し。"]
[null,"・施工費用および施工日数等を令和7年度の情報に更新"]
[]
[null,"2025/12/31\n＜Ver4.84＞"]
[null,"・新規登録は無し。"]
[]
[null,"2026/1/31＜Ver4.85＞"]
[null,"・新規登録は無し。"]

{"sheet":"詳細版","index":2,"n_rows":71,"n_cols":5,"rows_kept":71,"cut":false,"hidden":false,"merged":[[69,47,69,48],[67,53,67,54],[68,7,68,8],[68,9,68,10],[68,11,68,12],[68,13,68,14],[68,15,68,16],[68,17,68,18],[68,19,68,20],[68,21,68,22],[68,23,68,24],[67,41,67,42],[67,43,67,44],[67,45,67,46],[67,47,67,48],[67,49,67,50],[67,51,67,52],[67,29,67,30],[67,31,67,32],[69,49,69,50],[69,51,69,52],[69,53,69,54],[67,33,67,34],[67,35,67,36],[67,37,67,38],[67,39,67,40],[67,17,67,18],[67,19,67,20],[67,21,67,22],[67,23,67,24],[67,25,67,26],[68,35,68,36],[57,3,57,4],[44,2,57,2],[69,7,69,8],[69,9,69,10],[69,11,69,12],[69,13,69,14],[69,15,69,16],[69,17,69,18],[69,19,69,20],[68,49,68,50],[68,51,68,52],[68,53,68,54],[69,27,69,28],[69,29,69,30],[69,31,69,32],[67,7,67,8],[67,9,67,10],[67,11,67,12],[67,13,67,14],[67,15,67,16],[68,37,68,38],[68,39,68,40],[68,41,68,42],[68,43,68,44],[68,45,68,46],[68,47,68,48],[68,25,68,26],[68,27,68,28],[68,29,68,30],[68,31,68,32],[68,33,68,34],[69,45,69,46],[69,33,69,34],[69,35,69,36],[69,37,69,38],[69,39,69,40],[69,41,69,42],[69,43,69,44],[69,21,69,22],[69,23,69,24],[69,25,69,26],[66,33,66,34],[66,35,66,36],[66,37,66,38],[66,39,66,40],[66,41,66,42],[66,43,66,44],[66,21,66,22],[66,23,66,24],[66,25,66,26],[66,27,66,28],[66,29,66,30],[66,31,66,32],[67,27,67,28],[65,53,65,54],[66,7,66,8],[66,9,66,10],[66,11,66,12],[66,13,66,14],[66,15,66,16],[66,17,66,18],[66,19,66,20],[65,37,65,38],[65,39,65,40],[65,41,65,42],[65,43,65,44],[65,45,65,46],[65,47,65,48],[65,25,65,26],[65,27,65,28],[65,29,65,30],[65,31,65,32],[65,33,65,34],[65,35,65,36],[66,45,66,46],[66,47,66,48],[66,49,66,50],[66,51,66,52],[66,53,66,54],[65,7,65,8],[65,9,65,10],[65,11,65,12],[65,13,65,14],[65,15,65,16],[65,17,65,18],[65,19,65,20],[65,21,65,22],[65,23,65,24],[64,41,64,42],[64,43,64,44],[64,45,64,46],[64,47,64,48],[64,49,64,50],[64,51,64,52],[64,29,64,30],[64,31,64,32],[64,33,64,34],[64,35,64,36],[64,37,64,38],[64,39,64,40],[64,17,64,18],[64,19,64,20],[64,21,64,22],[64,23,64,24],[64,25,64,26],[64,27,64,28],[65,49,65,50],[65,51,65,52],[63,49,63,50],[63,51,63,52],[63,53,63,54],[64,7,64,8],[64,9,64,10],[64,11,64,12],[64,13,64,14],[64,15,64,16],[63,33,63,34],[63,35,63,36],[63,37,63,38],[63,39,63,40],[63,41,63,42],[63,43,63,44],[63,21,63,22],[63,23,63,24],[63,25,63,26],[63,27,63,28],[63,29,63,30],[63,31,63,32],[64,53,64,54],[63,7,63,8],[63,9,63,10],[63,11,63,12],[63,13,63,14],[63,15,63,16],[63,17,63,18],[63,19,63,20],[63,45,63,46],[63,47,63,48],[61,53,61,54],[62,7,62,8],[62,9,62,10],[62,11,62,12],[62,13,62,14],[62,15,62,16],[62,17,62,18],[62,19,62,20],[62,21,62,22],[62,23,62,24],[61,41,61,42],[61,43,61,44],[61,45,61,46],[61,47,61,48],[61,49,61,50],[61,51,61,52],[61,29,61,30],[61,31,61,32],[61,33,61,34],[61,35,61,36],[61,37,61,38],[61,39,61,40],[61,17,61,18],[61,19,61,20],[61,21,61,22],[61,23,61,24],[61,25,61,26],[61,27,61,28],[62,49,62,50],[62,51,62,52],[62,53,62,54],[61,7,61,8],[61,9,61,10],[61,11,61,12],[61,13,61,14],[61,15,61,16],[62,37,62,38],[62,39,62,40],[62,41,62,42],[62,43,62,44],[62,45,62,46],[62,47,62,48],[62,25,62,26],[62,27,62,28],[62,29,62,30],[62,31,62,32],[62,33,62,34],[62,35,62,36],[60,33,60,34],[60,35,60,36],[60,37,60,38],[60,39,60,40],[60,41,60,42],[60,43,60,44],[60,21,60,22],[60,23,60,24],[60,25,60,26],[60,27,60,28],[60,29,60,30],[60,31,60,32],[59,53,59,54],[60,7,60,8],[60,9,60,10],[60,11,60,12],[60,13,60,14],[60,15,60,16],[60,17,60,18],[60,19,60,20],[59,37,59,38],[59,39,59,40],[59,41,59,42],[59,43,59,44],[59,45,59,46],[59,47,59,48],[59,25,59,26],[59,27,59,28],[59,29,59,30],[59,31,59,32],[59,33,59,34],[59,35,59,36],[60,45,60,46],[60,47,60,48],[60,49,60,50],[60,51,60,52],[60,53,60,54],[59,7,59,8],[59,9,59,10],[59,11,59,12],[59,13,59,14],[59,15,59,16],[59,17,59,18],[59,19,59,20],[59,21,59,22],[59,23,59,24],[58,41,58,42],[58,43,58,44],[58,45,58,46],[58,47,58,48],[58,49,58,50],[58,51,58,52],[58,29,58,30],[58,31,58,32],[58,33,58,34],[58,35,58,36],[58,37,58,38],[58,39,58,40],[58,17,58,18],[58,19,58,20],[58,21,58,22],[58,23,58,24],[58,25,58,26],[58,27,58,28],[59,49,59,50],[59,51,59,52],[57,49,57,50],[57,51,57,52],[57,53,57,54],[58,7,58,8],[58,9,58,10],[58,11,58,12],[58,13,58,14],[58,15,58,16],[57,33,57,34],[57,35,57,36],[57,37,57,38],[57,39,57,40],[57,41,57,42],[57,43,57,44],[57,21,57,22],[57,23,57,24],[57,25,57,26],[57,27,57,28],[57,29,57,30],[57,31,57,32],[58,53,58,54],[57,7,57,8],[57,9,57,10],[57,11,57,12],[57,13,57,14],[57,15,57,16],[57,17,57,18],[57,19,57,20],[57,45,57,46],[57,47,57,48],[40,53,40,54],[41,7,41,8],[41,9,41,10],[41,11,41,12],[41,13,41,14],[41,15,41,16],[41,17,41,18],[41,19,41,20],[41,21,41,22],[41,23,41,24],[40,41,40,42],[40,43,40,44],[40,45,40,46],[40,47,40,48],[40,49,40,50],[40,51,40,52],[40,29,40,30],[40,31,40,32],[40,33,40,34],[40,35,40,36],[40,37,40,38],[40,39,40,40],[40,17,40,18],[40,19,40,20],[40,21,40,22],[40,23,40,24],[40,25,40,26],[40,27,40,28],[41,49,41,50],[41,51,41,52],[41,53,41,54],[40,7,40,8],[40,9,40,10],[40,11,40,12],[40,13,40,14],[40,15,40,16],[41,37,41,38],[41,39,41,40],[41,41,41,42],[41,43,41,44],[41,45,41,46],[41,47,41,48],[41,25,41,26],[41,27,41,28],[41,29,41,30],[41,31,41,32],[41,33,41,34],[41,35,41,36],[39,33,39,34],[39,35,39,36],[39,37,39,38],[39,39,39,40],[39,41,39,42],[39,43,39,44],[39,21,39,22],[39,23,39,24],[39,25,39,26],[39,27,39,28],[39,29,39,30],[39,31,39,32],[38,53,38,54],[39,7,39,8],[39,9,39,10],[39,11,39,12],[39,13,39,14],[39,15,39,16],[39,17,39,18],[39,19,39,20],[38,37,38,38],[38,39,38,40],[38,41,38,42],[38,43,38,44],[38,45,38,46],[38,47,38,48],[38,25,38,26],[38,27,38,28],[38,29,38,30],[38,31,38,32],[38,33,38,34],[38,35,38,36],[39,45,39,46],[39,47,39,48],[39,49,39,50],[39,51,39,52],[39,53,39,54],[38,7,38,8],[38,9,38,10],[38,11,38,12],[38,13,38,14],[38,15,38,16],[38,17,38,18],[38,19,38,20],[38,21,38,22],[38,23,38,24],[28,41,28,42],[28,43,28,44],[28,45,28,46],[28,47,28,48],[28,49,28,50],[28,51,28,52],[28,29,28,30],[28,31,28,32],[28,33,28,34],[28,35,28,36],[28,37,28,38],[28,39,28,40],[28,17,28,18],[28,19,28,20],[28,21,28,22],[28,23,28,24],[28,25,28,26],[28,27,28,28],[38,49,38,50],[38,51,38,52],[27,49,27,50],[27,51,27,52],[27,53,27,54],[28,7,28,8],[28,9,28,10],[28,11,28,12],[28,13,28,14],[28,15,28,16],[27,33,27,34],[27,35,27,36],[27,37,27,38],[27,39,27,40],[27,41,27,42],[27,43,27,44],[27,21,27,22],[27,23,27,24],[27,25,27,26],[27,27,27,28],[27,29,27,30],[27,31,27,32],[28,53,28,54],[27,7,27,8],[27,9,27,10],[27,11,27,12],[27,13,27,14],[27,15,27,16],[27,17,27,18],[27,19,27,20],[27,45,27,46],[27,47,27,48],[25,53,25,54],[26,7,26,8],[26,9,26,10],[26,11,26,12],[26,13,26,14],[26,15,26,16],[26,17,26,18],[26,19,26,20],[26,21,26,22],[26,23,26,24],[25,41,25,42],[25,43,25,44],[25,45,25,46],[25,47,25,48],[25,49,25,50],[25,51,25,52],[25,29,25,30],[25,31,25,32],[25,33,25,34],[25,35,25,36],[25,37,25,38],[25,39,25,40],[25,17,25,18],[25,19,25,20],[25,21,25,22],[25,23,25,24],[25,25,25,26],[25,27,25,28],[26,49,26,50],[26,51,26,52],[26,53,26,54],[25,7,25,8],[25,9,25,10],[25,11,25,12],[25,13,25,14],[25,15,25,16],[26,37,26,38],[26,39,26,40],[26,41,26,42],[26,43,26,44],[26,45,26,46],[26,47,26,48],[26,25,26,26],[26,27,26,28],[26,29,26,30],[26,31,26,32],[26,33,26,34],[26,35,26,36],[24,33,24,34],[24,35,24,36],[24,37,24,38],[24,39,24,40],[24,41,24,42],[24,43,24,44],[24,21,24,22],[24,23,24,24],[24,25,24,26],[24,27,24,28],[24,29,24,30],[24,31,24,32],[23,53,23,54],[24,7,24,8],[24,9,24,10],[24,11,24,12],[24,13,24,14],[24,15,24,16],[24,17,24,18],[24,19,24,20],[23,37,23,38],[23,39,23,40],[23,41,23,42],[23,43,23,44],[23,45,23,46],[23,47,23,48],[23,25,23,26],[23,27,23,28],[23,29,23,30],[23,31,23,32],[23,33,23,34],[23,35,23,36],[24,45,24,46],[24,47,24,48],[24,49,24,50],[24,51,24,52],[24,53,24,54],[23,7,23,8],[23,9,23,10],[23,11,23,12],[23,13,23,14],[23,15,23,16],[23,17,23,18],[23,19,23,20],[23,21,23,22],[23,23,23,24],[22,41,22,42],[22,43,22,44],[22,45,22,46],[22,47,22,48],[22,49,22,50],[22,51,22,52],[22,29,22,30],[22,31,22,32],[22,33,22,34],[22,35,22,36],[22,37,22,38],[22,39,22,40],[22,17,22,18],[22,19,22,20],[22,21,22,22],[22,23,22,24],[22,25,22,26],[22,27,22,28],[23,49,23,50],[23,51,23,52],[21,49,21,50],[21,51,21,52],[21,53,21,54],[22,7,22,8],[22,9,22,10],[22,11,22,12],[22,13,22,14],[22,15,22,16],[21,33,21,34],[21,35,21,36],[21,37,21,38],[21,39,21,40],[21,41,21,42],[21,43,21,44],[21,21,21,22],[21,23,21,24],[21,25,21,26],[21,27,21,28],[21,29,21,30],[21,31,21,32],[22,53,22,54],[21,7,21,8],[21,9,21,10],[21,11,21,12],[21,13,21,14],[21,15,21,16],[21,17,21,18],[21,19,21,20],[21,45,21,46],[21,47,21,48],[19,53,19,54],[20,7,20,8],[20,9,20,10],[20,11,20,12],[20,13,20,14],[20,15,20,16],[20,17,20,18],[20,19,20,20],[20,21,20,22],[20,23,20,24],[19,41,19,42],[19,43,19,44],[19,45,19,46],[19,47,19,48],[19,49,19,50],[19,51,19,52],[19,29,19,30],[19,31,19,32],[19,33,19,34],[19,35,19,36],[19,37,19,38],[19,39,19,40],[19,17,19,18],[19,19,19,20],[19,21,19,22],[19,23,19,24],[19,25,19,26],[19,27,19,28],[20,49,20,50],[20,51,20,52],[20,53,20,54],[19,7,19,8],[19,9,19,10],[19,11,19,12],[19,13,19,14],[19,15,19,16],[20,37,20,38],[20,39,20,40],[20,41,20,42],[20,43,20,44],[20,45,20,46],[20,47,20,48],[20,25,20,26],[20,27,20,28],[20,29,20,30],[20,31,20,32],[20,33,20,34],[20,35,20,36],[18,33,18,34],[18,35,18,36],[18,37,18,38],[18,39,18,40],[18,41,18,42],[18,43,18,44],[18,21,18,22],[18,23,18,24],[18,25,18,26],[18,27,18,28],[18,29,18,30],[18,31,18,32],[17,53,17,54],[18,7,18,8],[18,9,18,10],[18,11,18,12],[18,13,18,14],[18,15,18,16],[18,17,18,18],[18,19,18,20],[17,37,17,38],[17,39,17,40],[17,41,17,42],[17,43,17,44],[17,45,17,46],[17,47,17,48],[17,25,17,26],[17,27,17,28],[17,29,17,30],[17,31,17,32],[17,33,17,34],[17,35,17,36],[18,45,18,46],[18,47,18,48],[18,49,18,50],[18,51,18,52],[18,53,18,54],[17,7,17,8],[17,9,17,10],[17,11,17,12],[17,13,17,14],[17,15,17,16],[17,17,17,18],[17,19,17,20],[17,21,17,22],[17,23,17,24],[16,41,16,42],[16,43,16,44],[16,45,16,46],[16,47,16,48],[16,49,16,50],[16,51,16,52],[16,29,16,30],[16,31,16,32],[16,33,16,34],[16,35,16,36],[16,37,16,38],[16,39,16,40],[16,17,16,18],[16,19,16,20],[16,21,16,22],[16,23,16,24],[16,25,16,26],[16,27,16,28],[14,35,14,36],[14,13,14,14],[14,15,14,16],[14,17,14,18],[14,19,14,20],[17,49,17,50],[17,51,17,52],[14,21,14,22],[14,23,14,24],[15,45,15,46],[15,47,15,48],[15,49,15,50],[15,51,15,52],[15,53,15,54],[16,7,16,8],[16,9,16,10],[16,11,16,12],[16,13,16,14],[16,15,16,16],[15,33,15,34],[15,35,15,36],[15,37,15,38],[15,39,15,40],[15,41,15,42],[15,43,15,44],[15,21,15,22],[15,23,15,24],[15,25,15,26],[15,27,15,28],[15,29,15,30],[15,31,15,32],[16,53,16,54],[13,33,13,34],[13,35,13,36],[13,37,13,38],[13,39,13,40],[13,41,13,42],[13,19,13,20],[13,21,13,22],[13,23,13,24],[13,25,13,26],[13,27,13,28],[13,29,13,30],[14,49,14,50],[14,51,14,52],[14,53,14,54],[15,7,15,8],[15,9,15,10],[15,11,15,12],[15,13,15,14],[15,15,15,16],[15,17,15,18],[15,19,15,20],[14,37,14,38],[14,39,14,40],[14,41,14,42],[14,43,14,44],[14,45,14,46],[14,47,14,48],[14,25,14,26],[14,27,14,28],[14,29,14,30],[14,31,14,32],[14,33,14,34],[11,15,11,16],[11,17,11,18],[11,19,11,20],[12,47,12,48],[12,49,12,50],[12,51,12,52],[12,53,12,54],[13,7,13,8],[13,9,13,10],[13,11,13,12],[13,13,13,14],[13,15,13,16],[13,17,13,18],[12,35,12,36],[12,37,12,38],[12,39,12,40],[12,41,12,42],[12,43,12,44],[12,45,12,46],[12,23,12,24],[12,25,12,26],[12,27,12,28],[12,29,12,30],[12,31,12,32],[12,33,12,34],[13,43,13,44],[13,45,13,46],[13,47,13,48],[13,49,13,50],[13,51,13,52],[13,53,13,54],[13,31,13,32],[10,53,10,54],[9,7,9,8],[9,9,9,10],[9,11,9,12],[9,13,9,14],[9,15,9,16],[9,17,9,18],[9,19,9,20],[11,53,11,54],[12,7,12,8],[12,9,12,10],[12,11,12,12],[12,13,12,14],[12,15,12,16],[12,17,12,18],[12,19,12,20],[12,21,12,22],[10,41,10,42],[10,43,10,44],[10,45,10,46],[10,47,10,48],[10,49,10,50],[10,51,10,52],[10,29,10,30],[10,31,10,32],[10,33,10,34],[10,35,10,36],[10,37,10,38],[10,39,10,40],[10,17,10,18],[10,19,10,20],[10,21,10,22],[10,7,10,8],[10,9,10,10],[10,11,10,12],[10,13,10,14],[10,15,10,16],[9,33,9,34],[9,35,9,36],[9,37,9,38],[9,39,9,40],[9,41,9,42],[9,43,9,44],[9,21,9,22],[9,23,9,24],[9,25,9,26],[9,27,9,28],[9,29,9,30],[9,31,9,32],[10,23,10,24],[10,25,10,26],[10,27,10,28],[9,45,9,46],[9,47,9,48],[7,53,7,54],[8,7,8,8],[8,9,8,10],[8,11,8,12],[8,13,8,14],[8,15,8,16],[8,17,8,18],[8,19,8,20],[8,21,8,22],[8,23,8,24],[7,41,7,42],[7,43,7,44],[7,45,7,46],[7,47,7,48],[7,49,7,50],[7,51,7,52],[7,29,7,30],[7,31,7,32],[9,49,9,50],[9,51,9,52],[9,53,9,54],[7,33,7,34],[7,35,7,36],[7,37,7,38],[7,39,7,40],[7,17,7,18],[7,19,7,20],[7,21,7,22],[7,23,7,24],[7,25,7,26],[7,27,7,28],[8,49,8,50],[8,51,8,52],[8,53,8,54],[7,7,7,8],[7,9,7,10],[7,11,7,12],[7,13,7,14],[7,15,7,16],[8,37,8,38],[8,39,8,40],[8,41,8,42],[8,43,8,44],[8,45,8,46],[8,47,8,48],[8,25,8,26],[8,27,8,28],[8,29,8,30],[8,31,8,32],[8,33,8,34],[8,35,8,36],[6,33,6,34],[6,35,6,36],[6,37,6,38],[6,39,6,40],[6,41,6,42],[6,43,6,44],[6,21,6,22],[6,23,6,24],[6,25,6,26],[6,27,6,28],[6,29,6,30],[6,31,6,32],[5,53,5,54],[6,7,6,8],[6,9,6,10],[6,11,6,12],[6,13,6,14],[6,15,6,16],[6,17,6,18],[6,19,6,20],[5,37,5,38],[5,39,5,40],[5,41,5,42],[5,43,5,44],[5,45,5,46],[5,47,5,48],[5,25,5,26],[5,27,5,28],[5,29,5,30],[5,31,5,32],[5,33,5,34],[5,35,5,36],[6,45,6,46],[6,47,6,48],[6,49,6,50],[6,51,6,52],[6,53,6,54],[5,7,5,8],[5,9,5,10],[5,11,5,12],[5,13,5,14],[5,15,5,16],[5,17,5,18],[5,19,5,20],[5,21,5,22],[5,23,5,24],[4,41,4,42],[4,43,4,44],[4,45,4,46],[4,47,4,48],[4,49,4,50],[4,51,4,52],[4,29,4,30],[4,31,4,32],[4,33,4,34],[4,35,4,36],[4,37,4,38],[4,39,4,40],[4,17,4,18],[4,19,4,20],[4,21,4,22],[4,23,4,24],[4,25,4,26],[4,27,4,28],[3,47,3,48],[3,49,3,50],[3,51,3,52],[3,53,3,54],[4,7,4,8],[4,9,4,10],[4,11,4,12],[4,13,4,14],[4,15,4,16],[3,33,3,34],[3,35,3,36],[3,37,3,38],[3,39,3,40],[3,41,3,42],[3,43,3,44],[3,21,3,22],[3,23,3,24],[3,25,3,26],[3,27,3,28],[3,29,3,30],[3,31,3,32]],"merged_total":1161,"flags":["merged_cut"]}
[]
["コンクリート構造物補修工（ひび割れ補修工法）"]
[{"$f":"検索!S4","v":"工法比較表検索結果[19技術24仕様の内、19技術24仕様]"}]
[]
["ＮＥＴＩＳ情報","技術名"]
[null,"①","ＮＥＴＩＳ登録番号"]
[null,"②","技術の位置付け（有用な新技術）"]
[null,"③","開発者（本社が存在する都道府県）"]
[null,"④","開発者における九州地方との関連性（九州登録九州本社：◎、九州外登録九州本社：○、九州に共同開発者有り：△、その他：－）"]
[null,"⑤","九州地方への機能性（九州地方に支店等を有する場合：○、その他：－）"]
[null,"⑥","技術概要"]
[null,"⑦","概要図"]
[null,"⑧","施工条件・適用条件等","施工方法"]
[null,null,null,"補修材料"]
[null,null,null,"適用範囲"]
[null,null,null,"適用可能なひび割れ幅・ひび割れ深さ"]
[null,null,null,"施工中の気温"]
[null,null,null,"施工中の水分"]
[null,null,null,"ひび割れ幅の変化に追従可能"]
[null,"⑨","比較する従来技術"]
["評価情報","⑩","評価基準",null,"項目"]
[null,null,"・A：従来技術より極めて優れる\n・B：従来技術より優れる\n・C：従来技術と同等\n・D：従来技術より劣る",null,"経済性"]
[null,null,null,null,"工程"]
[null,null,null,null,"品質・出来形"]
[null,null,null,null,"安全性"]
[null,null,null,null,"施工性"]
[null,null,null,null,"環境"]
[null,null,null,null,"総合評価"]
["統一した従来技術"]
["補完調査情報"]
[null,"⑪","概算施工費用　注1）",null,"施工費"]
[null,null,null,null,"材料費"]
[null,null,null,null,"合計"]
[null,null,null,null,"備考"]
[null,"⑫","概算施工日数"]
[null,"⑬","施工規模"]
[null,"⑭","統一した従来技術との比較",null,"経済性"]
[null,null,null,null,"工程"]
[null,null,"判定の凡例\n○：従来技術より優れる\n△：従来技術と同程度\n－：上記以外",null,"品質・出来形"]
[null,null,null,null,"安全性"]
[null,null,null,null,"施工性"]
[null,null,null,null,"環境"]
[null,"⑮","試験項目",null,"ひび割れ補修材料"]
[null,null,null,null,"試験規格"]
[null,null,"補修材料の性能","粘性"]
[null,null,null,"モルタル付着強度\n（接着強度）\n（N/mm2）","標準（乾燥）"]
[null,null,null,null,"低温時"]
[null,null,null,null,"湿潤時"]
[null,null,null,null,"乾湿繰返し時"]
[null,null,null,"硬化収縮率（％）","（型・試験片の寸法差）"]
[null,null,null,null,"（固体・液体時の密度差）"]
[null,null,null,"引張強度（N/mm2）"]
[null,null,null,"伸び率（％）"]
[null,null,null,"圧縮強度（N/mm2）"]
[null,null,null,"可使時間"]
[null,null,null,"硬化時間"]
[null,null,null,"付着力耐久性保持率（％）"]
[null,null,null,"その他の試験"]
[null,"⑯","実施している性能評価試験"]
[null,"⑰","耐用年数"]
[null,"⑱","施工実績\n（過去３年）",null,"国土交通省：活用効果調査表数"]
[null,null,null,null,"地方自治体：開発者ヒアリング"]
[null,null,null,null,"その他：開発者ヒアリング"]
[null,"⑲","特許等","特許"]
[null,null,null,"建設技術審査証明"]
[null,"⑳","生産供給体制（機械保有台数等）"]
[null,"㉑","備考"]
["総括","㉒","耐久性"]
[null,"㉓","施工性\n(留意事項含む）"]
[null,"㉔","その他（留意事項含む）"]
["注1）施工費用：2025年4月福岡県久留米市  注2）／：補完調査未実施"]

{"sheet":"簡易版","index":3,"n_rows":6,"n_cols":29,"rows_kept":6,"cut":false,"hidden":false,"merged":[[4,22,4,27],[4,28,5,28],[4,3,5,3],[4,4,5,4],[4,5,5,5],[4,6,5,6],[4,20,5,20],[4,21,5,21],[4,9,4,19],[4,7,4,8]]}
[null,null,null,"コンクリート構造物補修工（ひび割れ補修工法）"]
[null,null,null,{"$f":"検索!S4","v":"工法比較表検索結果[19技術24仕様の内、19技術24仕様]"}]
[]
[]
[null,null,null,"番号","技術名","NETIS番号","開発者","施工条件・適用条件等",null,"補修材料の性能",null,null,null,null,null,null,null,null,null,null,"対象延長当り\n概算施工費用","対象延長当り\n概算施工日数","統一した従来技術との比較",null,null,null,null,null,"概要"]
[null,null,null,null,null,null,null,"施工方法","補修材料","ひび割れ\n補修材料","粘性","モルタル付着強度（N/mm2）\n標準（乾燥）","硬化収縮率（％）\n（型・試験片の寸法差）","硬化収縮率（％）\n（固体・液体時の密度差）","引張強度\n（N/mm2)","伸び率（％）","圧縮強度（N/mm2）","可使時間","硬化時間","付着力耐久性保持率\n（％）",null,null,"経済性","工程","品質・出来形","安全性","施工性","環境"]

{"sheet":"DB","index":4,"n_rows":99,"n_cols":53,"rows_kept":99,"cut":false,"hidden":false,"merged":[[4,5,4,6],[5,5,5,6],[6,5,6,6],[7,5,7,6],[8,5,8,6],[9,5,9,6],[10,5,10,6],[11,5,11,6],[20,5,20,6],[21,5,21,6],[22,5,22,6],[14,5,14,6],[15,5,15,6],[16,5,16,6],[59,5,59,6],[17,5,17,6],[18,5,18,6],[68,2,68,4],[14,3,14,4],[15,3,15,4],[16,3,16,4],[38,2,41,3],[12,3,12,4],[11,2,11,4],[68,5,68,6],[69,5,69,6],[61,5,61,6],[62,5,62,6],[63,5,63,6],[23,5,23,6],[24,5,24,6],[25,5,25,6],[26,5,26,6],[36,2,37,3],[19,2,19,4],[18,3,18,4],[17,3,17,4],[28,0,28,4],[19,5,19,6],[27,5,27,6],[28,5,28,6],[21,2,27,3],[20,0,27,0],[20,1,27,1],[20,2,20,3],[4,0,19,0],[4,1,4,4],[5,2,5,4],[41,5,41,6],[67,2,67,4],[66,2,66,4],[29,0,66,0],[29,1,29,4],[65,2,65,4],[64,3,64,4],[63,1,64,1],[63,2,64,2],[63,3,63,4],[60,1,62,1],[60,2,62,3],[59,2,59,4],[36,1,41,1],[30,1,33,1],[30,2,33,3],[34,2,34,4],[2,5,2,6],[3,5,3,6],[10,2,10,4],[9,2,9,4],[8,2,8,4],[7,2,7,4],[6,2,6,4],[13,3,13,4],[12,1,18,1],[12,2,18,2],[12,5,12,6],[13,5,13,6],[60,5,60,6],[38,5,38,6],[39,5,39,6],[40,5,40,6],[2,7,2,8],[3,7,3,8],[4,7,4,8],[5,7,5,8],[6,7,6,8],[7,7,7,8],[8,7,8,8],[9,7,9,8],[10,7,10,8],[70,0,70,4],[57,2,57,4],[57,5,57,6],[58,2,58,4],[58,5,58,6],[44,2,56,2],[44,3,44,4],[45,3,48,3],[49,3,50,3],[53,3,53,4],[54,3,54,4],[55,3,55,4],[56,3,56,4],[42,1,57,1],[42,2,43,3],[51,3,51,4],[52,3,52,4],[64,5,64,6],[65,5,65,6],[66,5,66,6],[67,5,67,6],[35,2,35,4],[67,0,69,0],[61,7,61,8],[20,7,20,8],[21,7,21,8],[22,7,22,8],[23,7,23,8],[24,7,24,8],[25,7,25,8],[26,7,26,8],[27,7,27,8],[28,7,28,8],[11,7,11,8],[12,7,12,8],[13,7,13,8],[14,7,14,8],[15,7,15,8],[16,7,16,8],[17,7,17,8],[18,7,18,8],[19,7,19,8],[62,7,62,8],[63,7,63,8],[64,7,64,8],[65,7,65,8],[66,7,66,8],[67,7,67,8],[68,7,68,8],[69,7,69,8],[2,9,2,10],[3,9,3,10],[4,9,4,10],[5,9,5,10],[6,9,6,10],[7,9,7,10],[8,9,8,10],[9,9,9,10],[10,9,10,10],[11,9,11,10],[12,9,12,10],[13,9,13,10],[14,9,14,10],[15,9,15,10],[16,9,16,10],[17,9,17,10],[38,7,38,8],[39,7,39,8],[40,7,40,8],[41,7,41,8],[57,7,57,8],[58,7,58,8],[59,7,59,8],[60,7,60,8],[67,9,67,10],[68,9,68,10],[27,9,27,10],[28,9,28,10],[38,9,38,10],[39,9,39,10],[40,9,40,10],[41,9,41,10],[57,9,57,10],[58,9,58,10],[59,9,59,10],[18,9,18,10],[19,9,19,10],[20,9,20,10],[21,9,21,10],[22,9,22,10],[23,9,23,10],[24,9,24,10],[25,9,25,10],[26,9,26,10],[2,43,2,44],[69,9,69,10],[2,11,2,12],[2,13,2,14],[2,15,2,16],[2,17,2,18],[2,19,2,20],[2,21,2,22],[2,23,2,24],[2,25,2,26],[5,11,5,12],[5,13,5,14],[5,15,5,16],[5,17,5,18],[5,19,5,20],[5,21,5,22],[5,23,5,24],[5,25,5,26],[8,11,8,12],[8,13,8,14],[8,15,8,16],[8,17,8,18],[8,19,8,20],[8,21,8,22],[8,23,8,24],[60,9,60,10],[61,9,61,10],[62,9,62,10],[63,9,63,10],[64,9,64,10],[65,9,65,10],[66,9,66,10],[2,45,2,46],[2,47,2,48],[2,49,2,50],[2,51,2,52],[3,11,3,12],[3,13,3,14],[3,15,3,16],[3,17,3,18],[3,19,3,20],[3,21,3,22],[3,23,3,24],[3,25,3,26],[3,27,3,28],[3,29,3,30],[3,31,3,32],[3,33,3,34],[3,35,3,36],[3,37,3,38],[3,39,3,40],[3,41,3,42],[3,43,3,44],[3,45,3,46],[3,47,3,48],[3,49,3,50],[2,27,2,28],[2,29,2,30],[2,31,2,32],[2,33,2,34],[2,35,2,36],[2,37,2,38],[2,39,2,40],[2,41,2,42],[5,43,5,44],[3,51,3,52],[4,11,4,12],[4,13,4,14],[4,15,4,16],[4,17,4,18],[4,19,4,20],[4,21,4,22],[4,23,4,24],[4,25,4,26],[4,27,4,28],[4,29,4,30],[4,31,4,32],[4,33,4,34],[4,35,4,36],[4,37,4,38],[4,39,4,40],[4,41,4,42],[4,43,4,44],[4,45,4,46],[4,47,4,48],[4,49,4,50],[4,51,4,52],[5,45,5,46],[5,47,5,48],[5,49,5,50],[5,51,5,52],[6,11,6,12],[6,13,6,14],[6,15,6,16],[6,17,6,18],[6,19,6,20],[6,21,6,22],[6,23,6,24],[6,25,6,26],[6,27,6,28],[6,29,6,30],[6,31,6,32],[6,33,6,34],[6,35,6,36],[6,37,6,38],[6,39,6,40],[6,41,6,42],[6,43,6,44],[6,45,6,46],[6,47,6,48],[6,49,6,50],[5,27,5,28],[5,29,5,30],[5,31,5,32],[5,33,5,34],[5,35,5,36],[5,37,5,38],[5,39,5,40],[5,41,5,42],[8,39,8,40],[8,41,8,42],[6,51,6,52],[7,11,7,12],[7,13,7,14],[7,15,7,16],[7,17,7,18],[7,19,7,20],[7,21,7,22],[7,23,7,24],[7,25,7,26],[7,27,7,28],[7,29,7,30],[7,31,7,32],[7,33,7,34],[7,35,7,36],[7,37,7,38],[7,39,7,40],[7,41,7,42],[7,43,7,44],[7,45,7,46],[7,47,7,48],[7,49,7,50],[7,51,7,52],[10,51,10,52],[8,43,8,44],[8,45,8,46],[8,47,8,48],[8,49,8,50],[8,51,8,52],[9,11,9,12],[9,13,9,14],[9,15,9,16],[9,17,9,18],[9,19,9,20],[9,21,9,22],[9,23,9,24],[9,25,9,26],[9,27,9,28],[9,29,9,30],[9,31,9,32],[9,33,9,34],[9,35,9,36],[9,37,9,38],[9,39,9,40],[9,41,9,42],[9,43,9,44],[9,45,9,46],[9,47,9,48],[8,25,8,26],[8,27,8,28],[8,29,8,30],[8,31,8,32],[8,33,8,34],[8,35,8,36],[8,37,8,38],[11,45,11,46],[11,11,11,12],[11,13,11,14],[11,15,11,16],[11,17,11,18],[11,19,11,20],[11,21,11,22],[11,23,11,24],[11,25,11,26],[11,27,11,28],[9,49,9,50],[9,51,9,52],[10,11,10,12],[10,13,10,14],[10,15,10,16],[10,17,10,18],[10,19,10,20],[10,21,10,22],[10,23,10,24],[10,25,10,26],[10,27,10,28],[10,29,10,30],[10,31,10,32],[10,33,10,34],[10,35,10,36],[10,37,10,38],[10,39,10,40],[10,41,10,42],[10,43,10,44],[10,45,10,46],[10,47,10,48],[10,49,10,50],[11,47,11,48],[11,49,11,50],[11,51,11,52],[12,11,12,12],[12,13,12,14],[12,15,12,16],[12,17,12,18],[12,19,12,20],[12,21,12,22],[12,23,12,24],[12,25,12,26],[12,27,12,28],[12,29,12,30],[12,31,12,32],[12,33,12,34],[12,35,12,36],[12,37,12,38],[12,39,12,40],[12,41,12,42],[12,43,12,44],[12,45,12,46],[12,47,12,48],[12,49,12,50],[12,51,12,52],[11,29,11,30],[11,31,11,32],[11,33,11,34],[11,35,11,36],[11,37,11,38],[11,39,11,40],[11,41,11,42],[11,43,11,44],[14,49,14,50],[14,51,14,52],[13,29,13,30],[13,31,13,32],[13,33,13,34],[13,35,13,36],[13,37,13,38],[13,39,13,40],[13,41,13,42],[13,43,13,44],[13,45,13,46],[13,11,13,12],[13,13,13,14],[13,15,13,16],[13,17,13,18],[13,19,13,20],[13,21,13,22],[13,23,13,24],[13,25,13,26],[13,27,13,28],[15,45,15,46],[15,11,15,12],[15,13,15,14],[15,15,15,16],[15,17,15,18],[15,19,15,20],[15,21,15,22],[15,23,15,24],[15,25,15,26],[15,27,15,28],[13,47,13,48],[13,49,13,50],[13,51,13,52],[14,11,14,12],[14,13,14,14],[14,15,14,16],[14,17,14,18],[14,19,14,20],[14,21,14,22],[14,23,14,24],[14,25,14,26],[14,27,14,28],[14,29,14,30],[14,31,14,32],[14,33,14,34],[14,35,14,36],[14,37,14,38],[14,39,14,40],[14,41,14,42],[14,43,14,44],[14,45,14,46],[14,47,14,48],[15,47,15,48],[15,49,15,50],[15,51,15,52],[16,11,16,12],[16,13,16,14],[16,15,16,16],[16,17,16,18],[16,19,16,20],[16,21,16,22],[16,23,16,24],[16,25,16,26],[16,27,16,28],[16,29,16,30],[16,31,16,32],[16,33,16,34],[16,35,16,36],[16,37,16,38],[16,39,16,40],[16,41,16,42],[16,43,16,44],[16,45,16,46],[16,47,16,48],[16,49,16,50],[16,51,16,52],[15,29,15,30],[15,31,15,32],[15,33,15,34],[15,35,15,36],[15,37,15,38],[15,39,15,40],[15,41,15,42],[15,43,15,44],[18,49,18,50],[18,51,18,52],[17,29,17,30],[17,31,17,32],[17,33,17,34],[17,35,17,36],[17,37,17,38],[17,39,17,40],[17,41,17,42],[17,43,17,44],[17,45,17,46],[17,11,17,12],[17,13,17,14],[17,15,17,16],[17,17,17,18],[17,19,17,20],[17,21,17,22],[17,23,17,24],[17,25,17,26],[17,27,17,28],[19,45,19,46],[19,11,19,12],[19,13,19,14],[19,15,19,16],[19,17,19,18],[19,19,19,20],[19,21,19,22],[19,23,19,24],[19,25,19,26],[19,27,19,28],[17,47,17,48],[17,49,17,50],[17,51,17,52],[18,11,18,12],[18,13,18,14],[18,15,18,16],[18,17,18,18],[18,19,18,20],[18,21,18,22],[18,23,18,24],[18,25,18,26],[18,27,18,28],[18,29,18,30],[18,31,18,32],[18,33,18,34],[18,35,18,36],[18,37,18,38],[18,39,18,40],[18,41,18,42],[18,43,18,44],[18,45,18,46],[18,47,18,48],[19,47,19,48],[19,49,19,50],[19,51,19,52],[20,11,20,12],[20,13,20,14],[20,15,20,16],[20,17,20,18],[20,19,20,20],[20,21,20,22],[20,23,20,24],[20,25,20,26],[20,27,20,28],[20,29,20,30],[20,31,20,32],[20,33,20,34],[20,35,20,36],[20,37,20,38],[20,39,20,40],[20,41,20,42],[20,43,20,44],[20,45,20,46],[20,47,20,48],[20,49,20,50],[20,51,20,52],[19,29,19,30],[19,31,19,32],[19,33,19,34],[19,35,19,36],[19,37,19,38],[19,39,19,40],[19,41,19,42],[19,43,19,44],[22,49,22,50],[22,51,22,52],[21,29,21,30],[21,31,21,32],[21,33,21,34],[21,35,21,36],[21,37,21,38],[21,39,21,40],[21,41,21,42],[21,43,21,44],[21,45,21,46],[21,11,21,12],[21,13,21,14],[21,15,21,16],[21,17,21,18],[21,19,21,20],[21,21,21,22],[21,23,21,24],[21,25,21,26],[21,27,21,28],[23,45,23,46],[23,11,23,12],[23,13,23,14],[23,15,23,16],[23,17,23,18],[23,19,23,20],[23,21,23,22],[23,23,23,24],[23,25,23,26],[23,27,23,28],[21,47,21,48],[21,49,21,50],[21,51,21,52],[22,11,22,12],[22,13,22,14],[22,15,22,16],[22,17,22,18],[22,19,22,20],[22,21,22,22],[22,23,22,24],[22,25,22,26],[22,27,22,28],[22,29,22,30],[22,31,22,32],[22,33,22,34],[22,35,22,36],[22,37,22,38],[22,39,22,40],[22,41,22,42],[22,43,22,44],[22,45,22,46],[22,47,22,48],[23,47,23,48],[23,49,23,50],[23,51,23,52],[24,11,24,12],[24,13,24,14],[24,15,24,16],[24,17,24,18],[24,19,24,20],[24,21,24,22],[24,23,24,24],[24,25,24,26],[24,27,24,28],[24,29,24,30],[24,31,24,32],[24,33,24,34],[24,35,24,36],[24,37,24,38],[24,39,24,40],[24,41,24,42],[24,43,24,44],[24,45,24,46],[24,47,24,48],[24,49,24,50],[24,51,24,52],[23,29,23,30],[23,31,23,32],[23,33,23,34],[23,35,23,36],[23,37,23,38],[23,39,23,40],[23,41,23,42],[23,43,23,44],[26,49,26,50],[26,51,26,52],[25,29,25,30],[25,31,25,32],[25,33,25,34],[25,35,25,36],[25,37,25,38],[25,39,25,40],[25,41,25,42],[25,43,25,44],[25,45,25,46],[25,11,25,12],[25,13,25,14],[25,15,25,16],[25,17,25,18],[25,19,25,20],[25,21,25,22],[25,23,25,24],[25,25,25,26],[25,27,25,28],[27,45,27,46],[27,11,27,12],[27,13,27,14],[27,15,27,16],[27,17,27,18],[27,19,27,20],[27,21,27,22],[27,23,27,24],[27,25,27,26],[27,27,27,28],[25,47,25,48],[25,49,25,50],[25,51,25,52],[26,11,26,12],[26,13,26,14],[26,15,26,16],[26,17,26,18],[26,19,26,20],[26,21,26,22],[26,23,26,24],[26,25,26,26],[26,27,26,28],[26,29,26,30],[26,31,26,32],[26,33,26,34],[26,35,26,36],[26,37,26,38],[26,39,26,40],[26,41,26,42],[26,43,26,44],[26,45,26,46],[26,47,26,48],[27,47,27,48],[27,49,27,50],[27,51,27,52],[28,11,28,12],[28,13,28,14],[28,15,28,16],[28,17,28,18],[28,19,28,20],[28,21,28,22],[28,23,28,24],[28,25,28,26],[28,27,28,28],[28,29,28,30],[28,31,28,32],[28,33,28,34],[28,35,28,36],[28,37,28,38],[28,39,28,40],[28,41,28,42],[28,43,28,44],[28,45,28,46],[28,47,28,48],[28,49,28,50],[28,51,28,52],[27,29,27,30],[27,31,27,32],[27,33,27,34],[27,35,27,36],[27,37,27,38],[27,39,27,40],[27,41,27,42],[27,43,27,44],[39,49,39,50],[39,51,39,52],[38,29,38,30],[38,31,38,32],[38,33,38,34],[38,35,38,36],[38,37,38,38],[38,39,38,40],[38,41,38,42],[38,43,38,44],[38,45,38,46],[38,11,38,12],[38,13,38,14],[38,15,38,16],[38,17,38,18],[38,19,38,20],[38,21,38,22],[38,23,38,24],[38,25,38,26],[38,27,38,28],[40,45,40,46],[40,11,40,12],[40,13,40,14],[40,15,40,16],[40,17,40,18],[40,19,40,20],[40,21,40,22],[40,23,40,24],[40,25,40,26],[40,27,40,28],[38,47,38,48],[38,49,38,50],[38,51,38,52],[39,11,39,12],[39,13,39,14],[39,15,39,16],[39,17,39,18],[39,19,39,20],[39,21,39,22],[39,23,39,24],[39,25,39,26],[39,27,39,28],[39,29,39,30],[39,31,39,32],[39,33,39,34],[39,35,39,36],[39,37,39,38],[39,39,39,40],[39,41,39,42],[39,43,39,44],[39,45,39,46],[39,47,39,48],[40,47,40,48],[40,49,40,50],[40,51,40,52],[41,11,41,12],[41,13,41,14],[41,15,41,16],[41,17,41,18],[41,19,41,20],[41,21,41,22],[41,23,41,24],[41,25,41,26],[41,27,41,28],[41,29,41,30],[41,31,41,32],[41,33,41,34],[41,35,41,36],[41,37,41,38],[41,39,41,40],[41,41,41,42],[41,43,41,44],[41,45,41,46],[41,47,41,48],[41,49,41,50],[41,51,41,52],[40,29,40,30],[40,31,40,32],[40,33,40,34],[40,35,40,36],[40,37,40,38],[40,39,40,40],[40,41,40,42],[40,43,40,44],[58,49,58,50],[58,51,58,52],[57,29,57,30],[57,31,57,32],[57,33,57,34],[57,35,57,36],[57,37,57,38],[57,39,57,40],[57,41,57,42],[57,43,57,44],[57,45,57,46],[57,11,57,12],[57,13,57,14],[57,15,57,16],[57,17,57,18],[57,19,57,20],[57,21,57,22],[57,23,57,24],[57,25,57,26],[57,27,57,28],[59,45,59,46],[59,11,59,12],[59,13,59,14],[59,15,59,16],[59,17,59,18],[59,19,59,20],[59,21,59,22],[59,23,59,24],[59,25,59,26],[59,27,59,28],[57,47,57,48],[57,49,57,50],[57,51,57,52],[58,11,58,12],[58,13,58,14],[58,15,58,16],[58,17,58,18],[58,19,58,20],[58,21,58,22],[58,23,58,24],[58,25,58,26],[58,27,58,28],[58,29,58,30],[58,31,58,32],[58,33,58,34],[58,35,58,36],[58,37,58,38],[58,39,58,40],[58,41,58,42],[58,43,58,44],[58,45,58,46],[58,47,58,48],[59,47,59,48],[59,49,59,50],[59,51,59,52],[60,11,60,12],[60,13,60,14],[60,15,60,16],[60,17,60,18],[60,19,60,20],[60,21,60,22],[60,23,60,24],[60,25,60,26],[60,27,60,28],[60,29,60,30],[60,31,60,32],[60,33,60,34],[60,35,60,36],[60,37,60,38],[60,39,60,40],[60,41,60,42],[60,43,60,44],[60,45,60,46],[60,47,60,48],[60,49,60,50],[60,51,60,52],[59,29,59,30],[59,31,59,32],[59,33,59,34],[59,35,59,36],[59,37,59,38],[59,39,59,40],[59,41,59,42],[59,43,59,44],[62,49,62,50],[62,51,62,52],[61,29,61,30],[61,31,61,32],[61,33,61,34],[61,35,61,36],[61,37,61,38],[61,39,61,40],[61,41,61,42],[61,43,61,44],[61,45,61,46],[61,11,61,12],[61,13,61,14],[61,15,61,16],[61,17,61,18],[61,19,61,20],[61,21,61,22],[61,23,61,24],[61,25,61,26],[61,27,61,28],[63,45,63,46],[63,11,63,12],[63,13,63,14],[63,15,63,16],[63,17,63,18],[63,19,63,20],[63,21,63,22],[63,23,63,24],[63,25,63,26],[63,27,63,28],[61,47,61,48],[61,49,61,50],[61,51,61,52],[62,11,62,12],[62,13,62,14],[62,15,62,16],[62,17,62,18],[62,19,62,20],[62,21,62,22],[62,23,62,24],[62,25,62,26],[62,27,62,28],[62,29,62,30],[62,31,62,32],[62,33,62,34],[62,35,62,36],[62,37,62,38],[62,39,62,40],[62,41,62,42],[62,43,62,44],[62,45,62,46],[62,47,62,48],[63,47,63,48],[63,49,63,50],[63,51,63,52],[64,11,64,12],[64,13,64,14],[64,15,64,16],[64,17,64,18],[64,19,64,20],[64,21,64,22],[64,23,64,24],[64,25,64,26],[64,27,64,28],[64,29,64,30],[64,31,64,32],[64,33,64,34],[64,35,64,36],[64,37,64,38],[64,39,64,40],[64,41,64,42],[64,43,64,44],[64,45,64,46]],"merged_total":1133,"flags":["merged_cut"]}
[null,null,null,null,null,"1-1",null,"2-1",null,"3-1",null,"4-1",null,"4-2",null,"8-1",null,"9-1",null,"11-1",null,"11-2",null,"11-3",null,"11-4",null,"12-1",null,"13-1",null,"13-2",null,"14-1",null,"15-1",null,"16-1",null,"17-1",null,"18-1",null,"19-1",null,"20-1",null,"21-1",null,"22-1",null,"23-1"]
["ひび割れ補修工",null,null,null,null,{"$f":"IF(LEN(VLOOKUP(F1,仕様の整理!$C:$E,3,0))-LEN(SUBSTITUTE(VLOOKUP(F1,仕様の整理!$C:$E,3,0),\"-\",\"\"))>=2,LEFT(VLOOKUP(F1,仕様の整理!$C:$E,3,0),FIND(\"-\",VLOOKUP(F1,仕様の整理!$C:$E,3,0),FIND(\"-\",VLOOKUP(F1,仕様の整理!$C:$E,3,0))+1)-1),VLOOKUP(F1,仕様の整理!$C:$E,3,0))","v":"CG-110003"},null,{"$f":"IF(LEN(VLOOKUP(H1,仕様の整理!$C:$E,3,0))-LEN(SUBSTITUTE(VLOOKUP(H1,仕様の整理!$C:$E,3,0),\"-\",\"\"))>=2,LEFT(VLOOKUP(H1,仕様の整理!$C:$E,3,0),FIND(\"-\",VLOOKUP(H1,仕様の整理!$C:$E,3,0),FIND(\"-\",VLOOKUP(H1,仕様の整理!$C:$E,3,0))+1)-1),VLOOKUP(H1,仕様の整理!$C:$E,3,0))","v":"CG-110017"},null,{"$f":"IF(LEN(VLOOKUP(J1,仕様の整理!$C:$E,3,0))-LEN(SUBSTITUTE(VLOOKUP(J1,仕様の整理!$C:$E,3,0),\"-\",\"\"))>=2,LEFT(VLOOKUP(J1,仕様の整理!$C:$E,3,0),FIND(\"-\",VLOOKUP(J1,仕様の整理!$C:$E,3,0),FIND(\"-\",VLOOKUP(J1,仕様の整理!$C:$E,3,0))+1)-1),VLOOKUP(J1,仕様の整理!$C:$E,3,0))","v":"KT-120057"},null,{"$f":"IF(LEN(VLOOKUP(L1,仕様の整理!$C:$E,3,0))-LEN(SUBSTITUTE(VLOOKUP(L1,仕様の整理!$C:$E,3,0),\"-\",\"\"))>=2,LEFT(VLOOKUP(L1,仕様の整理!$C:$E,3,0),FIND(\"-\",VLOOKUP(L1,仕様の整理!$C:$E,3,0),FIND(\"-\",VLOOKUP(L1,仕様の整理!$C:$E,3,0))+1)-1),VLOOKUP(L1,仕様の整理!$C:$E,3,0))","v":"CB-130007"},null,{"$f":"IF(LEN(VLOOKUP(N1,仕様の整理!$C:$E,3,0))-LEN(SUBSTITUTE(VLOOKUP(N1,仕様の整理!$C:$E,3,0),\"-\",\"\"))>=2,LEFT(VLOOKUP(N1,仕様の整理!$C:$E,3,0),FIND(\"-\",VLOOKUP(N1,仕様の整理!$C:$E,3,0),FIND(\"-\",VLOOKUP(N1,仕様の整理!$C:$E,3,0))+1)-1),VLOOKUP(N1,仕様の整理!$C:$E,3,0))","v":"CB-130007"},null,{"$f":"IF(LEN(VLOOKUP(P1,仕様の整理!$C:$E,3,0))-LEN(SUBSTITUTE(VLOOKUP(P1,仕様の整理!$C:$E,3,0),\"-\",\"\"))>=2,LEFT(VLOOKUP(P1,仕様の整理!$C:$E,3,0),FIND(\"-\",VLOOKUP(P1,仕様の整理!$C:$E,3,0),FIND(\"-\",VLOOKUP(P1,仕様の整理!$C:$E,3,0))+1)-1),VLOOKUP(P1,仕様の整理!$C:$E,3,0))","v":"KT-160095"},null,{"$f":"IF(LEN(VLOOKUP(R1,仕様の整理!$C:$E,3,0))-LEN(SUBSTITUTE(VLOOKUP(R1,仕様の整理!$C:$E,3,0),\"-\",\"\"))>=2,LEFT(VLOOKUP(R1,仕様の整理!$C:$E,3,0),FIND(\"-\",VLOOKUP(R1,仕様の整理!$C:$E,3,0),FIND(\"-\",VLOOKUP(R1,仕様の整理!$C:$E,3,0))+1)-1),VLOOKUP(R1,仕様の整理!$C:$E,3,0))","v":"HK-170005"},null,{"$f":"IF(LEN(VLOOKUP(T1,仕様の整理!$C:$E,3,0))-LEN(SUBSTITUTE(VLOOKUP(T1,仕様の整理!$C:$E,3,0),\"-\",\"\"))>=2,LEFT(VLOOKUP(T1,仕様の整理!$C:$E,3,0),FIND(\"-\",VLOOKUP(T1,仕様の整理!$C:$E,3,0),FIND(\"-\",VLOOKUP(T1,仕様の整理!$C:$E,3,0))+1)-1),VLOOKUP(T1,仕様の整理!$C:$E,3,0))","v":"QS-990009"},null,{"$f":"IF(LEN(VLOOKUP(V1,仕様の整理!$C:$E,3,0))-LEN(SUBSTITUTE(VLOOKUP(V1,仕様の整理!$C:$E,3,0),\"-\",\"\"))>=2,LEFT(VLOOKUP(V1,仕様の整理!$C:$E,3,0),FIND(\"-\",VLOOKUP(V1,仕様の整理!$C:$E,3,0),FIND(\"-\",VLOOKUP(V1,仕様の整理!$C:$E,3,0))+1)-1),VLOOKUP(V1,仕様の整理!$C:$E,3,0))","v":"QS-990009"},null,{"$f":"IF(LEN(VLOOKUP(X1,仕様の整理!$C:$E,3,0))-LEN(SUBSTITUTE(VLOOKUP(X1,仕様の整理!$C:$E,3,0),\"-\",\"\"))>=2,LEFT(VLOOKUP(X1,仕様の整理!$C:$E,3,0),FIND(\"-\",VLOOKUP(X1,仕様の整理!$C:$E,3,0),FIND(\"-\",VLOOKUP(X1,仕様の整理!$C:$E,3,0))+1)-1),VLOOKUP(X1,仕様の整理!$C:$E,3,0))","v":"QS-990009"},null,{"$f":"IF(LEN(VLOOKUP(Z1,仕様の整理!$C:$E,3,0))-LEN(SUBSTITUTE(VLOOKUP(Z1,仕様の整理!$C:$E,3,0),\"-\",\"\"))>=2,LEFT(VLOOKUP(Z1,仕様の整理!$C:$E,3,0),FIND(\"-\",VLOOKUP(Z1,仕様の整理!$C:$E,3,0),FIND(\"-\",VLOOKUP(Z1,仕様の整理!$C:$E,3,0))+1)-1),VLOOKUP(Z1,仕様の整理!$C:$E,3,0))","v":"QS-990009"},null,{"$f":"IF(LEN(VLOOKUP(AB1,仕様の整理!$C:$E,3,0))-LEN(SUBSTITUTE(VLOOKUP(AB1,仕様の整理!$C:$E,3,0),\"-\",\"\"))>=2,LEFT(VLOOKUP(AB1,仕様の整理!$C:$E,3,0),FIND(\"-\",VLOOKUP(AB1,仕様の整理!$C:$E,3,0),FIND(\"-\",VLOOKUP(AB1,仕様の整理!$C:$E,3,0))+1)-1),VLOOKUP(AB1,仕様の整理!$C:$E,3,0))","v":"SK-050009"},null,{"$f":"IF(LEN(VLOOKUP(AD1,仕様の整理!$C:$E,3,0))-LEN(SUBSTITUTE(VLOOKUP(AD1,仕様の整理!$C:$E,3,0),\"-\",\"\"))>=2,LEFT(VLOOKUP(AD1,仕様の整理!$C:$E,3,0),FIND(\"-\",VLOOKUP(AD1,仕様の整理!$C:$E,3,0),FIND(\"-\",VLOOKUP(AD1,仕様の整理!$C:$E,3,0))+1)-1),VLOOKUP(AD1,仕様の整理!$C:$E,3,0))","v":"QS-980215"},null,{"$f":"IF(LEN(VLOOKUP(AF1,仕様の整理!$C:$E,3,0))-LEN(SUBSTITUTE(VLOOKUP(AF1,仕様の整理!$C:$E,3,0),\"-\",\"\"))>=2,LEFT(VLOOKUP(AF1,仕様の整理!$C:$E,3,0),FIND(\"-\",VLOOKUP(AF1,仕様の整理!$C:$E,3,0),FIND(\"-\",VLOOKUP(AF1,仕様の整理!$C:$E,3,0))+1)-1),VLOOKUP(AF1,仕様の整理!$C:$E,3,0))","v":"QS-980215"},null,{"$f":"IF(LEN(VLOOKUP(AH1,仕様の整理!$C:$E,3,0))-LEN(SUBSTITUTE(VLOOKUP(AH1,仕様の整理!$C:$E,3,0),\"-\",\"\"))>=2,LEFT(VLOOKUP(AH1,仕様の整理!$C:$E,3,0),FIND(\"-\",VLOOKUP(AH1,仕様の整理!$C:$E,3,0),FIND(\"-\",VLOOKUP(AH1,仕様の整理!$C:$E,3,0))+1)-1),VLOOKUP(AH1,仕様の整理!$C:$E,3,0))","v":"KK-020003"},null,{"$f":"IF(LEN(VLOOKUP(AJ1,仕様の整理!$C:$E,3,0))-LEN(SUBSTITUTE(VLOOKUP(AJ1,仕様の整理!$C:$E,3,0),\"-\",\"\"))>=2,LEFT(VLOOKUP(AJ1,仕様の整理!$C:$E,3,0),FIND(\"-\",VLOOKUP(AJ1,仕様の整理!$C:$E,3,0),FIND(\"-\",VLOOKUP(AJ1,仕様の整理!$C:$E,3,0))+1)-1),VLOOKUP(AJ1,仕様の整理!$C:$E,3,0))","v":"CG-070007"},null,{"$f":"IF(LEN(VLOOKUP(AL1,仕様の整理!$C:$E,3,0))-LEN(SUBSTITUTE(VLOOKUP(AL1,仕様の整理!$C:$E,3,0),\"-\",\"\"))>=2,LEFT(VLOOKUP(AL1,仕様の整理!$C:$E,3,0),FIND(\"-\",VLOOKUP(AL1,仕様の整理!$C:$E,3,0),FIND(\"-\",VLOOKUP(AL1,仕様の整理!$C:$E,3,0))+1)-1),VLOOKUP(AL1,仕様の整理!$C:$E,3,0))","v":"CG-180004"},null,{"$f":"IF(LEN(VLOOKUP(AN1,仕様の整理!$C:$E,3,0))-LEN(SUBSTITUTE(VLOOKUP(AN1,仕様の整理!$C:$E,3,0),\"-\",\"\"))>=2,LEFT(VLOOKUP(AN1,仕様の整理!$C:$E,3,0),FIND(\"-\",VLOOKUP(AN1,仕様の整理!$C:$E,3,0),FIND(\"-\",VLOOKUP(AN1,仕様の整理!$C:$E,3,0))+1)-1),VLOOKUP(AN1,仕様の整理!$C:$E,3,0))","v":"HK-180017"},null,{"$f":"IF(LEN(VLOOKUP(AP1,仕様の整理!$C:$E,3,0))-LEN(SUBSTITUTE(VLOOKUP(AP1,仕様の整理!$C:$E,3,0),\"-\",\"\"))>=2,LEFT(VLOOKUP(AP1,仕様の整理!$C:$E,3,0),FIND(\"-\",VLOOKUP(AP1,仕様の整理!$C:$E,3,0),FIND(\"-\",VLOOKUP(AP1,仕様の整理!$C:$E,3,0))+1)-1),VLOOKUP(AP1,仕様の整理!$C:$E,3,0))","v":"KT-180135"},null,{"$f":"IF(LEN(VLOOKUP(AR1,仕様の整理!$C:$E,3,0))-LEN(SUBSTITUTE(VLOOKUP(AR1,仕様の整理!$C:$E,3,0),\"-\",\"\"))>=2,LEFT(VLOOKUP(AR1,仕様の整理!$C:$E,3,0),FIND(\"-\",VLOOKUP(AR1,仕様の整理!$C:$E,3,0),FIND(\"-\",VLOOKUP(AR1,仕様の整理!$C:$E,3,0))+1)-1),VLOOKUP(AR1,仕様の整理!$C:$E,3,0))","v":"KK-190024"},null,{"$f":"IF(LEN(VLOOKUP(AT1,仕様の整理!$C:$E,3,0))-LEN(SUBSTITUTE(VLOOKUP(AT1,仕様の整理!$C:$E,3,0),\"-\",\"\"))>=2,LEFT(VLOOKUP(AT1,仕様の整理!$C:$E,3,0),FIND(\"-\",VLOOKUP(AT1,仕様の整理!$C:$E,3,0),FIND(\"-\",VLOOKUP(AT1,仕様の整理!$C:$E,3,0))+1)-1),VLOOKUP(AT1,仕様の整理!$C:$E,3,0))","v":"KK-200030"},null,{"$f":"IF(LEN(VLOOKUP(AV1,仕様の整理!$C:$E,3,0))-LEN(SUBSTITUTE(VLOOKUP(AV1,仕様の整理!$C:$E,3,0),\"-\",\"\"))>=2,LEFT(VLOOKUP(AV1,仕様の整理!$C:$E,3,0),FIND(\"-\",VLOOKUP(AV1,仕様の整理!$C:$E,3,0),FIND(\"-\",VLOOKUP(AV1,仕様の整理!$C:$E,3,0))+1)-1),VLOOKUP(AV1,仕様の整理!$C:$E,3,0))","v":"TH-200001"},null,{"$f":"IF(LEN(VLOOKUP(AX1,仕様の整理!$C:$E,3,0))-LEN(SUBSTITUTE(VLOOKUP(AX1,仕様の整理!$C:$E,3,0),\"-\",\"\"))>=2,LEFT(VLOOKUP(AX1,仕様の整理!$C:$E,3,0),FIND(\"-\",VLOOKUP(AX1,仕様の整理!$C:$E,3,0),FIND(\"-\",VLOOKUP(AX1,仕様の整理!$C:$E,3,0))+1)-1),VLOOKUP(AX1,仕様の整理!$C:$E,3,0))","v":"QS-230015"},null,{"$f":"IF(LEN(VLOOKUP(AZ1,仕様の整理!$C:$E,3,0))-LEN(SUBSTITUTE(VLOOKUP(AZ1,仕様の整理!$C:$E,3,0),\"-\",\"\"))>=2,LEFT(VLOOKUP(AZ1,仕様の整理!$C:$E,3,0),FIND(\"-\",VLOOKUP(AZ1,仕様の整理!$C:$E,3,0),FIND(\"-\",VLOOKUP(AZ1,仕様の整理!$C:$E,3,0))+1)-1),VLOOKUP(AZ1,仕様の整理!$C:$E,3,0))","v":"KT-230319"}]
[null,null,null,null,null,{"$f":"\"作成日：\"&VLOOKUP(F$1,仕様の整理!$C:$H,6,0)","v":"作成日：令和6年11月"},null,{"$f":"\"作成日：\"&VLOOKUP(H$1,仕様の整理!$C:$H,6,0)","v":"作成日：令和6年11月"},null,{"$f":"\"作成日：\"&VLOOKUP(J$1,仕様の整理!$C:$H,6,0)","v":"作成日：令和6年11月"},null,{"$f":"\"作成日：\"&VLOOKUP(L$1,仕様の整理!$C:$H,6,0)","v":"作成日：令和6年11月"},null,{"$f":"\"作成日：\"&VLOOKUP(N$1,仕様の整理!$C:$H,6,0)","v":"作成日：令和6年11月"},null,{"$f":"\"作成日：\"&VLOOKUP(P$1,仕様の整理!$C:$H,6,0)","v":"作成日：令和6年11月"},null,{"$f":"\"作成日：\"&VLOOKUP(R$1,仕様の整理!$C:$H,6,0)","v":"作成日：令和6年11月"},null,{"$f":"\"作成日：\"&VLOOKUP(T$1,仕様の整理!$C:$H,6,0)","v":"作成日：令和6年11月"},null,{"$f":"\"作成日：\"&VLOOKUP(V$1,仕様の整理!$C:$H,6,0)","v":"作成日：令和6年11月"},null,{"$f":"\"作成日：\"&VLOOKUP(X$1,仕様の整理!$C:$H,6,0)","v":"作成日：令和6年11月"},null,{"$f":"\"作成日：\"&VLOOKUP(Z$1,仕様の整理!$C:$H,6,0)","v":"作成日：令和6年11月"},null,{"$f":"\"作成日：\"&VLOOKUP(AB$1,仕様の整理!$C:$H,6,0)","v":"作成日：令和6年11月"},null,{"$f":"\"作成日：\"&VLOOKUP(AD$1,仕様の整理!$C:$H,6,0)","v":"作成日：令和6年11月"},null,{"$f":"\"作成日：\"&VLOOKUP(AF$1,仕様の整理!$C:$H,6,0)","v":"作成日：令和6年11月"},null,{"$f":"\"作成日：\"&VLOOKUP(AH$1,仕様の整理!$C:$H,6,0)","v":"作成日：令和6年11月"},null,{"$f":"\"作成日：\"&VLOOKUP(AJ$1,仕様の整理!$C:$H,6,0)","v":"作成日：令和6年11月"},null,{"$f":"\"作成日：\"&VLOOKUP(AL$1,仕様の整理!$C:$H,6,0)","v":"作成日：令和6年11月"},null,{"$f":"\"作成日：\"&VLOOKUP(AN$1,仕様の整理!$C:$H,6,0)","v":"作成日：令和6年11月"},null,{"$f":"\"作成日：\"&VLOOKUP(AP$1,仕様の整理!$C:$H,6,0)","v":"作成日：令和6年11月"},null,{"$f":"\"作成日：\"&VLOOKUP(AR$1,仕様の整理!$C:$H,6,0)","v":"作成日：令和6年11月"},null,{"$f":"\"作成日：\"&VLOOKUP(AT$1,仕様の整理!$C:$H,6,0)","v":"作成日：令和6年11月"},null,{"$f":"\"作成日：\"&VLOOKUP(AV$1,仕様の整理!$C:$H,6,0)","v":"作成日：令和6年11月"},null,{"$f":"\"作成日：\"&VLOOKUP(AX$1,仕様の整理!$C:$H,6,0)","v":"作成日：令和7年2月"},null,{"$f":"\"作成日：\"&VLOOKUP(AZ$1,仕様の整理!$C:$H,6,0)","v":"作成日：令和6年3月"}]
[null,null,null,null,null,{"$f":"\"種類：\"&VLOOKUP(F1,仕様の整理!$C:$Z,7,0)","v":"種類：ひび割れ被覆工法"},null,{"$f":"\"種類：\"&VLOOKUP(H1,仕様の整理!$C:$Z,7,0)","v":"種類：ひび割れ注入工法"},null,{"$f":"\"種類：\"&VLOOKUP(J1,仕様の整理!$C:$Z,7,0)","v":"種類：ひび割れ被覆工法"},null,{"$f":"\"種類：\"&VLOOKUP(L1,仕様の整理!$C:$Z,7,0)","v":"種類：ひび割れ被覆工法"},null,{"$f":"\"種類：\"&VLOOKUP(N1,仕様の整理!$C:$Z,7,0)","v":"種類：ひび割れ被覆工法"},null,{"$f":"\"種類：\"&VLOOKUP(P1,仕様の整理!$C:$Z,7,0)","v":"種類：ひび割れ注入工法"},null,{"$f":"\"種類：\"&VLOOKUP(R1,仕様の整理!$C:$Z,7,0)","v":"種類：ひび割れ注入工法"},null,{"$f":"\"種類：\"&VLOOKUP(T1,仕様の整理!$C:$Z,7,0)","v":"種類：ひび割れ注入工法"},null,{"$f":"\"種類：\"&VLOOKUP(V1,仕様の整理!$C:$Z,7,0)","v":"種類：ひび割れ注入工法"},null,{"$f":"\"種類：\"&VLOOKUP(X1,仕様の整理!$C:$Z,7,0)","v":"種類：ひび割れ注入工法"},null,{"$f":"\"種類：\"&VLOOKUP(Z1,仕様の整理!$C:$Z,7,0)","v":"種類：ひび割れ注入工法"},null,{"$f":"\"種類：\"&VLOOKUP(AB1,仕様の整理!$C:$Z,7,0)","v":"種類：ひび割れ注入工法"},null,{"$f":"\"種類：\"&VLOOKUP(AD1,仕様の整理!$C:$Z,7,0)","v":"種類：ひび割れ注入工法"},null,{"$f":"\"種類：\"&VLOOKUP(AF1,仕様の整理!$C:$Z,7,0)","v":"種類：ひび割れ注入工法"},null,{"$f":"\"種類：\"&VLOOKUP(AH1,仕様の整理!$C:$Z,7,0)","v":"種類：ひび割れ注入工法"},null,{"$f":"\"種類：\"&VLOOKUP(AJ1,仕様の整理!$C:$Z,7,0)","v":"種類：ひび割れ注入工法"},null,{"$f":"\"種類：\"&VLOOKUP(AL1,仕様の整理!$C:$Z,7,0)","v":"種類：ひび割れ注入工法"},null,{"$f":"\"種類：\"&VLOOKUP(AN1,仕様の整理!$C:$Z,7,0)","v":"種類：ひび割れ被覆工法"},null,{"$f":"\"種類：\"&VLOOKUP(AP1,仕様の整理!$C:$Z,7,0)","v":"種類：ひび割れ注入工法"},null,{"$f":"\"種類：\"&VLOOKUP(AR1,仕様の整理!$C:$Z,7,0)","v":"種類：ひび割れ注入工法"},null,{"$f":"\"種類：\"&VLOOKUP(AT1,仕様の整理!$C:$Z,7,0)","v":"種類：ひび割れ注入工法"},null,{"$f":"\"種類：\"&VLOOKUP(AV1,仕様の整理!$C:$Z,7,0)","v":"種類：ひび割れ注入工法"},null,{"$f":"\"種類：\"&VLOOKUP(AX1,仕様の整理!$C:$Z,7,0)","v":"種類：ひび割れ注入工法"},null,{"$f":"\"種類：\"&VLOOKUP(AZ1,仕様の整理!$C:$Z,7,0)","v":"種類：ひび割れ注入工法"}]
["ＮＥＴＩＳ情報","技術名",null,null,null,{"$f":"IF(VLOOKUP(F$1,仕様の整理!$C:$R,4,0)=\"NETIS掲載期間終了技術\",VLOOKUP(F$1,仕様の整理!$C:$R,2,0),VLOOKUP(F$1,仕様の整理!$C:$R,2,0)&\"（\"&VLOOKUP(F$1,仕様の整理!$C:$R,4,0)&\"）\")&IF(VLOOKUP(F$1,仕様の整理!$C:$R,5,0)=\"○\",\"\",\"《新規登録技術》\")","v":"CS-21ひび割れ補修セット"},null,{"$f":"IF(VLOOKUP(H$1,仕様の整理!$C:$R,4,0)=\"NETIS掲載期間終了技術\",VLOOKUP(H$1,仕様の整理!$C:$R,2,0),VLOOKUP(H$1,仕様の整理!$C:$R,2,0)&\"（\"&VLOOKUP(H$1,仕様の整理!$C:$R,4,0)&\"）\")&IF(VLOOKUP(H$1,仕様の整理!$C:$R,5,0)=\"○\",\"\",\"《新規登録技術》\")","v":"リハビリシリンダー工法"},null,{"$f":"IF(VLOOKUP(J$1,仕様の整理!$C:$R,4,0)=\"NETIS掲載期間終了技術\",VLOOKUP(J$1,仕様の整理!$C:$R,2,0),VLOOKUP(J$1,仕様の整理!$C:$R,2,0)&\"（\"&VLOOKUP(J$1,仕様の整理!$C:$R,4,0)&\"）\")&IF(VLOOKUP(J$1,仕様の整理!$C:$R,5,0)=\"○\",\"\",\"《新規登録技術》\")","v":"ショーボンドCAP工法"},null,{"$f":"IF(VLOOKUP(L$1,仕様の整理!$C:$R,4,0)=\"NETIS掲載期間終了技術\",VLOOKUP(L$1,仕様の整理!$C:$R,2,0),VLOOKUP(L$1,仕様の整理!$C:$R,2,0)&\"（\"&VLOOKUP(L$1,仕様の整理!$C:$R,4,0)&\"）\")&IF(VLOOKUP(L$1,仕様の整理!$C:$R,5,0)=\"○\",\"\",\"《新規登録技術》\")","v":"ひび割れ補修浸透性エポキシ樹脂塗布工法"},null,{"$f":"IF(VLOOKUP(N$1,仕様の整理!$C:$R,4,0)=\"NETIS掲載期間終了技術\",VLOOKUP(N$1,仕様の整理!$C:$R,2,0),VLOOKUP(N$1,仕様の整理!$C:$R,2,0)&\"（\"&VLOOKUP(N$1,仕様の整理!$C:$R,4,0)&\"）\")&IF(VLOOKUP(N$1,仕様の整理!$C:$R,5,0)=\"○\",\"\",\"《新規登録技術》\")","v":"ひび割れ補修浸透性エポキシ樹脂塗布工法"},null,{"$f":"IF(VLOOKUP(P$1,仕様の整理!$C:$R,4,0)=\"NETIS掲載期間終了技術\",VLOOKUP(P$1,仕様の整理!$C:$R,2,0),VLOOKUP(P$1,仕様の整理!$C:$R,2,0)&\"（\"&VLOOKUP(P$1,仕様の整理!$C:$R,4,0)&\"）\")&IF(VLOOKUP(P$1,仕様の整理!$C:$R,5,0)=\"○\",\"\",\"《新規登録技術》\")","v":"ハイドロフィット工法(含浸複合注入工法)（事後評価済技術）"},null,{"$f":"IF(VLOOKUP(R$1,仕様の整理!$C:$R,4,0)=\"NETIS掲載期間終了技術\",VLOOKUP(R$1,仕様の整理!$C:$R,2,0),VLOOKUP(R$1,仕様の整理!$C:$R,2,0)&\"（\"&VLOOKUP(R$1,仕様の整理!$C:$R,4,0)&\"）\")&IF(VLOOKUP(R$1,仕様の整理!$C:$R,5,0)=\"○\",\"\",\"《新規登録技術》\")","v":"ハイブリッドエポキシ樹脂（事後評価済技術）"},null,{"$f":"IF(VLOOKUP(T$1,仕様の整理!$C:$R,4,0)=\"NETIS掲載期間終了技術\",VLOOKUP(T$1,仕様の整理!$C:$R,2,0),VLOOKUP(T$1,仕様の整理!$C:$R,2,0)&\"（\"&VLOOKUP(T$1,仕様の整理!$C:$R,4,0)&\"）\")&IF(VLOOKUP(T$1,仕様の整理!$C:$R,5,0)=\"○\",\"\",\"《新規登録技術》\")","v":"ビックス工法"},null,{"$f":"IF(VLOOKUP(V$1,仕様の整理!$C:$R,4,0)=\"NETIS掲載期間終了技術\",VLOOKUP(V$1,仕様の整理!$C:$R,2,0),VLOOKUP(V$1,仕様の整理!$C:$R,2,0)&\"（\"&VLOOKUP(V$1,仕様の整理!$C:$R,4,0)&\"）\")&IF(VLOOKUP(V$1,仕様の整理!$C:$R,5,0)=\"○\",\"\",\"《新規登録技術》\")","v":"ビックス工法"},null,{"$f":"IF(VLOOKUP(X$1,仕様の整理!$C:$R,4,0)=\"NETIS掲載期間終了技術\",VLOOKUP(X$1,仕様の整理!$C:$R,2,0),VLOOKUP(X$1,仕様の整理!$C:$R,2,0)&\"（\"&VLOOKUP(X$1,仕様の整理!$C:$R,4,0)&\"）\")&IF(VLOOKUP(X$1,仕様の整理!$C:$R,5,0)=\"○\",\"\",\"《新規登録技術》\")","v":"ビックス工法"},null,{"$f":"IF(VLOOKUP(Z$1,仕様の整理!$C:$R,4,0)=\"NETIS掲載期間終了技術\",VLOOKUP(Z$1,仕様の整理!$C:$R,2,0),VLOOKUP(Z$1,仕様の整理!$C:$R,2,0)&\"（\"&VLOOKUP(Z$1,仕様の整理!$C:$R,4,0)&\"）\")&IF(VLOOKUP(Z$1,仕様の整理!$C:$R,5,0)=\"○\",\"\",\"《新規登録技術》\")","v":"ビックス工法"},null,{"$f":"IF(VLOOKUP(AB$1,仕様の整理!$C:$R,4,0)=\"NETIS掲載期間終了技術\",VLOOKUP(AB$1,仕様の整理!$C:$R,2,0),VLOOKUP(AB$1,仕様の整理!$C:$R,2,0)&\"（\"&VLOOKUP(AB$1,仕様の整理!$C:$R,4,0)&\"）\")&IF(VLOOKUP(AB$1,仕様の整理!$C:$R,5,0)=\"○\",\"\",\"《新規登録技術》\")","v":"アルファー・ゾル-G注入工法"},null,{"$f":"IF(VLOOKUP(AD$1,仕様の整理!$C:$R,4,0)=\"NETIS掲載期間終了技術\",VLOOKUP(AD$1,仕様の整理!$C:$R,2,0),VLOOKUP(AD$1,仕様の整理!$C:$R,2,0)&\"（\"&VLOOKUP(AD$1,仕様の整理!$C:$R,4,0)&\"）\")&IF(VLOOKUP(AD$1,仕様の整理!$C:$R,5,0)=\"○\",\"\",\"《新規登録技術》\")","v":"ハイスタッフ"},null,{"$f":"IF(VLOOKUP(AF$1,仕様の整理!$C:$R,4,0)=\"NETIS掲載期間終了技術\",VLOOKUP(AF$1,仕様の整理!$C:$R,2,0),VLOOKUP(AF$1,仕様の整理!$C:$R,2,0)&\"（\"&VLOOKUP(AF$1,仕様の整理!$C:$R,4,0)&\"）\")&IF(VLOOKUP(AF$1,仕様の整理!$C:$R,5,0)=\"○\",\"\",\"《新規登録技術》\")","v":"ハイスタッフ"},null,{"$f":"IF(VLOOKUP(AH$1,仕様の整理!$C:$R,4,0)=\"NETIS掲載期間終了技術\",VLOOKUP(AH$1,仕様の整理!$C:$R,2,0),VLOOKUP(AH$1,仕様の整理!$C:$R,2,0)&\"（\"&VLOOKUP(AH$1,仕様の整理!$C:$R,4,0)&\"）\")&IF(VLOOKUP(AH$1,仕様の整理!$C:$R,5,0)=\"○\",\"\",\"《新規登録技術》\")","v":"ビトパッカー工法"},null,{"$f":"IF(VLOOKUP(AJ$1,仕様の整理!$C:$R,4,0)=\"NETIS掲載期間終了技術\",VLOOKUP(AJ$1,仕様の整理!$C:$R,2,0),VLOOKUP(AJ$1,仕様の整理!$C:$R,2,0)&\"（\"&VLOOKUP(AJ$1,仕様の整理!$C:$R,4,0)&\"）\")&IF(VLOOKUP(AJ$1,仕様の整理!$C:$R,5,0)=\"○\",\"\",\"《新規登録技術》\")","v":"IPHシステム内圧充填接合補強工法"},null,{"$f":"IF(VLOOKUP(AL$1,仕様の整理!$C:$R,4,0)=\"NETIS掲載期間終了技術\",VLOOKUP(AL$1,仕様の整理!$C:$R,2,0),VLOOKUP(AL$1,仕様の整理!$C:$R,2,0)&\"（\"&VLOOKUP(AL$1,仕様の整理!$C:$R,4,0)&\"）\")&IF(VLOOKUP(AL$1,仕様の整理!$C:$R,5,0)=\"○\",\"\",\"《新規登録技術》\")","v":"ミクストグラウト（事後評価未実施技術）"},null,{"$f":"IF(VLOOKUP(AN$1,仕様の整理!$C:$R,4,0)=\"NETIS掲載期間終了技術\",VLOOKUP(AN$1,仕様の整理!$C:$R,2,0),VLOOKUP(AN$1,仕様の整理!$C:$R,2,0)&\"（\"&VLOOKUP(AN$1,仕様の整理!$C:$R,4,0)&\"）\")&IF(VLOOKUP(AN$1,仕様の整理!$C:$R,5,0)=\"○\",\"\",\"《新規登録技術》\")","v":"バジリスクER7 液体ひび割れ補修剤（事後評価未実施技術）"},null,{"$f":"IF(VLOOKUP(AP$1,仕様の整理!$C:$R,4,0)=\"NETIS掲載期間終了技術\",VLOOKUP(AP$1,仕様の整理!$C:$R,2,0),VLOOKUP(AP$1,仕様の整理!$C:$R,2,0)&\"（\"&VLOOKUP(AP$1,仕様の整理!$C:$R,4,0)&\"）\")&IF(VLOOKUP(AP$1,仕様の整理!$C:$R,5,0)=\"○\",\"\",\"《新規登録技術》\")","v":"アルカリ反応型高圧注入剤(アウターシール剤)（事後評価未実施技術）"},null,{"$f":"IF(VLOOKUP(AR$1,仕様の整理!$C:$R,4,0)=\"NETIS掲載期間終了技術\",VLOOKUP(AR$1,仕様の整理!$C:$R,2,0),VLOOKUP(AR$1,仕様の整理!$C:$R,2,0)&\"（\"&VLOOKUP(AR$1,仕様の整理!$C:$R,4,0)&\"）\")&IF(VLOOKUP(AR$1,仕様の整理!$C:$R,5,0)=\"○\",\"\",\"《新規登録技術》\")","v":"e-ジェクター工法「自動式樹脂注入工法」（事後評価未実施技術）"},null,{"$f":"IF(VLOOKUP(AT$1,仕様の整理!$C:$R,4,0)=\"NETIS掲載期間終了技術\",VLOOKUP(AT$1,仕様の整理!$C:$R,2,0),VLOOKUP(AT$1,仕様の整理!$C:$R,2,0)&\"（\"&VLOOKUP(AT$1,仕様の整理!$C:$R,4,0)&\"）\")&IF(VLOOKUP(AT$1,仕様の整理!$C:$R,5,0)=\"○\",\"\",\"《新規登録技術》\")","v":"UG-Ⅰグラウト工法（事後評価未実施技術）"},null,{"$f":"IF(VLOOKUP(AV$1,仕様の整理!$C:$R,4,0)=\"NETIS掲載期間終了技術\",VLOOKUP(AV$1,仕様の整理!$C:$R,2,0),VLOOKUP(AV$1,仕様の整理!$C:$R,2,0)&\"（\"&VLOOKUP(AV$1,仕様の整理!$C:$R,4,0)&\"）\")&IF(VLOOKUP(AV$1,仕様の整理!$C:$R,5,0)=\"○\",\"\",\"《新規登録技術》\")","v":"ひび割れへのシールテープ「せこたん」を用いた手動式低圧注入工法（事後評価未実施技術）"},null,{"$f":"IF(VLOOKUP(AX$1,仕様の整理!$C:$R,4,0)=\"NETIS掲載期間終了技術\",VLOOKUP(AX$1,仕様の整理!$C:$R,2,0),VLOOKUP(AX$1,仕様の整理!$C:$R,2,0)&\"（\"&VLOOKUP(AX$1,仕様の整理!$C:$R,4,0)&\"）\")&IF(VLOOKUP(AX$1,仕様の整理!$C:$R,5,0)=\"○\",\"\",\"《新規登録技術》\")","v":"浸透性アクリル系樹脂注入材「クラックブロック」（九州の技術）"},null,{"$f":"IF(VLOOKUP(AZ$1,仕様の整理!$C:$R,4,0)=\"NETIS掲載期間終了技術\",VLOOKUP(AZ$1,仕様の整理!$C:$R,2,0),VLOOKUP(AZ$1,仕様の整理!$C:$R,2,0)&\"（\"&VLOOKUP(AZ$1,仕様の整理!$C:$R,4,0)&\"）\")&IF(VLOOKUP(AZ$1,仕様の整理!$C:$R,5,0)=\"○\",\"\",\"《新規登録技術》\")","v":"コンクリートひび割れ補修工法　「ミクロカプセルGP工法」（事後評価未実施技術）《新規登録技術》"}]
[null,"①","ＮＥＴＩＳ登録番号",null,null,{"$f":"IF(VLOOKUP(F$1,仕様の整理!$C:$L,4,0)=\"NETIS掲載期間終了技術\",\"NETIS掲載期間終了技術\",VLOOKUP(F$1,仕様の整理!$C:$L,3,0))","v":"NETIS掲載期間終了技術"},null,{"$f":"IF(VLOOKUP(H$1,仕様の整理!$C:$L,4,0)=\"NETIS掲載期間終了技術\",\"NETIS掲載期間終了技術\",VLOOKUP(H$1,仕様の整理!$C:$L,3,0))","v":"NETIS掲載期間終了技術"},null,{"$f":"IF(VLOOKUP(J$1,仕様の整理!$C:$L,4,0)=\"NETIS掲載期間終了技術\",\"NETIS掲載期間終了技術\",VLOOKUP(J$1,仕様の整理!$C:$L,3,0))","v":"NETIS掲載期間終了技術"},null,{"$f":"IF(VLOOKUP(L$1,仕様の整理!$C:$L,4,0)=\"NETIS掲載期間終了技術\",\"NETIS掲載期間終了技術\",VLOOKUP(L$1,仕様の整理!$C:$L,3,0))","v":"NETIS掲載期間終了技術"},null,{"$f":"IF(VLOOKUP(N$1,仕様の整理!$C:$L,4,0)=\"NETIS掲載期間終了技術\",\"NETIS掲載期間終了技術\",VLOOKUP(N$1,仕様の整理!$C:$L,3,0))","v":"NETIS掲載期間終了技術"},null,{"$f":"IF(VLOOKUP(P$1,仕様の整理!$C:$L,4,0)=\"NETIS掲載期間終了技術\",\"NETIS掲載期間終了技術\",VLOOKUP(P$1,仕様の整理!$C:$L,3,0))","v":"KT-160095-VR"},null,{"$f":"IF(VLOOKUP(R$1,仕様の整理!$C:$L,4,0)=\"NETIS掲載期間終了技術\",\"NETIS掲載期間終了技術\",VLOOKUP(R$1,仕様の整理!$C:$L,3,0))","v":"HK-170005-VR"},null,{"$f":"IF(VLOOKUP(T$1,仕様の整理!$C:$L,4,0)=\"NETIS掲載期間終了技術\",\"NETIS掲載期間終了技術\",VLOOKUP(T$1,仕様の整理!$C:$L,3,0))","v":"NETIS掲載期間終了技術"},null,{"$f":"IF(VLOOKUP(V$1,仕様の整理!$C:$L,4,0)=\"NETIS掲載期間終了技術\",\"NETIS掲載期間終了技術\",VLOOKUP(V$1,仕様の整理!$C:$L,3,0))","v":"NETIS掲載期間終了技術"},null,{"$f":"IF(VLOOKUP(X$1,仕様の整理!$C:$L,4,0)=\"NETIS掲載期間終了技術\",\"NETIS掲載期間終了技術\",VLOOKUP(X$1,仕様の整理!$C:$L,3,0))","v":"NETIS掲載期間終了技術"},null,{"$f":"IF(VLOOKUP(Z$1,仕様の整理!$C:$L,4,0)=\"NETIS掲載期間終了技術\",\"NETIS掲載期間終了技術\",VLOOKUP(Z$1,仕様の整理!$C:$L,3,0))","v":"NETIS掲載期間終了技術"},null,{"$f":"IF(VLOOKUP(AB$1,仕様の整理!$C:$L,4,0)=\"NETIS掲載期間終了技術\",\"NETIS掲載期間終了技術\",VLOOKUP(AB$1,仕様の整理!$C:$L,3,0))","v":"NETIS掲載期間終了技術"},null,{"$f":"IF(VLOOKUP(AD$1,仕様の整理!$C:$L,4,0)=\"NETIS掲載期間終了技術\",\"NETIS掲載期間終了技術\",VLOOKUP(AD$1,仕様の整理!$C:$L,3,0))","v":"NETIS掲載期間終了技術"},null,{"$f":"IF(VLOOKUP(AF$1,仕様の整理!$C:$L,4,0)=\"NETIS掲載期間終了技術\",\"NETIS掲載期間終了技術\",VLOOKUP(AF$1,仕様の整理!$C:$L,3,0))","v":"NETIS掲載期間終了技術"},null,{"$f":"IF(VLOOKUP(AH$1,仕様の整理!$C:$L,4,0)=\"NETIS掲載期間終了技術\",\"NETIS掲載期間終了技術\",VLOOKUP(AH$1,仕様の整理!$C:$L,3,0))","v":"NETIS掲載期間終了技術"},null,{"$f":"IF(VLOOKUP(AJ$1,仕様の整理!$C:$L,4,0)=\"NETIS掲載期間終了技術\",\"NETIS掲載期間終了技術\",VLOOKUP(AJ$1,仕様の整理!$C:$L,3,0))","v":"NETIS掲載期間終了技術"},null,{"$f":"IF(VLOOKUP(AL$1,仕様の整理!$C:$L,4,0)=\"NETIS掲載期間終了技術\",\"NETIS掲載期間終了技術\",VLOOKUP(AL$1,仕様の整理!$C:$L,3,0))","v":"CG-180004-A"},null,{"$f":"IF(VLOOKUP(AN$1,仕様の整理!$C:$L,4,0)=\"NETIS掲載期間終了技術\",\"NETIS掲載期間終了技術\",VLOOKUP(AN$1,仕様の整理!$C:$L,3,0))","v":"HK-180017-A"},null,{"$f":"IF(VLOOKUP(AP$1,仕様の整理!$C:$L,4,0)=\"NETIS掲載期間終了技術\",\"NETIS掲載期間終了技術\",VLOOKUP(AP$1,仕様の整理!$C:$L,3,0))","v":"KT-180135-A"},null,{"$f":"IF(VLOOKUP(AR$1,仕様の整理!$C:$L,4,0)=\"NETIS掲載期間終了技術\",\"NETIS掲載期間終了技術\",VLOOKUP(AR$1,仕様の整理!$C:$L,3,0))","v":"KK-190024-A"},null,{"$f":"IF(VLOOKUP(AT$1,仕様の整理!$C:$L,4,0)=\"NETIS掲載期間終了技術\",\"NETIS掲載期間終了技術\",VLOOKUP(AT$1,仕様の整理!$C:$L,3,0))","v":"KK-200030-A"},null,{"$f":"IF(VLOOKUP(AV$1,仕様の整理!$C:$L,4,0)=\"NETIS掲載期間終了技術\",\"NETIS掲載期間終了技術\",VLOOKUP(AV$1,仕様の整理!$C:$L,3,0))","v":"TH-200001-A"},null,{"$f":"IF(VLOOKUP(AX$1,仕様の整理!$C:$L,4,0)=\"NETIS掲載期間終了技術\",\"NETIS掲載期間終了技術\",VLOOKUP(AX$1,仕様の整理!$C:$L,3,0))","v":"QS-230015-A"},null,{"$f":"IF(VLOOKUP(AZ$1,仕様の整理!$C:$L,4,0)=\"NETIS掲載期間終了技術\",\"NETIS掲載期間終了技術\",VLOOKUP(AZ$1,仕様の整理!$C:$L,3,0))","v":"KT-230319-A"}]
[null,"②","技術の位置付け（有用な新技術）",null,null,"[活用促進]",null,"評価済み",null,"[活用促進]",null,"[活用促進]",null,"[活用促進]",null,"-",null,"-",null,"[H25活用促進(旧)]",null,"[H25活用促進(旧)]",null,"[H25活用促進(旧)]",null,"[H25活用促進(旧)]",null,"[H26活用促進(旧)][活用促進]",null,"評価済み",null,"評価済み",null,"評価済み",null,"[設計比較]",null,"-",null,"-",null,"-",null,"-",null,"-",null,"-",null,"-",null,"-"]
[null,"③","開発者（本社が存在する都道府県）",null,null,"株式会社アストン（岡山県）",null,"福德技研株式会社（広島県）",null,"ショーボンド建設株式会社（東京都）",null,"アルファ工業株式会社（神奈川県）",null,"アルファ工業株式会社（神奈川県）",null,"株式会社ハイドロ・スカイ（東京都）",null,"日本アドックス株式会社（東京都）",null,"ショーボンド建設株式会社（東京都）",null,"ショーボンド建設株式会社（東京都）",null,"ショーボンド建設株式会社（東京都）",null,"ショーボンド建設株式会社（東京都）",null,"三生化工株式会社（石川県）",null,"日鉄住金セメント株式会社（北海道）",null,"日鉄住金セメント株式会社（北海道）",null,"株式会社アクアテック（兵庫県）",null,"アイクリーテクノワールド株式会社（広島県）",null,"株式会社MASUDA（鳥取県）",null,"會澤高圧コンクリート株式会社（北海道）",null,"株式会社 環境美健（東京都）",null,"小泉製麻株式会社（兵庫県）",null,"株式会社大阪防水建設社（大阪府）",null,"ニチバン株式会社（東京都）",null,"有限会社旭（福岡県）",null,"全国ミクロカプセル工業会（大阪府）"]
[null,"④","開発者における九州地方との関連性（九州登録九州本社：◎、九州外登録九州本社：○、九州に共同開発者有り：△、その他：－）",null,null,"-",null,"-",null,"-",null,"-",null,"-",null,"-",null,"-",null,"-",null,"-",null,"-",null,"-",null,"-",null,"-",null,"-",null,"-",null,"-",null,"-",null,"-",null,"-",null,"-",null,"-",null,"-",null,"◎",null,"-"]
[null,"⑤","九州地方への機能性（九州地方に支店等を有する場合：○、その他：－）",null,null,"-",null,"-",null,"○（九州管内に支店等を有する）",null,"-",null,"-",null,"-",null,"-",null,"○（九州管内に支店等を有する）",null,"○（九州管内に支店等を有する）",null,"○（九州管内に支店等を有する）",null,"○（九州管内に支店等を有する）",null,"-",null,"-",null,"-",null,"-",null,"-",null,"-",null,"-",null,"-",null,"○(九州地方に支店を有する）",null,"○(九州地方に支店を有する）",null,"○(九州地方に支店を有する）",null,"-",null,"-"]
[null,"⑥","技術概要",null,null,"ひび割れの補修を、無機系の①CS-21クリアー、②CSパテのセットにおいて、ひび割れに塗布+擦込む簡便な工法によりひび割れ自閉効果と空隙の充填を可能とした。ひび割れからの劣化因子の侵入を防ぎコンクリートの耐久性向上と美観等に寄与する技術。",null,"本技術は、無機系注入材と亜硝酸リチウムを併用したコンクリートひび割れ注入工法であり、ひび割れを閉塞するひび割れ注入本来の目的に加え、亜硝酸リチウムによる鉄筋防錆効果(塩害、中性化対策)およびASR膨張抑制効果(ASR対策)を付与する技術です。",null,"本技術は、注入材を表面に塗布することでひび割れ内部に浸透させ接着できるひび割れ補修工法で、従来は注入器具によるひび割れ注入工にて対応していた。本技術の活用により、シール材の設置撤去工程が不要となり工程の短縮が図られる。",null,"ひび割れの奥まで補修する際に低圧注入器具を用いて補修材を注入していたのに対し、塗布だけでひび割れに補修材が浸透する工法です。浸透性エポキシ樹脂接着剤「アルファテック388」を繰り返し塗布することで毛細管現象によってひび割れ内部にまで浸透します。",null,"ひび割れの奥まで補修する際に低圧注入器具を用いて補修材を注入していたのに対し、塗布だけでひび割れに補修材が浸透する工法です。浸透性エポキシ樹脂接着剤「アルファテック388」を繰り返し塗布することで毛細管現象によってひび割れ内部にまで浸透します。",null,"本技術は漏水工事を無機系による含浸注入工法により、漏水補修及中性化抑止する技術で従来は有機系による密着工法で対応していた。本技術の活用により引火性有毒ガスの発生もなく安全性の向上、工程短縮、品質、耐久性、景観保護、経済性、施工性の向上が図れる。",null,"塩害劣化環境下のコンクリート構造物に対する、機能性吸着材を添加した塩分吸着型エポキシ樹脂コンクリート補修材。鉄筋やコンクリート中の塩化物イオンを吸着固定化することにより塩害による鉄筋腐食の抑制と、コンクリートの補修を同時に行うことができる技術。",null,"コンクリート構造物のひび割れに、エポキシ樹脂注入材で膨らんだゴム製注入器が縮む力により、時間をかけてひび割れの奥深くまで確実に樹脂を注入するひび割れ注入工法。ポンプにより直接注入する従来の工法に較べて微細なひび割れへの注入が可能です。",null,"コンクリート構造物のひび割れに、エポキシ樹脂注入材で膨らんだゴム製注入器が縮む力により、時間をかけてひび割れの奥深くまで確実に樹脂を注入するひび割れ注入工法。ポンプにより直接注入する従来の工法に較べて微細なひび割れへの注入が可能です。",null,"コンクリート構造物のひび割れに、エポキシ樹脂注入材で膨らんだゴム製注入器が縮む力により、時間をかけてひび割れの奥深くまで確実に樹脂を注入するひび割れ注入工法。ポンプにより直接注入する従来の工法に較べて微細なひび割れへの注入が可能です。",null,"コンクリート構造物のひび割れに、エポキシ樹脂注入材で膨らんだゴム製注入器が縮む力により、時間をかけてひび割れの奥深くまで確実に樹脂を注入するひび割れ注入工法。ポンプにより直接注入する従来の工法に較べて微細なひび割れへの注入が可能です。",null,"この工法は、水の接するコンクリートの打設部・ひび割れ・コールドジョイント・セパレーター等、施工後に発生した漏水補修に適用する。",null,"超微粒子高炉スラグを主材とした無機系ひび割れ注入材ハイスタッフは、ひび割れに注入するとコンクリートから溶出したカルシウムイオンCa2+と高炉スラグが迅速に反応し、強固なカルシウムシリケート水和物を生成することで、長期にわたり緻密な硬化体を形成します。",null,"超微粒子高炉スラグを主材とした無機系ひび割れ注入材ハイスタッフは、ひび割れに注入するとコンクリートから溶出したカルシウムイオンCa2+と高炉スラグが迅速に反応し、強固なカルシウムシリケート水和物を生成することで、長期にわたり緻密な硬化体を形成します。",null,"本技術は、漏水を伴う各コンクリートのひび割れ対策工法である。従来は、親水性ポリウレタン樹脂を使用していたが、ビトパッカー工法は、2種類の注入剤を使用することで、微細ひび割れ(ヘアークラック)にも充填されるため、従来工法より止水効果が向上する。",null,"本技術は、内圧充填接合補強工法による補修・補強を行うシステム工法で、従来は断面撤去・復旧で対応していた。本技術の活用により、コンクリート表面のはつり落しが不要になり、特に断面修復・強度増強・防錆効果及び漏水対策に期待ができる。",null,"コンクリートに発生した、ひび割れや打継ぎ等からの漏水を止水する工法。従来は1液型ポリウレタン樹脂系止水材が用いてられてきたが漏水量によって止水効果にバラツキが発生していた。本技術は2液混合により自硬性を有する止水材を用いる事で安定した止水効果が得られる。",null,"本技術は、バクテリアの代謝活動を利用した液状のコンクリートひび割れ補修剤であり、従来は、樹脂注入工法で対応していた。本技術の活用により、材料費・施工費の縮減や工期の短縮化を期待できる。　　　　　　　　　　　　　　　　",null,"本技術は、コンクリート構造物の漏水をアルカリ反応により成長した結晶構造体で止水する注入工法であり、従来はエポキシ樹脂の注入で対応していた。本技術の活用により、止水能力の向上、粘性度調整によりひび割れ幅の対応範囲が広がり施工性向上が期待できる。　　　　　",null,"本技術はコンクリートひび割れ注入において低圧注入を自動で行える注入器の製品技術であり、従来はクラック処理工(ポンプによりひび割れ注入を行う工法)であった。本技術の活用により、施工性の向上、所要日数の短縮が期待できる。　　　　　",null,"本技術は、コンクリート構造物からの漏水対策において、従来技術の止水注入材より硬化物の収縮率を低減させた技術であり、従来は1液型ポリウレタン樹脂のみの注入材であった。本技術の活用により経済性、品質、施工性の向上が期待できる。　　　　　",null,"本技術は注入材の充填状況を可視化するテープと手動式低圧注入工法を用いる技術で、従来は不透明なシール材を用いた自動式低圧注入工法で対応していた。本技術の活用により、充填状況を確認しつつ最適な圧力で注入できるため、品質及び作業効率の向上が期待できる。",null,"本技術はコンクリート工のひび割れ補修に関する技術である。従来は低圧注入工法で 対応していたが、本技術の活用により、注入に係る作業が削減され、ローラや刷毛に よる塗布浸透作業のみとなることで施工性の向上や工程短縮を可能にした。　　　　　",null,"本技術は、コンクリート構造物のひび割れ補修におけるカプセル型のジオポリマー注入工法である。従来は、エポキシ樹脂系注入材で行っていた。本技術の活用により、計量不要かつ短時間の攪拌で練り混ぜが可能となるため、施工性の向上が図れる。"]
[null,"⑦","概要図"]
[null,"⑧","施工条件・適用条件等","施工方法",null," ひび割れ被覆工法（コンクリート改質剤の塗布浸透+パテの擦込み充填） ",null,"低圧注入工法",null,"ひび割れ被覆工法（ローラー塗布によるひび割れ浸透）",null,"ひび割れ被覆工法（毛細管現象によるひび割れ浸透）",null,"ひび割れ被覆工法（毛細管現象によるひび割れ浸透）",null,"ひび割れ注入工法【低圧注入工法】",null,"ひび割れ注入工法【低圧注入工法】",null,"ひび割れ注入工法（低圧注入工法）",null,"ひび割れ注入工法（低圧注入工法）",null,"ひび割れ注入工法（低圧注入工法）",null,"ひび割れ注入工法（低圧注入工法）",null,"ひび割れ注入工法（高圧注入工法）",null,"ひび割れ注入工法（低圧注入工法）",null,"ひび割れ注入工法（低圧注入工法）",null,"ひび割れ注入工法（高圧注入工法）",null,"ひび割れ注入工法（低圧注入工法）",null,"ひび割れ注入工法（高圧注入工法）",null,"ひび割れ被覆工法（噴霧）",null,"ひび割れ注入工法（高圧注入工法）",null,"ひび割れ注入工法（低圧で連続注入を自動で行えるバネ加圧式注入器）",null,"・ひび割れ注入工法（低圧注入工法）",null,"ひび割れ注入工法（手動式低圧注入工法）",null,"ひび割れ注入工法（ローラーや刷毛での塗布による浸透注入）",null,"ひび割れ注入工法(低圧注入工法)"]
[null,null,null,"補修材料",null," CS-21クリアー（ケイ酸ナトリウム系）+CSパテ（炭酸カルシウム、酸化ケイ素、ケイ酸リチウム） ",null,"超微粒子セメント系注入材【MCRアーマ＃600相当品】+亜硝酸リチウム40％水溶液【プロコン40（CG-100022-A）】",null,"エポキシ樹脂系",null,"【エポキシ樹脂系（一般用）】",null,"【エポキシ樹脂系（冬季用）】",null,"微粉末シリカ配合高炉スラグセメント",null,"エポキシ樹脂系",null,"エポキシ樹脂系",null,"エポキシ樹脂系",null,"エポキシ樹脂系",null,"エポキシ樹脂系",null,"特殊ポリマー樹脂【水性エマルション樹脂】",null,"超微粒子高炉スラグ",null,"超微粒子高炉スラグ",null,"ビトグラウト-N（水性エマルション樹脂）、ウォーターセラミックGF(先行注入剤)（アルカリ金属塩＋珪酸化合物＋高反応無機質触媒）",null,"エポキシ樹脂系",null,"主剤：特殊水性エマルション、硬化剤：親水性ポリウレタン樹脂",null,"A剤(バクテリア・乳酸カルシウム)、B剤(反応促進剤)",null,"アウターシール主剤(ケイ酸系)、アウターシールB促進剤(カルシウム化合物)",null,"エポキシ樹脂",null,"1液型ポリウレタン樹脂注入液+添加剤（パウダーA、パウダーB）",null,"エポキシ樹脂系注入材",null,"アクリル樹脂系（アクリル系樹脂注入材）",null,"ジオポリマー"]
[null,null,null,"適用範囲",null,"・コンクリート構造物(橋梁上下部工・ボックスカルバート・擁壁・覆工コンクリート・ダム・砂防・建築物・プレキャスト製品等)のひび割れ 【中性化抑制】 ",null,"・ひび割れが発生したコンクリート構造物全般の補修工事・アルカリシリカ反応抑制、防錆性",null,"・コンクリート構造物のひび割れ補修工事\n",null,"・コンクリート構造物のひび割れ補修\n",null,"・コンクリート構造物のひび割れ補修\n",null,"・橋梁、道路、トンネル、ダム、地下鉄におけるコンクリート構築物の止水工事・中性化抑制",null,"・塩害劣化環境下におけるコンクリート構造物全般の補修工事・防錆性",null,"・コンクリート構造物のひび割れ\n",null,"・コンクリート構造物のひび割れ\n",null,"・コンクリート構造物のひび割れ\n",null,"・コンクリート構造物のひび割れ\n",null,"・トンネル内部のクラック止水工やコンクリート建築物の屋根の防水工事等・構造物における漏水個所の止水\n",null,"・土木・建築を問わず、コンクリート構造物のひび割れや打ち継ぎ部の補修\n",null,"・土木・建築を問わず、コンクリート構造物のひび割れや打ち継ぎ部の補修・速硬性を有することにより、寒冷期、粗大なひび割れ等に適用可能　",null,"・道路維持修繕工:床版補修工、クラック処理工に適用　・橋梁補修工:漏水を伴う場所・トンネル補修工:下地が湿潤状態の場合　・下水道・共同溝:ジョイント目地部の止水\n",null,"・地震によって被災した構造物の補修 ・施工時の不具合(ジャンカ・コールドジョイント)の発生したコンクリートの補修・トンネル等の漏水対策・中性化抑制、塩害抑制、アルカリシリカ反応抑制、防錆性",null,"・コンクリート構造物 (躯体厚15cm～1500cm)における漏水箇所の漏水補修。",null,"・コンクリート強度の回復まではいかないため、ひび割れの水漏れ防止までに適用。・塩害抑制、凍害抑制",null,"・漏水が生じているコンクリート構造物",null,"コンクリートの0.5mm～1.0mm幅未満のひび割れにおける自動式低圧樹脂注入工法。",null,"・ひび割れ・コンクリート打継ぎ目・豆板（ジャンカ）等からの漏水\n・コンクリート躯体を貫通しているセパレータや中間杭周囲からの漏水等コンクリート構造物全般の漏水箇所",null,"・コンクリート構造物のひび割れ注入工事",null,"コンクリート構造物のひび割れ補修",null,"コンクリート構造物のひびわれ補修工事"]
[null,null,null,"適用可能なひび割れ幅・ひび割れ深さ",null," 【表面・深部共にひび割れ幅0.04～0.2mm、ひび割れ深さ 25mm以下】 ",null,"0.2～5.0mm",null,"ひび割れ幅0.3mm以下、浸透深さ最大69mm（試験値）",null,"【鉛直面でひび割れ幅0.05mm以上0.8mm以下、上向きで0.05mm以上0.5mm以下、ひび割れ深さ60mm以下】",null,"【鉛直面でひび割れ幅0.05mm以上0.8mm以下、上向きで0.05mm以上0.5mm以下、ひび割れ深さ60mm以下】",null,"ひび割れ幅　2mm以内【0.4mm以上】",null,"0.2mm未満の微細なひび割れへの塗布【性能発揮は未確認】、0.2mm以上1.0mm未満のひび割れへの注入【表面0.1～mm、深部0.1～mm、深さ500mm】",null,"ひび割れ幅0.2～1.0mm（深部のひび割れ幅は0.02mmまでを試験で確認）",null,"ひび割れ幅0.2～1.0mm（深部のひび割れ幅は0.02mmまでを試験で確認）",null,"ひび割れ幅0.2～1.0mm（深部のひび割れ幅は0.02mmまでを試験で確認）",null,"ひび割れ幅0.2～1.0mm（深部のひび割れ幅は0.02mmまでを試験で確認）",null,"【ひび割れ幅0.1～2.0mm、ひび割れ深さは標準で500mm、1000mm程度まで可能であるが別途見積り見当が必要】",null,"表面のひび割れ幅0.1～0.2ｍｍ以上、内部のひび割れ幅0.05ｍｍ以上【表面のひび割れ幅0.2ｍｍ以上、内部のひび割れ幅0.05ｍｍ以上、ひび割れ深さ2000ｍｍ以下】",null,"表面のひび割れ幅0.1～0.2ｍｍ以上、内部のひび割れ幅0.05ｍｍ以上【表面のひび割れ幅0.2ｍｍ以上、内部のひび割れ幅0.05ｍｍ以上、ひび割れ深さ2000ｍｍ以下】",null,"【ひび割れ幅0.1～10mm、ひび割れ深さ3500mm以下】",null,"ひび割れ幅0.01mmまで充填が可能。【ひび割れ幅0.01～7.00mm、ひび割れ深さ1000mm程度（可使時間範囲内）まで】",null,"・ひび割れ幅：0.02～3mm（3mm以上のひび割れに関しては仮止シールを施す等の前処理を行う事で可能）【・注入影響範囲：削孔による注入プラグ到達位置より半径1ｍ程度】",null,"・ひび割れ幅：0.6mm以下【・ひび割れ深さ：300mmまで】",null,"・ひび割れ幅：0.15 mm～2.0mm【・注入影響範囲：削孔による注入プラグ到達位置より半径50cm程度】",null,"ひび割れ幅：0.5mm～1.0mm幅未満【ひび割れ深さ：300mm以下】",null,"ひび割れ幅：平均0.5mm【・注入影響範囲：削孔による注入プラグ到達位置より直径20cm】",null,"・ひび割れ幅：0.2～5.0mm、ひび割れ深さ：200mm",null,"【表面（施工面下向き）：0.1mm～10mm前後、深部：0.05ｍｍ～10mm前後、ひび割れ深さ：制限なし】",null,"0.2ｍｍ～1.0ｍｍ幅のクラック"]
[null,null,null,"施工中の気温",null," 外気温5～30℃適用(外気温5℃未満及び30℃を超える場合でも養生を行えば適用可能) ",null,"気温0℃以下では冬季用抑制剤を使用",null,"【5～35℃】",null,"【15℃以上】",null,"【5～20℃】",null,"5～35℃",null,"作業環境温度-5℃以上",null,"5℃以上（気温が5℃を下回る場合にはエポキシ樹脂を加温する必要がある）【5～35℃】",null,"5℃以上（気温が5℃を下回る場合にはエポキシ樹脂を加温する必要がある）【5～35℃】",null,"5℃以上（気温が5℃を下回る場合にはエポキシ樹脂を加温する必要がある）【5～35℃】",null,"5℃以上（気温が5℃を下回る場合にはエポキシ樹脂を加温する必要がある）【5～35℃】",null,"【5～40℃】",null,"躯体温度が0℃以下、30℃以上になる場合は、保温養生や降温の処置を行う 【NETIS情報を修正：5～30℃】",null,"躯体温度が0℃以下、30℃以上になる場合は、保温養生や降温の処置を行う 【NETIS情報を修正：5～30℃】",null,"0℃以上【0～45℃】",null,"5℃以下では凍結に注意。1℃まで施工実績があるが、1℃未満の場合樹脂加温等の対策が必要。【5～35℃】",null,"施工気温：5～40℃、構造物温度：5～40℃",null,"5℃～40℃（採暖養生による施工は可）",null,"【0～50℃】",null,"【注入材の性能による】",null,"【-5～60℃】",null,"5～40℃",null,"-5℃～35℃",null,"5～35℃"]
[null,null,null,"施工中の水分",null," 適用可能（漏水箇所は適用不可） ",null,"適用可能（水中、著しい漏水のある箇所には適用不可）【ひび割れ内部が湿潤する程度の漏水は適用可能】",null,"適用可能（漏水箇所は適用不可）",null,"適用可能（漏水箇所は適用不可、エア等で水を除去すれば適用可能）",null,"適用可能（漏水箇所は適用不可、エア等で水を除去すれば適用可能）",null,"【可（湿潤面への適用が可能）】（漏水個所はで流水量の少ない漏水個所に適用可）",null,"可（乾燥面・湿潤面への適用が可能　【漏水個所は適用不可】）",null,"【適用不可】",null,"【適用不可】",null,"【適用不可】",null,"【適用可能（漏水箇所は適用不可）】",null,"適用可能（漏水個所に適用可能）【漏水個所はにじみ、滴水程度まで適用可能】",null,"適用可能【漏水箇所は注入材が流出しない程度の流水の場合に適用可能】",null,"適用可能【漏水箇所は注入材が流出しない程度の流水の場合に適用可能】",null,"適用可能（漏水箇所に適用可能、流出水が多い場合は高吸水性樹脂の少量添加等を検討）",null,"適用可能（残存水分で接合力低下が起きない）【漏水箇所に適用可能（接着強さ試験結果：湿潤時7.3N/mm2）】",null,"可（ただし温水(40℃程度以上)に直接触れる箇所、水中作業となる工事、湧水箇所（ひび割れ長さ1mあたり10 リットル/minを超える程度）は適用不可）",null,"不可（施工部分のひび割れやコンクリート面を乾燥状態に保てること(屋外の場合、降雨、降雪時の対策が必要)。）",null,"可（粘性度は35,000mPa・sの範囲(現地攪拌時間:60分)に おいて、止水が可能であること）",null,"降雨時、降雪時、及び施工面が濡れている場合は作業を行わないこと",null,"【適用可能（潤滑面のひび割れ、ひび割れから漏水がある場合）】水と直接接触する箇所には適用不可",null,"不可",null,"【湿潤面のひび割れ：適用可（雨天時、降雪時は不可）、ひび割れから漏水がある場合：適用不可】",null,"適用可（湿潤面に使用可能）"]
[null,null,null,"ひび割れ幅の変化に追従可能",null," 【適用不可】 ",null,"【適用不可】",null,"【適用不可】",null,"【不可】",null,"【不可】",null,"【可】",null,"【不可】",null,"【適用不可】",null,"【適用可能（伸び率188%）】",null,"【適用可能（伸び率58%）】",null,"【適用不可】",null,"適用可能（硬化後の追従性（弾性）を有する材料を使用）【伸び率300％】",null,"【適用不可】",null,"【適用不可】",null,"【適用可能（20℃時の伸び率600％）】",null,"【適用不可】",null,"【適用可能】",null,"【適用可能（0.3mmを超える変動がある場合には不可）】",null,"【適用不可】",null,"-",null,"【可】",null,"【可とう性樹脂使用の場合は可】",null,"-",null,"-"]
[null,"⑨","比較する従来技術",null,null," 表面被覆工 ",null,"ひび割れ注入工法(柔軟型エポキシ樹脂3種)",null,"注入器具によるひび割れ注入工",null,"低圧注入工法",null,"低圧注入工法",null,"有機溶剤による密着工法",null,"⼀般的なエポキシ樹脂コンクリート補修材",null,"クラック処理工(ポンプによりひび割れ注入を行う工法)",null,"クラック処理工(ポンプによりひび割れ注入を行う工法)",null,"クラック処理工(ポンプによりひび割れ注入を行う工法)",null,"クラック処理工(ポンプによりひび割れ注入を行う工法)",null,"線導水工法",null,"エポキシ樹脂注入材",null,"エポキシ樹脂注入材",null,"親水性ポリウレタン樹脂を用いたクラック処理工",null,"道路維持修繕工-モルタル修復工",null,"1液型ポリウレタン樹脂注入工法",null,"樹脂注入工法",null,"エポキシ樹脂注入剤",null,"クラック処理工(ポンプによりひび割れ注入を行う工法)",null,"1液型ポリウレタン樹脂注入工法",null,"不透明なシール材を用いた自動式低圧注入工法",null,"エポキシ系樹脂注入材による低圧注入工法",null,"有機の低粘度エポキシ樹脂を用いた自動式低圧注入工法"]
["評価情報","⑩","評価基準",null,"項目","最新の活用効果評価結果,所見",null,"最新の活用効果評価結果,所見",null,"最新の活用効果評価結果,所見",null,"最新の活用効果評価結果,所見",null,"最新の活用効果評価結果,所見",null,"最新の活用効果評価結果,所見",null,"最新の活用効果評価結果,所見",null,"最新の活用効果評価結果,所見",null,"最新の活用効果評価結果,所見",null,"最新の活用効果評価結果,所見",null,"最新の活用効果評価結果,所見",null,"最新の活用効果評価結果,所見",null,"最新の活用効果評価結果,所見",null,"最新の活用効果評価結果,所見",null,"最新の活用効果評価結果,所見",null,"最新の活用効果評価結果,所見",null,"最新の活用効果評価結果,所見",null,"最新の活用効果評価結果,所見",null,"最新の活用効果評価結果,所見",null,"最新の活用効果評価結果,所見",null,"最新の活用効果評価結果,所見",null,"最新の活用効果評価結果,所見",null,"最新の活用効果評価結果,所見",null,"最新の活用効果評価結果,所見"]
[null,null,"・A：従来技術より極めて優れる\n・B：従来技術より優れる\n・C：従来技術と同等\n・D：従来技術より劣る",null,"経済性","A：補修材料費が安価で、塗布と擦込み作業のインターバルが小さく、ひび割れ部のみの部分補修であることより、経済性の向上及び工程の短縮が図られている。",null,"C：-",null,"C：-",null,"B：-",null,"B：-",null,"-",null,"D：-",null,"C：-",null,"C：-",null,"C：-",null,"C：-",null,"C：-",null,"D：留意事項：主成分が超微粒子で、微小のクラックまで注入することが出来るが、材料単価が高価なため、通常のエポキシ樹脂系注入材の使用箇所で使用すると経済性が悪くなる。",null,"D：留意事項：主成分が超微粒子で、微小のクラックまで注入することが出来るが、材料単価が高価なため、通常のエポキシ樹脂系注入材の使用箇所で使用すると経済性が悪くなる。",null,"D：・留意事項：注入孔の削孔、2液の注入(機器)が従来工法と比べ高価となるが、使用する材料には、体積減少や硬化後の透水性が殆ど無く付着力が大きく、長期安定性に優れる。",null,"C：従来技術と比較して、はつり工程がほとんど無くポリマーセメントモルタルの使用量も少ないためコスト低減が図れる。",null,"-",null,"-",null,"-",null,"-",null,"-",null,"-",null,"-",null,"-"]
[null,null,null,null,"工程","A：補修材料費が安価で、塗布と擦込み作業のインターバルが小さく、ひび割れ部のみの部分補修であることより、経済性の向上及び工程の短縮が図られている。",null,"C：-",null,"C：-",null,"B：-",null,"B：-",null,"-",null,"C：-",null,"C：施工箇所が多数でも注入器具の設置が同時にできるので工程の短縮が図れる。\n留意事項：気温が5℃を下回る場合には、エポキシ樹脂を加温し、可使時間内に注入を終了する必要がある。",null,"C：施工箇所が多数でも注入器具の設置が同時にできるので工程の短縮が図れる。\n留意事項：気温が5℃を下回る場合には、エポキシ樹脂を加温し、可使時間内に注入を終了する必要がある。",null,"C：施工箇所が多数でも注入器具の設置が同時にできるので工程の短縮が図れる。\n留意事項：気温が5℃を下回る場合には、エポキシ樹脂を加温し、可使時間内に注入を終了する必要がある。",null,"C：施工箇所が多数でも注入器具の設置が同時にできるので工程の短縮が図れる。\n留意事項：気温が5℃を下回る場合には、エポキシ樹脂を加温し、可使時間内に注入を終了する必要がある。",null,"B：工程について従来技術と比較すると、ひびわれ箇所の削孔だけでよく、Vカット・Uカットの施工が省けるので、工期短縮ができた。",null,"D：-",null,"D：-",null,"C：・留意事項：削孔作業・パッカー設置作業があり、2種類の注入材を使用することから、作業能率は従来工法より劣る。",null,"B：-",null,"-",null,"-",null,"-",null,"-",null,"-",null,"-",null,"-",null,"-"]
[null,null,null,null,"品質・出来形","B：-",null,"B：亜硝酸リチウムを先行注入するため塩害、中性化、ASR抑制効果に期待できる。",null,"C：-",null,"C：-",null,"C：-",null,"-",null,"B：・塩分吸着性能を付与することにより鉄筋腐食抑制効果が期待される。",null,"B：低圧で注入作業が継続され、ひび割れの深奥部や鉄筋の付着切れによる空隙にも注入可能となるので、品質の信頼性の向上が期待できる。",null,"B：低圧で注入作業が継続され、ひび割れの深奥部や鉄筋の付着切れによる空隙にも注入可能となるので、品質の信頼性の向上が期待できる。",null,"B：低圧で注入作業が継続され、ひび割れの深奥部や鉄筋の付着切れによる空隙にも注入可能となるので、品質の信頼性の向上が期待できる。",null,"B：低圧で注入作業が継続され、ひび割れの深奥部や鉄筋の付着切れによる空隙にも注入可能となるので、品質の信頼性の向上が期待できる。",null,"B：留意事項：A重油、硫酸、塩酸等を漏水に含む箇所には適さない。",null,"B：ひび割れ内部に水が残存していたり、湿潤面でも注入が可能であり、高炉スラグのポゾラン反応による長期耐久性に優れた水和物が生成できる。留意事項：ひび割れの変動が大きい（躯体に動きのある）構造物の補修には適用できない。",null,"B：ひび割れ内部に水が残存していたり、湿潤面でも注入が可能であり、高炉スラグのポゾラン反応による長期耐久性に優れた水和物が生成できる。留意事項：ひび割れの変動が大きい（躯体に動きのある）構造物の補修には適用できない。",null,"B：・先行注入材が微細なひび割れにも充てんされるため、止水性の向上が期待できる。",null,"B：低圧にてエポキシ樹脂注入を行うため、細部までの充填ができ、躯体の補強が期待できる。",null,"-",null,"-",null,"-",null,"-",null,"-",null,"-",null,"-",null,"-"]
[null,null,null,null,"安全性","C：-",null,"C：-",null,"C：-",null,"C：-",null,"C：-",null,"-",null,"C：-",null,"C：ポンプなどの機材および熟練者を必要とせずに人力作業で行えるので安全性や施工性の向上が期待できる。",null,"C：ポンプなどの機材および熟練者を必要とせずに人力作業で行えるので安全性や施工性の向上が期待できる。",null,"C：ポンプなどの機材および熟練者を必要とせずに人力作業で行えるので安全性や施工性の向上が期待できる。",null,"C：ポンプなどの機材および熟練者を必要とせずに人力作業で行えるので安全性や施工性の向上が期待できる。",null,"B：高所でのハツリ作業が必要でないため、転落や落下物の危険性が減少した。",null,"C：無機系材料であり、また環境に優しく安全である。",null,"C：無機系材料であり、また環境に優しく安全である。",null,"C：・留意事項：注入剤を高圧注入するため、作業手順を間違うと注入剤を飛散させることがあり、第三者に影響がある現場では取り扱いに注意を要する。・留意事項：ゲル化時間が従来工法より長いため、作業完了後も注入材落下の危険があるため落下防止養生等の作業が必要である。",null,"C：-",null,"-",null,"-",null,"-",null,"-",null,"-",null,"-",null,"-",null,"-"]
[null,null,null,null,"施工性","B：-",null,"C：留意事項：施工性は、従来技術と比較して2段階の注入作業による手間増加となった。",null,"B：留意事項：ローラーによる接着剤の塗布作業のみになるため容易である。",null,"B：-",null,"B：-",null,"-",null,"C：-",null,"B：熟練者による作業が不要でかつ作業内容が簡素化されているので、施工性の向上が期待できる。0.1㎜以下の微細ひび割れへも充填可能。",null,"B：熟練者による作業が不要でかつ作業内容が簡素化されているので、施工性の向上が期待できる。0.1㎜以下の微細ひび割れへも充填可能。",null,"B：熟練者による作業が不要でかつ作業内容が簡素化されているので、施工性の向上が期待できる。0.1㎜以下の微細ひび割れへも充填可能。",null,"B：熟練者による作業が不要でかつ作業内容が簡素化されているので、施工性の向上が期待できる。0.1㎜以下の微細ひび割れへも充填可能。",null,"B：留意事項：施工箇所の中で、水圧の低いところから注入を進める必要がある。\n留意事項：漏水の状況、部位に応じて、硬化速度をコントロールできるため、現場の諸条件を把握する必要がある。",null,"C：留意事項：温度は常温域（5～30℃）では問題はないが、凍結温度域や高温で保管した場合には材料を練混ぜてスラリーにした際の性状悪化が懸念されるため注意を要する。",null,"C：留意事項：温度は常温域（5～30℃）では問題はないが、凍結温度域や高温で保管した場合には材料を練混ぜてスラリーにした際の性状悪化が懸念されるため注意を要する。",null,"C：・はつり作業などの下地処理がなくなったことにより、施工性・安全性の向上が期待できる。",null,"C：留意事項：5℃以下の環境では凍結に対する対応が必要である。\n留意事項：無機系注入材と同時採用の場合は、無機系注入を先行する必要がある。",null,"-",null,"-",null,"-",null,"-",null,"-",null,"-",null,"-",null,"-"]
[null,null,null,null,"環境","B：-",null,"C：-",null,"B：シール材が不要なことから産業廃棄物の発生量を縮減できた。",null,"B：-",null,"B：-",null,"-",null,"C：-",null,"C：注入材の飛散もなく、騒音・振動が発生しないので環境の向上が期待できる。\n留意事項：注入器具が使い捨てであるので、産廃が生じる。",null,"C：注入材の飛散もなく、騒音・振動が発生しないので環境の向上が期待できる。\n留意事項：注入器具が使い捨てであるので、産廃が生じる。",null,"C：注入材の飛散もなく、騒音・振動が発生しないので環境の向上が期待できる。\n留意事項：注入器具が使い捨てであるので、産廃が生じる。",null,"C：注入材の飛散もなく、騒音・振動が発生しないので環境の向上が期待できる。\n留意事項：注入器具が使い捨てであるので、産廃が生じる。",null,"B：中間工程として、従来技術ではカッター切断、コンクリート取壊し撤去が必要であったが、本技術では注入孔の削孔だけなので、産業廃棄物の発生はなくなり、騒音・振動・粉塵も大幅に減少した。",null,"C：-",null,"C：-",null,"C：-",null,"C：はつり作業を行わないため、コンクリート殻、粉塵及び騒音の発生を低減することができる。",null,"-",null,"-",null,"-",null,"-",null,"-",null,"-",null,"-",null,"-"]
[null,null,null,null,"総合評価","B：-",null,"C：-",null,"C：-",null,"B：-",null,"B：-",null,"-",null,"C：-",null,"C：留意事項：特に効果の高い適用範囲としてはひび割れ幅が0.2～1.0mmのひび割れであるが、ひび割れ幅が5ｍｍを超える場合、及び漏水がありひび割れ幅が変動する場合は他の工法の採用や併用を検討する必要がある。",null,"C：留意事項：特に効果の高い適用範囲としてはひび割れ幅が0.2～1.0mmのひび割れであるが、ひび割れ幅が5ｍｍを超える場合、及び漏水がありひび割れ幅が変動する場合は他の工法の採用や併用を検討する必要がある。",null,"C：留意事項：特に効果の高い適用範囲としてはひび割れ幅が0.2～1.0mmのひび割れであるが、ひび割れ幅が5ｍｍを超える場合、及び漏水がありひび割れ幅が変動する場合は他の工法の採用や併用を検討する必要がある。",null,"C：留意事項：特に効果の高い適用範囲としてはひび割れ幅が0.2～1.0mmのひび割れであるが、ひび割れ幅が5ｍｍを超える場合、及び漏水がありひび割れ幅が変動する場合は他の工法の採用や併用を検討する必要がある。",null,"B：-",null,"C：留意事項：保管はセメントと同様に湿気に注意するとともに、可能な限り一定温度で保管することが必要である。",null,"C：留意事項：保管はセメントと同様に湿気に注意するとともに、可能な限り一定温度で保管することが必要である。",null,"C：-",null,"C：-",null,"-",null,"-",null,"-",null,"-",null,"-",null,"-",null,"-",null,"-"]
["統一した従来技術",null,null,null,null,"ひび割れ被覆工法（経済性、工程は比較対象としない）",null,"ひび割れ注入工法（低圧注入工法）",null,"ひび割れ被覆工法（経済性、工程は比較対象としない）",null,"ひび割れ被覆工法（経済性、工程は比較対象としない）",null,"ひび割れ被覆工法（経済性、工程は比較対象としない）",null,"ひび割れ注入工法（低圧注入工法）",null,"ひび割れ注入工法（低圧注入工法）",null,"ひび割れ注入工法（低圧注入工法）",null,"ひび割れ注入工法（低圧注入工法）",null,"ひび割れ注入工法（低圧注入工法）",null,"ひび割れ注入工法（低圧注入工法）",null,"ひび割れ注入工法（低圧注入工法）",null,"ひび割れ注入工法（低圧注入工法）",null,"ひび割れ注入工法（低圧注入工法）",null,"ひび割れ注入工法（低圧注入工法）",null,"ひび割れ注入工法（低圧注入工法）",null,"ひび割れ注入工法（低圧注入工法）",null,"ひび割れ被覆工法（経済性、工程は比較対象としない）",null,"ひび割れ注入工法（低圧注入工法）",null,"ひび割れ注入工法（低圧注入工法）",null,"ひび割れ注入工法（低圧注入工法）",null,"ひび割れ注入工法（低圧注入工法）",null,"ひび割れ注入工法（低圧注入工法）",null,"／"]
["補完調査情報",null,null,null,null,"従来技術","新技術","従来技術","新技術","従来技術","新技術","従来技術","新技術","従来技術","新技術","従来技術","新技術","従来技術","新技術","従来技術","新技術","従来技術","新技術","従来技術","新技術","従来技術","新技術","従来技術","新技術","従来技術","新技術","従来技術","新技術","従来技術","新技術","従来技術","新技術","従来技術","新技術","従来技術","新技術","従来技術","新技術","従来技術","新技術","従来技術","新技術","従来技術","新技術","従来技術","新技術","従来技術","新技術"]
[null,"⑪","施工費用　注1）",null,"施工費","-",1900,"-",7139,"-",1130,"-",4310,"-",4310,"-","未回答","-",6306,"-",6306,"-",6306,"-",6306,"-",6306,"-",26348,"-","-","-","-","-","未回答","-",8975,"-",15940,"-",4118,"-",19547,"-",6306,"-",21034,"-",5152,"-",3845,"／","／"]
[null,null,null,null,"材料費","-",600,"-",2532,"-",1440,"-",400,"-",400,"-","未回答","-",3093,"-",3401,"-",3517,"-",3517,"-",3368,"-",11421,"-","材料単価1,500（円/kg）","-","材料単価1,650（円/kg）","-","未回答","-",4915,"-",10719,"-",400,"-",7815,"-",3000,"-",3276,"-",2890,"-",1333,"／","／"]
[null,null,null,null,"合計","-",2500,8813,9671,"-",2570,"-",4710,"-",4710,8813,"未回答",8813,9399,8813,9707,8813,9823,8813,9823,8813,9674,8813,37769,8813,"-",8813,"-",8813,"未回答",8813,13890,8813,26659,"-",4518,8813,27362,8813,9306,8813,24310,8813,8042,8813,5178,"／","／"]
[null,null,null,null,"備考","-","ひび割れ幅0.2mm、塗布量CS-21クリアー12g/m、CSパテ10g/m","-","ひび割れ幅0.5mm、ひび割れ深さ100mm","-","ひび割れ幅0.3mm以下","-","ひび割れ幅0.5mm","-","ひび割れ幅0.5mm","-","-","-","-","-","ひび割れ幅0.2～0.5mm","-","ひび割れ幅0.2～0.5mm","-","ひび割れ幅0.2～0.5mm","-","ひび割れ幅0.2～0.5mm","-","ひび割れ幅0.5mm、ひび割れ深さ100mm","-","-","-","-","-","ひび割れ幅0.5mm、ひび割れ深さ100mm","-","ひび割れ幅0.5mm","-","ひび割れ幅0.5mm、ひび割れ深さ100mm","-","ひび割れ幅0.2mm、ひび割れ深さ50mm","-","ひび割れ幅0.5mm、ひび割れ深さ100mm","-","ひび割れ幅0.5mm、ひび割れ深さ100mm、注入材（エポキシ樹脂系）を含む","-","ひび割れ幅0.5mm、ひび割れ深さ100mm","-","ひび割れ幅0.5mm、ひび割れ深さ100mm","-","ひび割れ幅0.5㎜、深さ100㎜","／","／"]
[null,"⑫","施工日数",null,null,"-",0.01,3.9E-2,3.90625E-2,"-",5.8823529411764705E-3,"-",1.1111111111111112E-2,"-",1.1111111111111112E-2,3.9E-2,"未回答",3.9E-2,5.8000000000000003E-2,3.9E-2,5.7803468208092484E-2,3.9E-2,5.7803468208092484E-2,3.9E-2,5.7803468208092484E-2,3.9E-2,5.7803468208092484E-2,3.9E-2,0.14285714285714285,3.9E-2,"-",3.9E-2,"-",3.9E-2,"未回答",3.9E-2,5.5741360089186169E-2,3.9E-2,0.1,"-",0.02,3.9E-2,0.1,3.9E-2,3.8461538461538464E-2,3.9E-2,0.13333333333333333,3.9E-2,0.05,3.9E-2,0.02,"／","／"]
[null,"⑬","施工規模",null,null,"-","100m以上","-","100ｍ","-","170ｍ以上施工箇所点在は別途","-",90,"-",90,"-","未回答","-",100,"-","100m以上施工箇所点在は別途","-","100m以上施工箇所点在は別途","-","100m以上施工箇所点在は別途","-","100m以上施工箇所点在は別途","-",100,"-","-","-","-","-","未回答","-",50,"-",100,"-",100,"-",100,"-",100,"-",30,"-",100,"-","100ｍ以上","／","／"]
[null,"⑭","統一した従来技術との比較",null,"経済性",{"$f":"IFERROR(IF(G33=\"-\",\"-\",IF(G33=\"\",\"-\",IF(G33/F33=1,\"△\",IF(G33/F33>1,\"-（\"&ABS(ROUND(100*G33/F33-100,1))&\"％増）\",IF(G33/F33<1,\"○（\"&ABS(ROUND(100*G33/F33-100,1))&\"％減）\",\"\"))))),\"-\")","v":"-"},{"$f":"IFERROR(IF(F33=\"-\",\"-\",\"（\"&TEXT(G33,\"#,###\")&\"-\"&TEXT(F33,\"#,###\")&\"）/\"&TEXT(F33,\"#,###\")&\"=\"&TEXT((G33-F33)/F33*100,\"0.0\")&\"%\"),\"-\")","v":"-"},{"$f":"IFERROR(IF(I33=\"-\",\"-\",IF(I33=\"\",\"-\",IF(I33/H33=1,\"△\",IF(I33/H33>1,\"-（\"&ABS(ROUND(100*I33/H33-100,1))&\"％増）\",IF(I33/H33<1,\"○（\"&ABS(ROUND(100*I33/H33-100,1))&\"％減）\",\"\"))))),\"-\")","v":"-（9.7％増）"},{"$f":"IFERROR(IF(H33=\"-\",\"-\",\"（\"&TEXT(I33,\"#,###\")&\"-\"&TEXT(H33,\"#,###\")&\"）/\"&TEXT(H33,\"#,###\")&\"=\"&TEXT((I33-H33)/H33*100,\"0.0\")&\"%\"),\"-\")","v":"（9,671-8,813）/8,813=9.7%"},{"$f":"IFERROR(IF(K33=\"-\",\"-\",IF(K33=\"\",\"-\",IF(K33/J33=1,\"△\",IF(K33/J33>1,\"-（\"&ABS(ROUND(100*K33/J33-100,1))&\"％増）\",IF(K33/J33<1,\"○（\"&ABS(ROUND(100*K33/J33-100,1))&\"％減）\",\"\"))))),\"-\")","v":"-"},{"$f":"IFERROR(IF(J33=\"-\",\"-\",\"（\"&TEXT(K33,\"#,###\")&\"-\"&TEXT(J33,\"#,###\")&\"）/\"&TEXT(J33,\"#,###\")&\"=\"&TEXT((K33-J33)/J33*100,\"0.0\")&\"%\"),\"-\")","v":"-"},{"$f":"IFERROR(IF(M33=\"-\",\"-\",IF(M33=\"\",\"-\",IF(M33/L33=1,\"△\",IF(M33/L33>1,\"-（\"&ABS(ROUND(100*M33/L33-100,1))&\"％増）\",IF(M33/L33<1,\"○（\"&ABS(ROUND(100*M33/L33-100,1))&\"％減）\",\"\"))))),\"-\")","v":"-"},{"$f":"IFERROR(IF(L33=\"-\",\"-\",\"（\"&TEXT(M33,\"#,###\")&\"-\"&TEXT(L33,\"#,###\")&\"）/\"&TEXT(L33,\"#,###\")&\"=\"&TEXT((M33-L33)/L33*100,\"0.0\")&\"%\"),\"-\")","v":"-"},{"$f":"IFERROR(IF(O33=\"-\",\"-\",IF(O33=\"\",\"-\",IF(O33/N33=1,\"△\",IF(O33/N33>1,\"-（\"&ABS(ROUND(100*O33/N33-100,1))&\"％増）\",IF(O33/N33<1,\"○（\"&ABS(ROUND(100*O33/N33-100,1))&\"％減）\",\"\"))))),\"-\")","v":"-"},{"$f":"IFERROR(IF(N33=\"-\",\"-\",\"（\"&TEXT(O33,\"#,###\")&\"-\"&TEXT(N33,\"#,###\")&\"）/\"&TEXT(N33,\"#,###\")&\"=\"&TEXT((O33-N33)/N33*100,\"0.0\")&\"%\"),\"-\")","v":"-"},{"$f":"IFERROR(IF(Q33=\"-\",\"-\",IF(Q33=\"\",\"-\",IF(Q33/P33=1,\"△\",IF(Q33/P33>1,\"-（\"&ABS(ROUND(100*Q33/P33-100,1))&\"％増）\",IF(Q33/P33<1,\"○（\"&ABS(ROUND(100*Q33/P33-100,1))&\"％減）\",\"\"))))),\"-\")","v":"-"},{"$f":"IFERROR(IF(P33=\"-\",\"-\",\"（\"&TEXT(Q33,\"#,###\")&\"-\"&TEXT(P33,\"#,###\")&\"）/\"&TEXT(P33,\"#,###\")&\"=\"&TEXT((Q33-P33)/P33*100,\"0.0\")&\"%\"),\"-\")","v":"-"},{"$f":"IFERROR(IF(S33=\"-\",\"-\",IF(S33=\"\",\"-\",IF(S33/R33=1,\"△\",IF(S33/R33>1,\"-（\"&ABS(ROUND(100*S33/R33-100,1))&\"％増）\",IF(S33/R33<1,\"○（\"&ABS(ROUND(100*S33/R33-100,1))&\"％減）\",\"\"))))),\"-\")","v":"-（6.6％増）"},{"$f":"IFERROR(IF(R33=\"-\",\"-\",\"（\"&TEXT(S33,\"#,###\")&\"-\"&TEXT(R33,\"#,###\")&\"）/\"&TEXT(R33,\"#,###\")&\"=\"&TEXT((S33-R33)/R33*100,\"0.0\")&\"%\"),\"-\")","v":"（9,399-8,813）/8,813=6.6%"},{"$f":"IFERROR(IF(U33=\"-\",\"-\",IF(U33=\"\",\"-\",IF(U33/T33=1,\"△\",IF(U33/T33>1,\"-（\"&ABS(ROUND(100*U33/T33-100,1))&\"％増）\",IF(U33/T33<1,\"○（\"&ABS(ROUND(100*U33/T33-100,1))&\"％減）\",\"\"))))),\"-\")","v":"-（10.1％増）"},{"$f":"IFERROR(IF(T33=\"-\",\"-\",\"（\"&TEXT(U33,\"#,###\")&\"-\"&TEXT(T33,\"#,###\")&\"）/\"&TEXT(T33,\"#,###\")&\"=\"&TEXT((U33-T33)/T33*100,\"0.0\")&\"%\"),\"-\")","v":"（9,707-8,813）/8,813=10.1%"},{"$f":"IFERROR(IF(W33=\"-\",\"-\",IF(W33=\"\",\"-\",IF(W33/V33=1,\"△\",IF(W33/V33>1,\"-（\"&ABS(ROUND(100*W33/V33-100,1))&\"％増）\",IF(W33/V33<1,\"○（\"&ABS(ROUND(100*W33/V33-100,1))&\"％減）\",\"\"))))),\"-\")","v":"-（11.5％増）"},{"$f":"IFERROR(IF(V33=\"-\",\"-\",\"（\"&TEXT(W33,\"#,###\")&\"-\"&TEXT(V33,\"#,###\")&\"）/\"&TEXT(V33,\"#,###\")&\"=\"&TEXT((W33-V33)/V33*100,\"0.0\")&\"%\"),\"-\")","v":"（9,823-8,813）/8,813=11.5%"},{"$f":"IFERROR(IF(Y33=\"-\",\"-\",IF(Y33=\"\",\"-\",IF(Y33/X33=1,\"△\",IF(Y33/X33>1,\"-（\"&ABS(ROUND(100*Y33/X33-100,1))&\"％増）\",IF(Y33/X33<1,\"○（\"&ABS(ROUND(100*Y33/X33-100,1))&\"％減）\",\"\"))))),\"-\")","v":"-（11.5％増）"},{"$f":"IFERROR(IF(X33=\"-\",\"-\",\"（\"&TEXT(Y33,\"#,###\")&\"-\"&TEXT(X33,\"#,###\")&\"）/\"&TEXT(X33,\"#,###\")&\"=\"&TEXT((Y33-X33)/X33*100,\"0.0\")&\"%\"),\"-\")","v":"（9,823-8,813）/8,813=11.5%"},{"$f":"IFERROR(IF(AA33=\"-\",\"-\",IF(AA33=\"\",\"-\",IF(AA33/Z33=1,\"△\",IF(AA33/Z33>1,\"-（\"&ABS(ROUND(100*AA33/Z33-100,1))&\"％増）\",IF(AA33/Z33<1,\"○（\"&ABS(ROUND(100*AA33/Z33-100,1))&\"％減）\",\"\"))))),\"-\")","v":"-（9.8％増）"},{"$f":"IFERROR(IF(Z33=\"-\",\"-\",\"（\"&TEXT(AA33,\"#,###\")&\"-\"&TEXT(Z33,\"#,###\")&\"）/\"&TEXT(Z33,\"#,###\")&\"=\"&TEXT((AA33-Z33)/Z33*100,\"0.0\")&\"%\"),\"-\")","v":"（9,674-8,813）/8,813=9.8%"},{"$f":"IFERROR(IF(AC33=\"-\",\"-\",IF(AC33=\"\",\"-\",IF(AC33/AB33=1,\"△\",IF(AC33/AB33>1,\"-（\"&ABS(ROUND(100*AC33/AB33-100,1))&\"％増）\",IF(AC33/AB33<1,\"○（\"&ABS(ROUND(100*AC33/AB33-100,1))&\"％減）\",\"\"))))),\"-\")","v":"-（328.6％増）"},{"$f":"IFERROR(IF(AB33=\"-\",\"-\",\"（\"&TEXT(AC33,\"#,###\")&\"-\"&TEXT(AB33,\"#,###\")&\"）/\"&TEXT(AB33,\"#,###\")&\"=\"&TEXT((AC33-AB33)/AB33*100,\"0.0\")&\"%\"),\"-\")","v":"（37,769-8,813）/8,813=328.6%"},{"$f":"IFERROR(IF(AE33=\"-\",\"-\",IF(AE33=\"\",\"-\",IF(AE33/AD33=1,\"△\",IF(AE33/AD33>1,\"-（\"&ABS(ROUND(100*AE33/AD33-100,1))&\"％増）\",IF(AE33/AD33<1,\"○（\"&ABS(ROUND(100*AE33/AD33-100,1))&\"％減）\",\"\"))))),\"-\")","v":"-"},{"$f":"IFERROR(IF(AD33=\"-\",\"-\",\"（\"&TEXT(AE33,\"#,###\")&\"-\"&TEXT(AD33,\"#,###\")&\"）/\"&TEXT(AD33,\"#,###\")&\"=\"&TEXT((AE33-AD33)/AD33*100,\"0.0\")&\"%\"),\"-\")","v":"-"},{"$f":"IFERROR(IF(AG33=\"-\",\"-\",IF(AG33=\"\",\"-\",IF(AG33/AF33=1,\"△\",IF(AG33/AF33>1,\"-（\"&ABS(ROUND(100*AG33/AF33-100,1))&\"％増）\",IF(AG33/AF33<1,\"○（\"&ABS(ROUND(100*AG33/AF33-100,1))&\"％減）\",\"\"))))),\"-\")","v":"-"},{"$f":"IFERROR(IF(AF33=\"-\",\"-\",\"（\"&TEXT(AG33,\"#,###\")&\"-\"&TEXT(AF33,\"#,###\")&\"）/\"&TEXT(AF33,\"#,###\")&\"=\"&TEXT((AG33-AF33)/AF33*100,\"0.0\")&\"%\"),\"-\")","v":"-"},{"$f":"IFERROR(IF(AI33=\"-\",\"-\",IF(AI33=\"\",\"-\",IF(AI33/AH33=1,\"△\",IF(AI33/AH33>1,\"-（\"&ABS(ROUND(100*AI33/AH33-100,1))&\"％増）\",IF(AI33/AH33<1,\"○（\"&ABS(ROUND(100*AI33/AH33-100,1))&\"％減）\",\"\"))))),\"-\")","v":"-"},{"$f":"IFERROR(IF(AH33=\"-\",\"-\",\"（\"&TEXT(AI33,\"#,###\")&\"-\"&TEXT(AH33,\"#,###\")&\"）/\"&TEXT(AH33,\"#,###\")&\"=\"&TEXT((AI33-AH33)/AH33*100,\"0.0\")&\"%\"),\"-\")","v":"-"},{"$f":"IFERROR(IF(AK33=\"-\",\"-\",IF(AK33=\"\",\"-\",IF(AK33/AJ33=1,\"△\",IF(AK33/AJ33>1,\"-（\"&ABS(ROUND(100*AK33/AJ33-100,1))&\"％増）\",IF(AK33/AJ33<1,\"○（\"&ABS(ROUND(100*AK33/AJ33-100,1))&\"％減）\",\"\"))))),\"-\")","v":"-（57.6％増）"},{"$f":"IFERROR(IF(AJ33=\"-\",\"-\",\"（\"&TEXT(AK33,\"#,###\")&\"-\"&TEXT(AJ33,\"#,###\")&\"）/\"&TEXT(AJ33,\"#,###\")&\"=\"&TEXT((AK33-AJ33)/AJ33*100,\"0.0\")&\"%\"),\"-\")","v":"（13,890-8,813）/8,813=57.6%"},{"$f":"IFERROR(IF(AM33=\"-\",\"-\",IF(AM33=\"\",\"-\",IF(AM33/AL33=1,\"△\",IF(AM33/AL33>1,\"-（\"&ABS(ROUND(100*AM33/AL33-100,1))&\"％増）\",IF(AM33/AL33<1,\"○（\"&ABS(ROUND(100*AM33/AL33-100,1))&\"％減）\",\"\"))))),\"-\")","v":"-（202.5％増）"},{"$f":"IFERROR(IF(AL33=\"-\",\"-\",\"（\"&TEXT(AM33,\"#,###\")&\"-\"&TEXT(AL33,\"#,###\")&\"）/\"&TEXT(AL33,\"#,###\")&\"=\"&TEXT((AM33-AL33)/AL33*100,\"0.0\")&\"%\"),\"-\")","v":"（26,659-8,813）/8,813=202.5%"},{"$f":"IFERROR(IF(AO33=\"-\",\"-\",IF(AO33=\"\",\"-\",IF(AO33/AN33=1,\"△\",IF(AO33/AN33>1,\"-（\"&ABS(ROUND(100*AO33/AN33-100,1))&\"％増）\",IF(AO33/AN33<1,\"○（\"&ABS(ROUND(100*AO33/AN33-100,1))&\"％減）\",\"\"))))),\"-\")","v":"-"},{"$f":"IFERROR(IF(AN33=\"-\",\"-\",\"（\"&TEXT(AO33,\"#,###\")&\"-\"&TEXT(AN33,\"#,###\")&\"）/\"&TEXT(AN33,\"#,###\")&\"=\"&TEXT((AO33-AN33)/AN33*100,\"0.0\")&\"%\"),\"-\")","v":"-"},{"$f":"IFERROR(IF(AQ33=\"-\",\"-\",IF(AQ33=\"\",\"-\",IF(AQ33/AP33=1,\"△\",IF(AQ33/AP33>1,\"-（\"&ABS(ROUND(100*AQ33/AP33-100,1))&\"％増）\",IF(AQ33/AP33<1,\"○（\"&ABS(ROUND(100*AQ33/AP33-100,1))&\"％減）\",\"\"))))),\"-\")","v":"-（210.5％増）"},{"$f":"IFERROR(IF(AP33=\"-\",\"-\",\"（\"&TEXT(AQ33,\"#,###\")&\"-\"&TEXT(AP33,\"#,###\")&\"）/\"&TEXT(AP33,\"#,###\")&\"=\"&TEXT((AQ33-AP33)/AP33*100,\"0.0\")&\"%\"),\"-\")","v":"（27,362-8,813）/8,813=210.5%"},{"$f":"IFERROR(IF(AS33=\"-\",\"-\",IF(AS33=\"\",\"-\",IF(AS33/AR33=1,\"△\",IF(AS33/AR33>1,\"-（\"&ABS(ROUND(100*AS33/AR33-100,1))&\"％増）\",IF(AS33/AR33<1,\"○（\"&ABS(ROUND(100*AS33/AR33-100,1))&\"％減）\",\"\"))))),\"-\")","v":"-（5.6％増）"},{"$f":"IFERROR(IF(AR33=\"-\",\"-\",\"（\"&TEXT(AS33,\"#,###\")&\"-\"&TEXT(AR33,\"#,###\")&\"）/\"&TEXT(AR33,\"#,###\")&\"=\"&TEXT((AS33-AR33)/AR33*100,\"0.0\")&\"%\"),\"-\")","v":"（9,306-8,813）/8,813=5.6%"},{"$f":"IFERROR(IF(AU33=\"-\",\"-\",IF(AU33=\"\",\"-\",IF(AU33/AT33=1,\"△\",IF(AU33/AT33>1,\"-（\"&ABS(ROUND(100*AU33/AT33-100,1))&\"％増）\",IF(AU33/AT33<1,\"○（\"&ABS(ROUND(100*AU33/AT33-100,1))&\"％減）\",\"\"))))),\"-\")","v":"-（175.8％増）"},{"$f":"IFERROR(IF(AT33=\"-\",\"-\",\"（\"&TEXT(AU33,\"#,###\")&\"-\"&TEXT(AT33,\"#,###\")&\"）/\"&TEXT(AT33,\"#,###\")&\"=\"&TEXT((AU33-AT33)/AT33*100,\"0.0\")&\"%\"),\"-\")","v":"（24,310-8,813）/8,813=175.8%"},{"$f":"IFERROR(IF(AW33=\"-\",\"-\",IF(AW33=\"\",\"-\",IF(AW33/AV33=1,\"△\",IF(AW33/AV33>1,\"-（\"&ABS(ROUND(100*AW33/AV33-100,1))&\"％増）\",IF(AW33/AV33<1,\"○（\"&ABS(ROUND(100*AW33/AV33-100,1))&\"％減）\",\"\"))))),\"-\")","v":"○（8.7％減）"},{"$f":"IFERROR(IF(AV33=\"-\",\"-\",\"（\"&TEXT(AW33,\"#,###\")&\"-\"&TEXT(AV33,\"#,###\")&\"）/\"&TEXT(AV33,\"#,###\")&\"=\"&TEXT((AW33-AV33)/AV33*100,\"0.0\")&\"%\"),\"-\")","v":"（8,042-8,813）/8,813=-8.7%"},{"$f":"IFERROR(IF(AY33=\"-\",\"-\",IF(AY33=\"\",\"-\",IF(AY33/AX33=1,\"△\",IF(AY33/AX33>1,\"-（\"&ABS(ROUND(100*AY33/AX33-100,1))&\"％増）\",IF(AY33/AX33<1,\"○（\"&ABS(ROUND(100*AY33/AX33-100,1))&\"％減）\",\"\"))))),\"-\")","v":"○（41.2％減）"},{"$f":"IFERROR(IF(AX33=\"-\",\"-\",\"（\"&TEXT(AY33,\"#,###\")&\"-\"&TEXT(AX33,\"#,###\")&\"）/\"&TEXT(AX33,\"#,###\")&\"=\"&TEXT((AY33-AX33)/AX33*100,\"0.0\")&\"%\"),\"-\")","v":"（5,178-8,813）/8,813=-41.2%"},{"$f":"IFERROR(IF(BA33=\"／\",\"／\",IF(BA33=\"\",\"／\",IF(BA33/AZ33=1,\"△\",IF(BA33/AZ33>1,\"／（\"&ABS(ROUND(100*BA33/AZ33/100,1))&\"％増）\",IF(BA33/AZ33<1,\"○（\"&ABS(ROUND(100*BA33/AZ33/100,1))&\"％減）\",\"\"))))),\"／\")","v":"／"},{"$f":"IFERROR(IF(AZ33=\"／\",\"／\",\"（\"&TEXT(BA33,\"#,###\")&\"／\"&TEXT(AZ33,\"#,###\")&\"）/\"&TEXT(AZ33,\"#,###\")&\"=\"&TEXT((BA33/AZ33)/AZ33*100,\"0.0\")&\"%\"),\"／\")","v":"／"}]
[null,null,null,null,"工程",{"$f":"IFERROR(IF(G35=\"-\",\"-\",IF(G35=\"\",\"-\",IF(G35/F35=1,\"△\",IF(G35/F35>1,\"-（\"&ABS(ROUND(100*G35/F35-100,1))&\"％増）\",IF(G35/F35<1,\"○（\"&ABS(ROUND(100*G35/F35-100,1))&\"％減）\",\"\"))))),\"-\")","v":"-"},{"$f":"IFERROR(IF(F35=\"-\",\"-\",\"（\"&TEXT(G35,\"##0.000\")&\"-\"&TEXT(F35,\"##0.000\")&\"）/\"&TEXT(F35,\"##0.000\")&\"=\"&TEXT((G35-F35)/F35*100,\"0.0\")&\"%\"),\"-\")","v":"-"},{"$f":"IFERROR(IF(I35=\"-\",\"-\",IF(I35=\"\",\"-\",IF(I35/H35=1,\"△\",IF(I35/H35>1,\"-（\"&ABS(ROUND(100*I35/H35-100,1))&\"％増）\",IF(I35/H35<1,\"○（\"&ABS(ROUND(100*I35/H35-100,1))&\"％減）\",\"\"))))),\"-\")","v":"-（0.2％増）"},{"$f":"IFERROR(IF(H35=\"-\",\"-\",\"（\"&TEXT(I35,\"##0.000\")&\"-\"&TEXT(H35,\"##0.000\")&\"）/\"&TEXT(H35,\"##0.000\")&\"=\"&TEXT((I35-H35)/H35*100,\"0.0\")&\"%\"),\"-\")","v":"（0.039-0.039）/0.039=0.2%"},{"$f":"IFERROR(IF(K35=\"-\",\"-\",IF(K35=\"\",\"-\",IF(K35/J35=1,\"△\",IF(K35/J35>1,\"-（\"&ABS(ROUND(100*K35/J35-100,1))&\"％増）\",IF(K35/J35<1,\"○（\"&ABS(ROUND(100*K35/J35-100,1))&\"％減）\",\"\"))))),\"-\")","v":"-"},{"$f":"IFERROR(IF(J35=\"-\",\"-\",\"（\"&TEXT(K35,\"##0.000\")&\"-\"&TEXT(J35,\"##0.000\")&\"）/\"&TEXT(J35,\"##0.000\")&\"=\"&TEXT((K35-J35)/J35*100,\"0.0\")&\"%\"),\"-\")","v":"-"},{"$f":"IFERROR(IF(M35=\"-\",\"-\",IF(M35=\"\",\"-\",IF(M35/L35=1,\"△\",IF(M35/L35>1,\"-（\"&ABS(ROUND(100*M35/L35-100,1))&\"％増）\",IF(M35/L35<1,\"○（\"&ABS(ROUND(100*M35/L35-100,1))&\"％減）\",\"\"))))),\"-\")","v":"-"},{"$f":"IFERROR(IF(L35=\"-\",\"-\",\"（\"&TEXT(M35,\"##0.000\")&\"-\"&TEXT(L35,\"##0.000\")&\"）/\"&TEXT(L35,\"##0.000\")&\"=\"&TEXT((M35-L35)/L35*100,\"0.0\")&\"%\"),\"-\")","v":"-"},{"$f":"IFERROR(IF(O35=\"-\",\"-\",IF(O35=\"\",\"-\",IF(O35/N35=1,\"△\",IF(O35/N35>1,\"-（\"&ABS(ROUND(100*O35/N35-100,1))&\"％増）\",IF(O35/N35<1,\"○（\"&ABS(ROUND(100*O35/N35-100,1))&\"％減）\",\"\"))))),\"-\")","v":"-"},{"$f":"IFERROR(IF(N35=\"-\",\"-\",\"（\"&TEXT(O35,\"##0.000\")&\"-\"&TEXT(N35,\"##0.000\")&\"）/\"&TEXT(N35,\"##0.000\")&\"=\"&TEXT((O35-N35)/N35*100,\"0.0\")&\"%\"),\"-\")","v":"-"},{"$f":"IFERROR(IF(Q35=\"-\",\"-\",IF(Q35=\"\",\"-\",IF(Q35/P35=1,\"△\",IF(Q35/P35>1,\"-（\"&ABS(ROUND(100*Q35/P35-100,1))&\"％増）\",IF(Q35/P35<1,\"○（\"&ABS(ROUND(100*Q35/P35-100,1))&\"％減）\",\"\"))))),\"-\")","v":"-"},{"$f":"IFERROR(IF(P35=\"-\",\"-\",\"（\"&TEXT(Q35,\"##0.000\")&\"-\"&TEXT(P35,\"##0.000\")&\"）/\"&TEXT(P35,\"##0.000\")&\"=\"&TEXT((Q35-P35)/P35*100,\"0.0\")&\"%\"),\"-\")","v":"-"},{"$f":"IFERROR(IF(S35=\"-\",\"-\",IF(S35=\"\",\"-\",IF(S35/R35=1,\"△\",IF(S35/R35>1,\"-（\"&ABS(ROUND(100*S35/R35-100,1))&\"％増）\",IF(S35/R35<1,\"○（\"&ABS(ROUND(100*S35/R35-100,1))&\"％減）\",\"\"))))),\"-\")","v":"-（48.7％増）"},{"$f":"IFERROR(IF(R35=\"-\",\"-\",\"（\"&TEXT(S35,\"##0.000\")&\"-\"&TEXT(R35,\"##0.000\")&\"）/\"&TEXT(R35,\"##0.000\")&\"=\"&TEXT((S35-R35)/R35*100,\"0.0\")&\"%\"),\"-\")","v":"（0.058-0.039）/0.039=48.7%"},{"$f":"IFERROR(IF(U35=\"-\",\"-\",IF(U35=\"\",\"-\",IF(U35/T35=1,\"△\",IF(U35/T35>1,\"-（\"&ABS(ROUND(100*U35/T35-100,1))&\"％増）\",IF(U35/T35<1,\"○（\"&ABS(ROUND(100*U35/T35-100,1))&\"％減）\",\"\"))))),\"-\")","v":"-（48.2％増）"},{"$f":"IFERROR(IF(T35=\"-\",\"-\",\"（\"&TEXT(U35,\"##0.000\")&\"-\"&TEXT(T35,\"##0.000\")&\"）/\"&TEXT(T35,\"##0.000\")&\"=\"&TEXT((U35-T35)/T35*100,\"0.0\")&\"%\"),\"-\")","v":"（0.058-0.039）/0.039=48.2%"},{"$f":"IFERROR(IF(W35=\"-\",\"-\",IF(W35=\"\",\"-\",IF(W35/V35=1,\"△\",IF(W35/V35>1,\"-（\"&ABS(ROUND(100*W35/V35-100,1))&\"％増）\",IF(W35/V35<1,\"○（\"&ABS(ROUND(100*W35/V35-100,1))&\"％減）\",\"\"))))),\"-\")","v":"-（48.2％増）"},{"$f":"IFERROR(IF(V35=\"-\",\"-\",\"（\"&TEXT(W35,\"##0.000\")&\"-\"&TEXT(V35,\"##0.000\")&\"）/\"&TEXT(V35,\"##0.000\")&\"=\"&TEXT((W35-V35)/V35*100,\"0.0\")&\"%\"),\"-\")","v":"（0.058-0.039）/0.039=48.2%"},{"$f":"IFERROR(IF(Y35=\"-\",\"-\",IF(Y35=\"\",\"-\",IF(Y35/X35=1,\"△\",IF(Y35/X35>1,\"-（\"&ABS(ROUND(100*Y35/X35-100,1))&\"％増）\",IF(Y35/X35<1,\"○（\"&ABS(ROUND(100*Y35/X35-100,1))&\"％減）\",\"\"))))),\"-\")","v":"-（48.2％増）"},{"$f":"IFERROR(IF(X35=\"-\",\"-\",\"（\"&TEXT(Y35,\"##0.000\")&\"-\"&TEXT(X35,\"##0.000\")&\"）/\"&TEXT(X35,\"##0.000\")&\"=\"&TEXT((Y35-X35)/X35*100,\"0.0\")&\"%\"),\"-\")","v":"（0.058-0.039）/0.039=48.2%"},{"$f":"IFERROR(IF(AA35=\"-\",\"-\",IF(AA35=\"\",\"-\",IF(AA35/Z35=1,\"△\",IF(AA35/Z35>1,\"-（\"&ABS(ROUND(100*AA35/Z35-100,1))&\"％増）\",IF(AA35/Z35<1,\"○（\"&ABS(ROUND(100*AA35/Z35-100,1))&\"％減）\",\"\"))))),\"-\")","v":"-（48.2％増）"},{"$f":"IFERROR(IF(Z35=\"-\",\"-\",\"（\"&TEXT(AA35,\"##0.000\")&\"-\"&TEXT(Z35,\"##0.000\")&\"）/\"&TEXT(Z35,\"##0.000\")&\"=\"&TEXT((AA35-Z35)/Z35*100,\"0.0\")&\"%\"),\"-\")","v":"（0.058-0.039）/0.039=48.2%"},{"$f":"IFERROR(IF(AC35=\"-\",\"-\",IF(AC35=\"\",\"-\",IF(AC35/AB35=1,\"△\",IF(AC35/AB35>1,\"-（\"&ABS(ROUND(100*AC35/AB35-100,1))&\"％増）\",IF(AC35/AB35<1,\"○（\"&ABS(ROUND(100*AC35/AB35-100,1))&\"％減）\",\"\"))))),\"-\")","v":"-（266.3％増）"},{"$f":"IFERROR(IF(AB35=\"-\",\"-\",\"（\"&TEXT(AC35,\"##0.000\")&\"-\"&TEXT(AB35,\"##0.000\")&\"）/\"&TEXT(AB35,\"##0.000\")&\"=\"&TEXT((AC35-AB35)/AB35*100,\"0.0\")&\"%\"),\"-\")","v":"（0.143-0.039）/0.039=266.3%"},{"$f":"IFERROR(IF(AE35=\"-\",\"-\",IF(AE35=\"\",\"-\",IF(AE35/AD35=1,\"△\",IF(AE35/AD35>1,\"-（\"&ABS(ROUND(100*AE35/AD35-100,1))&\"％増）\",IF(AE35/AD35<1,\"○（\"&ABS(ROUND(100*AE35/AD35-100,1))&\"％減）\",\"\"))))),\"-\")","v":"-"},{"$f":"IFERROR(IF(AD35=\"-\",\"-\",\"（\"&TEXT(AE35,\"##0.000\")&\"-\"&TEXT(AD35,\"##0.000\")&\"）/\"&TEXT(AD35,\"##0.000\")&\"=\"&TEXT((AE35-AD35)/AD35*100,\"0.0\")&\"%\"),\"-\")","v":"-"},{"$f":"IFERROR(IF(AG35=\"-\",\"-\",IF(AG35=\"\",\"-\",IF(AG35/AF35=1,\"△\",IF(AG35/AF35>1,\"-（\"&ABS(ROUND(100*AG35/AF35-100,1))&\"％増）\",IF(AG35/AF35<1,\"○（\"&ABS(ROUND(100*AG35/AF35-100,1))&\"％減）\",\"\"))))),\"-\")","v":"-"},{"$f":"IFERROR(IF(AF35=\"-\",\"-\",\"（\"&TEXT(AG35,\"##0.000\")&\"-\"&TEXT(AF35,\"##0.000\")&\"）/\"&TEXT(AF35,\"##0.000\")&\"=\"&TEXT((AG35-AF35)/AF35*100,\"0.0\")&\"%\"),\"-\")","v":"-"},{"$f":"IFERROR(IF(AI35=\"-\",\"-\",IF(AI35=\"\",\"-\",IF(AI35/AH35=1,\"△\",IF(AI35/AH35>1,\"-（\"&ABS(ROUND(100*AI35/AH35-100,1))&\"％増）\",IF(AI35/AH35<1,\"○（\"&ABS(ROUND(100*AI35/AH35-100,1))&\"％減）\",\"\"))))),\"-\")","v":"-"},{"$f":"IFERROR(IF(AH35=\"-\",\"-\",\"（\"&TEXT(AI35,\"##0.000\")&\"-\"&TEXT(AH35,\"##0.000\")&\"）/\"&TEXT(AH35,\"##0.000\")&\"=\"&TEXT((AI35-AH35)/AH35*100,\"0.0\")&\"%\"),\"-\")","v":"-"},{"$f":"IFERROR(IF(AK35=\"-\",\"-\",IF(AK35=\"\",\"-\",IF(AK35/AJ35=1,\"△\",IF(AK35/AJ35>1,\"-（\"&ABS(ROUND(100*AK35/AJ35-100,1))&\"％増）\",IF(AK35/AJ35<1,\"○（\"&ABS(ROUND(100*AK35/AJ35-100,1))&\"％減）\",\"\"))))),\"-\")","v":"-（42.9％増）"},{"$f":"IFERROR(IF(AJ35=\"-\",\"-\",\"（\"&TEXT(AK35,\"##0.000\")&\"-\"&TEXT(AJ35,\"##0.000\")&\"）/\"&TEXT(AJ35,\"##0.000\")&\"=\"&TEXT((AK35-AJ35)/AJ35*100,\"0.0\")&\"%\"),\"-\")","v":"（0.056-0.039）/0.039=42.9%"},{"$f":"IFERROR(IF(AM35=\"-\",\"-\",IF(AM35=\"\",\"-\",IF(AM35/AL35=1,\"△\",IF(AM35/AL35>1,\"-（\"&ABS(ROUND(100*AM35/AL35-100,1))&\"％増）\",IF(AM35/AL35<1,\"○（\"&ABS(ROUND(100*AM35/AL35-100,1))&\"％減）\",\"\"))))),\"-\")","v":"-（156.4％増）"},{"$f":"IFERROR(IF(AL35=\"-\",\"-\",\"（\"&TEXT(AM35,\"##0.000\")&\"-\"&TEXT(AL35,\"##0.000\")&\"）/\"&TEXT(AL35,\"##0.000\")&\"=\"&TEXT((AM35-AL35)/AL35*100,\"0.0\")&\"%\"),\"-\")","v":"（0.100-0.039）/0.039=156.4%"},{"$f":"IFERROR(IF(AO35=\"-\",\"-\",IF(AO35=\"\",\"-\",IF(AO35/AN35=1,\"△\",IF(AO35/AN35>1,\"-（\"&ABS(ROUND(100*AO35/AN35-100,1))&\"％増）\",IF(AO35/AN35<1,\"○（\"&ABS(ROUND(100*AO35/AN35-100,1))&\"％減）\",\"\"))))),\"-\")","v":"-"},{"$f":"IFERROR(IF(AN35=\"-\",\"-\",\"（\"&TEXT(AO35,\"##0.000\")&\"-\"&TEXT(AN35,\"##0.000\")&\"）/\"&TEXT(AN35,\"##0.000\")&\"=\"&TEXT((AO35-AN35)/AN35*100,\"0.0\")&\"%\"),\"-\")","v":"-"},{"$f":"IFERROR(IF(AQ35=\"-\",\"-\",IF(AQ35=\"\",\"-\",IF(AQ35/AP35=1,\"△\",IF(AQ35/AP35>1,\"-（\"&ABS(ROUND(100*AQ35/AP35-100,1))&\"％増）\",IF(AQ35/AP35<1,\"○（\"&ABS(ROUND(100*AQ35/AP35-100,1))&\"％減）\",\"\"))))),\"-\")","v":"-（156.4％増）"},{"$f":"IFERROR(IF(AP35=\"-\",\"-\",\"（\"&TEXT(AQ35,\"##0.000\")&\"-\"&TEXT(AP35,\"##0.000\")&\"）/\"&TEXT(AP35,\"##0.000\")&\"=\"&TEXT((AQ35-AP35)/AP35*100,\"0.0\")&\"%\"),\"-\")","v":"（0.100-0.039）/0.039=156.4%"},{"$f":"IFERROR(IF(AS35=\"-\",\"-\",IF(AS35=\"\",\"-\",IF(AS35/AR35=1,\"△\",IF(AS35/AR35>1,\"-（\"&ABS(ROUND(100*AS35/AR35-100,1))&\"％増）\",IF(AS35/AR35<1,\"○（\"&ABS(ROUND(100*AS35/AR35-100,1))&\"％減）\",\"\"))))),\"-\")","v":"○（1.4％減）"},{"$f":"IFERROR(IF(AR35=\"-\",\"-\",\"（\"&TEXT(AS35,\"##0.000\")&\"-\"&TEXT(AR35,\"##0.000\")&\"）/\"&TEXT(AR35,\"##0.000\")&\"=\"&TEXT((AS35-AR35)/AR35*100,\"0.0\")&\"%\"),\"-\")","v":"（0.038-0.039）/0.039=-1.4%"},{"$f":"IFERROR(IF(AU35=\"-\",\"-\",IF(AU35=\"\",\"-\",IF(AU35/AT35=1,\"△\",IF(AU35/AT35>1,\"-（\"&ABS(ROUND(100*AU35/AT35-100,1))&\"％増）\",IF(AU35/AT35<1,\"○（\"&ABS(ROUND(100*AU35/AT35-100,1))&\"％減）\",\"\"))))),\"-\")","v":"-（241.9％増）"},{"$f":"IFERROR(IF(AT35=\"-\",\"-\",\"（\"&TEXT(AU35,\"##0.000\")&\"-\"&TEXT(AT35,\"##0.000\")&\"）/\"&TEXT(AT35,\"##0.000\")&\"=\"&TEXT((AU35-AT35)/AT35*100,\"0.0\")&\"%\"),\"-\")","v":"（0.133-0.039）/0.039=241.9%"},{"$f":"IFERROR(IF(AW35=\"-\",\"-\",IF(AW35=\"\",\"-\",IF(AW35/AV35=1,\"△\",IF(AW35/AV35>1,\"-（\"&ABS(ROUND(100*AW35/AV35-100,1))&\"％増）\",IF(AW35/AV35<1,\"○（\"&ABS(ROUND(100*AW35/AV35-100,1))&\"％減）\",\"\"))))),\"-\")","v":"-（28.2％増）"},{"$f":"IFERROR(IF(AV35=\"-\",\"-\",\"（\"&TEXT(AW35,\"##0.000\")&\"-\"&TEXT(AV35,\"##0.000\")&\"）/\"&TEXT(AV35,\"##0.000\")&\"=\"&TEXT((AW35-AV35)/AV35*100,\"0.0\")&\"%\"),\"-\")","v":"（0.050-0.039）/0.039=28.2%"},{"$f":"IFERROR(IF(AY35=\"-\",\"-\",IF(AY35=\"\",\"-\",IF(AY35/AX35=1,\"△\",IF(AY35/AX35>1,\"-（\"&ABS(ROUND(100*AY35/AX35-100,1))&\"％増）\",IF(AY35/AX35<1,\"○（\"&ABS(ROUND(100*AY35/AX35-100,1))&\"％減）\",\"\"))))),\"-\")","v":"○（48.7％減）"},{"$f":"IFERROR(IF(AX35=\"-\",\"-\",\"（\"&TEXT(AY35,\"##0.000\")&\"-\"&TEXT(AX35,\"##0.000\")&\"）/\"&TEXT(AX35,\"##0.000\")&\"=\"&TEXT((AY35-AX35)/AX35*100,\"0.0\")&\"%\"),\"-\")","v":"（0.020-0.039）/0.039=-48.7%"},{"$f":"IFERROR(IF(BA35=\"／\",\"／\",IF(BA35=\"\",\"／\",IF(BA35/AZ35=1,\"△\",IF(BA35/AZ35>1,\"／（\"&ABS(ROUND(100*BA35/AZ35/100,1))&\"％増）\",IF(BA35/AZ35<1,\"○（\"&ABS(ROUND(100*BA35/AZ35/100,1))&\"％減）\",\"\"))))),\"／\")","v":"／"},{"$f":"IFERROR(IF(AZ35=\"／\",\"／\",\"（\"&TEXT(BA35,\"##0.000\")&\"／\"&TEXT(AZ35,\"##0.000\")&\"）/\"&TEXT(AZ35,\"##0.000\")&\"=\"&TEXT((BA35/AZ35)/AZ35*100,\"0.0\")&\"%\"),\"／\")","v":"／"}]
[null,null,"判定の凡例\n○：従来技術より優れる\n△：従来技術と同程度\n-：上記以外",null,"品質・出来形","-：⑮並びに、総括：㉒耐久性に記載",null,"○：亜硝酸リチウムによる鉄筋防錆効果、ASR膨張抑制効果を付与",null,"-：⑮並びに、総括：㉒耐久性に記載",null,"-：⑮並びに、総括：㉒耐久性に記載",null,"-：⑮並びに、総括：㉒耐久性に記載",null,"-：⑮並びに、総括：㉒耐久性に記載",null,"-：⑮並びに、総括：㉒耐久性に記載",null,"-：⑮並びに、総括：㉒耐久性に記載",null,"-：⑮並びに、総括：㉒耐久性に記載",null,"-：⑮並びに、総括：㉒耐久性に記載",null,"-：⑮並びに、総括：㉒耐久性に記載",null,"-：⑮並びに、総括：㉒耐久性に記載",null,"-：⑮並びに、総括：㉒耐久性に記載",null,"-：⑮並びに、総括：㉒耐久性に記載",null,"-：⑮並びに、総括：㉒耐久性に記載",null,"-：⑮並びに、総括：㉒耐久性に記載",null,"-：⑮並びに、総括：㉒耐久性に記載",null,"-：⑮並びに、総括：㉒耐久性に記載",null,"-：⑮並びに、総括：㉒耐久性に記載",null,"-：⑮並びに、総括：㉒耐久性に記載",null,"-：⑮並びに、総括：㉒耐久性に記載",null,"-：⑮並びに、総括：㉒耐久性に記載",null,"-：⑮並びに、総括：㉒耐久性に記載",null,"／"]
[null,null,null,null,"安全性","△：従来技術と同程度",null,"△：従来技術と同程度",null,"△：従来技術と同程度",null,"-",null,"△：従来技術と同程度",null,"△：従来技術と同程度",null,"△：従来技術と同程度",null,"△：従来技術と同程度",null,"△：従来技術と同程度",null,"△：従来技術と同程度",null,"△：従来技術と同程度",null,"△：従来技術と同程度",null,"△：従来技術と同程度",null,"△：従来技術と同程度",null,"-：注入剤を高圧注入するため、作業手順を間違うと注入剤を飛散させることがあり、第三者に影響がある現場では取り扱いに注意を要する。",null,"△：従来技術と同程度",null,"△：従来技術と同程度",null,"△：従来技術と同程度",null,"△：従来技術と同程度",null,"△：従来技術と同程度",null,"△：従来技術と同程度",null,"△：従来技術と同程度",null,"△：従来技術と同程度",null,"／"]
[null,null,null,null,"施工性","△：従来技術と同程度",null,"△：従来技術と同程度",null,"○：ひび割れ幅が0.3mm以下のコンクリート構造物のひび割れに塗布のみで施工可能",null,"○：鉛直面でひび割れ幅0.05mm以上0.8mm以下、上向きで0.05mm以上0.5mm以下のひび割れに塗布のみで施工可能",null,"○：鉛直面でひび割れ幅0.05mm以上0.8mm以下、上向きで0.05mm以上0.5mm以下のひび割れに塗布のみで施工可能",null,"○：流水量の少ない漏水個所に適用可能",null,"○：湿潤状態に適用可能、-5.0℃以上に適用可能",null,"△：従来技術と同程度",null,"○：特にひび割れの進行が見込まれる場合、また温度の影響でひび割れ幅が伸縮している場合に適する。",null,"○：揺変性を付与しているのでダレにくい。柔軟性に優れ５０％の伸びを有する。",null,"○：コンクリート湿潤面や鋼材に対する接着性に優れる｡",null,"○：逆止弁が設置してある高圧注入止水用プラグを使用するため、止水作業が簡単である",null,"○：ひび割れ内部に水が残存していたり、湿潤面でも注入が可能である。",null,"○：ひび割れ内部に水が残存していたり、湿潤面でも注入が可能である。",null,"○ ：湿潤面に適用可、漏水箇所に適用可（流出水が多い場合は高吸水性樹脂の少量添加等を検討）",null,"○：ひび割れ幅0.01mmまで充填が可能。湿潤面・漏水箇所での施工が可能。",null,"○：・2液混合の自硬時間は200秒(20℃)と速硬性を有し、作業時間の低減が可能。",null,"△：従来技術と同程度",null,"○：ひび割れ、止水状況に応じて粘性度の調整が可能となるため、幅のあるひび割れ幅(0.15mm～2.0mm)について対応範囲が広がる",null,"○：自動注入の為、常時注入の必要がなく施工性が向上",null,"○：潤滑面や漏水背面の水圧が高い箇所への適用が可能",null,"○：注入座金の設置が不要であり、シールテープの撤去も容易なため、施工性は向上する",null,"○：補修箇所への注入方法は、刷毛やローラによる塗布作業のみであり作業が簡易となる。",null,"／"]
[null,null,null,null,"環境","△：従来技術と同程度",null,"○：低圧注入機は分解可能なため再注入やリサイクルが可能",null,"△：従来技術と同程度",null,"-",null,"△：従来技術と同程度",null,"△：従来技術と同程度",null,"△：従来技術と同程度",null,"△：従来技術と同程度",null,"△：従来技術と同程度",null,"△：従来技術と同程度",null,"△：従来技術と同程度",null,"△：従来技術と同程度",null,"△：従来技術と同程度",null,"△：従来技術と同程度",null,"-：ゲル化時間が従来工法より長いため、作業完了後も注入材落下の危険があるため落下防止養生等の作業が必要である（評価情報より）。",null,"△：従来技術と同程度",null,"△：従来技術と同程度",null,"△：従来技術と同程度",null,"△：従来技術と同程度",null,"△：従来技術と同程度",null,"△：従来技術と同程度",null,"△：従来技術と同程度",null,"○：圧入器具やシール材が不要となり、産業廃棄物が減少する。",null,"／"]
[null,"⑮","試験項目",null,"ひび割れ補修材料","-","CSパテ","-","MCRアーマ＃600（他社（三菱マテリアル株式会社）の製品のため参考値）","-","ショーボンド　グラウトLV（通年用）","-","アルファテック388S","-","アルファテック388W","-","-","-","ADOX1380WH","-","ショーボンド　BLグラウト（夏用・冬用）","-","ショーボンド　BLグラウト100（夏用・冬用）","-","ショーボンド　DDグラウト50（通年用）","-","ショーボンド　WBグラウト（通年用）","-","アルファー・ゾル-G（ゲル化剤の添加率：原液換算で5％）","-","ハイスタッフ（水比70％）","-","ハイスタッフZ（水比70％）","-","ビトグラウト-N","-","IPH E-396H","-","特殊水性エマルション ミクストグラウト主剤+親水性ポリウレタン樹脂 ミクストグラウト硬化剤","-","A剤(バクテリア・乳酸カルシウム)+B剤(反応促進剤)","-","アウターシール主剤(ケイ酸系)+アウターシールB促進剤(カルシウム化合物)","-","エポキシ樹脂","-","ポリウレタン樹脂","-","エポキシ樹脂（AT-50）","-","アクリル系樹脂注入材","／","／"]
[null,null,null,null,"試験規格","適用基準　自社規格","新技術の試験結果","-","新技術の試験結果","適用基準旧建設省土木補修用エポキシ樹脂注入材1種","新技術の試験結果","適用基準JISA6024「建築補修用注入エポキシ樹脂」硬質形エポキシ樹脂　低粘度形","新技術の試験結果","適用基準JISA6024「建築補修用注入エポキシ樹脂」硬質形エポキシ樹脂　低粘度形","新技術の試験結果","-","新技術の試験結果","適用基準　JISA6024　硬質系エポキシ樹脂低粘度系（NEXCO　エポキシ樹脂系ひび割れ注入材の品質規格1種）","新技術の試験結果","適用基準旧建設省土木補修用エポキシ樹脂注入材1種","新技術の試験結果","適用基準旧建設省土木補修用エポキシ樹脂注入材3種","新技術の試験結果","適用基準旧建設省土木補修用エポキシ樹脂注入材2種","新技術の試験結果","適用基準旧建設省土木補修用エポキシ樹脂注入材1種","新技術の試験結果","適用基準","新技術の試験結果","適用基準　自社基準","新技術の試験結果","適用基準　自社基準","新技術の試験結果","適用基準　自社規格","新技術の試験結果","適用基準　旧建設省土木補修用エポキシ樹脂注入材1種（JISA6024硬質系エポキシ樹脂低粘度形）","新技術の試験結果","適用基準　自社規格","新技術の試験結果","-","新技術の試験結果","適用基準　自社規格","新技術の試験結果","-","新技術の試験結果","自社基準　従来技術「1液型ポリウレタン樹脂注入工法」","新技術の試験結果","適用基準　JISA6024　硬質系エポキシ樹脂低粘度系（NEXCO　エポキシ樹脂系ひび割れ注入材の品質規格1種）","新技術の試験結果","NEXCO構造物施工管理要領「ひび割れ注入工法用エポキシ樹脂系ひび割れ注入材の品質規格」","新技術の試験結果","／","新技術の試験結果"]
[null,null,"補修材料の性能\n\n判定の凡例\n○：基準を満足\n△：基準と同程度\n－：上記以外","粘性",null,"-","-","-","-","粘度1000mPa・s以下","145mPa・s","粘度100～1000mPa・s","﻿600mPa・s   ","粘度100～1000mPa・s","﻿600mPa・s   ","-","-","100～1,000mPa・s","330mPa・s","粘度1000mPa・s以下",620,"粘度1000mPa・s以下",410,"チキソトロピック係数　4±1","チキソトロピック係数　4","粘度1000mPa・s以下",688,"-","-","100mPa・ｓ以下","49mPa・ｓ","100mPa・ｓ以下","34mPa・ｓ","12000±2000CPS（=mPa・s）","12100mPa・s","粘度1000mPa・s以下　（100～1000mPa・s）","666mPa・s　（686mPa・s）","主剤：粘度（20℃）：170±60mpa.s、硬化剤：粘度（20℃）：400±60mpa.s","147mPa・s（主剤）　500mPa・s(硬化剤）","-","-","-","-","-","-","-","（100～300mPa・s）","100～1,000mPa・s","320mPa・s","100～1000mPa・s","132mPa・s（JIS K 6833-1）","／","／"]
[null,null,null,"モルタル付着強度\n（接着強度）\n（N/mm2）","標準（乾燥）","-","-","-","-","6N/mm2以上","6.8N/mm2","6N/mm2以上","8.7N/mm2（セメントモルタル基材破壊）  ","6N/mm2以上","8.5N/mm2（セメントモルタル基材破壊）  ","-","-","6.0N/m㎡以上","8.1N/m㎡","6N/mm2以上","8N/mm2","6N/mm2以上","9.8N/mm2","6N/mm2以上","8.9N/mm2","6N/mm2以上","10.6N/mm2","規格値は未確定","1.42N/mm2（下地：コンクリート、被着体：コンクリート）","-","1.5N/mm2","-","2.2N/mm2","1.05±0.23N/mm2","1.14N/mm2（コンクリート対コンクリート）","6N/mm2以上　（6N/mm2以上）","8.0N/mm2　（7.4N/mm2）","-","1.36N/mm2（乾燥面）","-","-","-","-","-","-","0.29N/mm2","（0.48N/mm2）","6.0N/m㎡以上",8.5,"6N/m㎡以上","7.1N/m㎡（JSCE-K-541）","／","／"]
[null,null,null,null,"低温時","-","-","-","-","-","-","-","-","3N/mm2以上","6.0N/mm2（セメントモルタル基材破壊）  ","-","-","3.0N/m㎡以上","7.5N/m㎡","-","-","-","-","-","-","-","-","-","-","-","-","-","-","-","-","-","-","-","-","-","-","-","-","-","-","-","-","3.0N/m㎡以上",8.1,"3N/m㎡以上","-","／","／"]
[null,null,null,null,"湿潤時","-","-","-","-","-","（5.2N/mm2）","3N/mm2以上","4.5N/mm2（セメントモルタル基材破壊）  ","3N/mm2以上","4.5N/mm2（セメントモルタル基材破壊）  ","-","-","3.0N/m㎡以上","7.2N/m㎡","-","-","-","-","-","-","-","（6.4N/mm2（モルタル破壊））","-","-","-","-","-","-","-","-","（3N/mm2以上）","（7.3N/mm2）","-","0.87N/m㎡","-","-","-","-","-","-","-","-","3.0N/m㎡以上",8.1999999999999993,"3N/m㎡以上","6.4N/m㎡（JSCE-K-541）","／","／"]
[null,null,null,null,"乾湿繰返し時","-","-","-","-","-","-","3N/mm2以上","4.0N/mm2（セメントモルタル基材破壊）  ","3N/mm2以上","4.0N/mm2（セメントモルタル基材破壊）  ","-","-","3.0N/m㎡以上","7.6N/m㎡","-","-","-","-","-","-","-","-","-","-","-","-","-","-","-","-","（3N/mm2以上）","（8.7N/mm2）","-","-","-","-","-","-","-","-","-","-","3.0N/m㎡以上",7.9,"3N/m㎡以上","6.3N/m㎡（JSCE-K-541）","／","／"]
[null,null,null,"硬化収縮率（％）","（型・試験片の寸法差）","-","-","-","-","0.1%以下",0,"-","-","-","-","-","-","-","-","0.1%以下",0,"0.1%以下","-","0.1%以下",1E-3,"0.1%以下",0,"-","-","-","-","-","-","-","-","0.1%以下","-","-","材齢28日：28.7%","-","-","-","-","-","-",0.80700000000000005,0.75900000000000001,"-",1.4999999999999999E-2,"3％以下","2.5％（JIS A 6024）","／","／"]
[null,null,null,null,"（固体・液体時の密度差）","-","-","-","-","-","-","3%以下",1.2999999999999999E-2,"3%以下",1.4999999999999999E-2,"-","-","3%以下",0.02,"-","-","-","-","-","-","-","-","-","-","-","-","-","-","-","-","（3%以下）",0.02,"-","-","-","-","-","-","-","-","-","-","3%以下","-","3％以下","2.5％（JIS A 6024）","／","／"]
[null,null,null,"引張強度（N/mm2）",null,"1.0N/mm2（一般的な新旧コンクリートの付着強度）","1.73N/mm2（建研式接着力試験器）","-","-","-","（30N/mm2）","15N/mm2以上","15N/mm2","15N/mm2以上","20N/mm2","-","-","15.0N/m㎡以上","35.3N/m㎡","-","（7日：58.5N/mm2）","-","-","-","-","-","（7日：88.6N/mm2）","規格値は未確定","0.29N/mm2","-","-","-","-","-","0.65N/mm2（20℃）","（15N/mm2以上）","（42.7N/mm2）","0.70N/mm2以上","1.11N/m㎡","-","-","-","-","-","-","1.31N/mm2","1.51N/mm2","15.0N/m㎡以上",30,"15.0N/m㎡以上","43.4N/m㎡（JSCE-K-541）","／","／"]
[null,null,null,"伸び率（％）",null,"-","-","-","-","-","-","引張破壊伸び10％以下",9.5000000000000001E-2,"引張破壊伸び10％以下",7.0000000000000007E-2,"-","-","10%以下",0,"-","-","100％以上",1.88,"50％以上",0.57999999999999996,"-","-","規格値は未確定",3,"-","-","-","-","-","600％（20℃）","（引張破壊伸び10％以下）",0.05,"300%以上",3.62,"-","-","-","-","-","-",4.5999999999999996,4.5999999999999996,"10%以下",5.8000000000000003E-2,"10％以下","3％（JSCE-K-541）","／","／"]
[null,null,null,"圧縮強度（N/mm2）",null,"24N/mm2（一般的なコンクリートの圧縮強度）","36.2N/mm2（JIS A1108）","-","36.7N/mm2","-","（60N/mm2）","-","35N/mm2（JISK7208）","-","40N/mm2（JISK7208）","-","-","-","-","-","（7日：78.9N/mm2）","-","-","-","-","-","（7日：89.6N/mm2）","-","-","27N/mm2以上（材齢28日）","32.0N/mm2（JISR5201）","24N/mm2以上（材齢28日）","32.6N/mm2（JISR5201）","-","-","-","57N/mm2（JISK7181）","-","-","-","-","-","-","-","-","-","-","-",60,"-","-","／","／"]
[null,null,null,"可使時間",null,"-","5分（20℃）","-","-","30分以上","134分","-","60分（20℃）","-","30分（20℃）","-","-","-","-","30分以上","180分","30分以上","69分","30分以上","49分","30分以上","114分","-","ゲル化剤の添加率による　添加率5％で4時間程度でゲル化","-","-","-","ゲルタイム27分","-","120分","30分以上","88分","400秒（20℃）以内","3分43秒（223秒）（20℃）","-","-","-","2液攪拌後　60分間程度","-","-","-","-","-","30分","30分以上","30～120分（JSCE-K-541）","／","／"]
[null,null,null,"硬化時間",null,"-","2時間（20℃）","-","-","16時間以内","6時間","-","24時間","-","24時間","-","-","-","-","16時間以内","13時間","24時間以内","14時間","16時間以内","15時間","16時間以内","7時間","-","ゲル化剤の添加率による　添加率5％で6時間程度で硬化","-","-","-","-","-","4時間","16時間以内","16時間","-","15～20分","-","-","-","-","-","-","-","（20～60秒）","-","-","16時間以下","0.5～3.5時間（ドライングコーダー）","／","／"]
[null,null,null,"付着力耐久性保持率（％）",null,"-","-","-","-","60%以上",1.25,"-","-","-","-","-","-","（60%以上）",0.94,"60%以上",0.93,"60%以上",1.37,"60%以上",1.48,"60%以上",0.84,"-","-","-","-","-","-","-","-","60%以上",1.24,"-","-","-","-","-","-","-","-","-","-","（60%以上）",0.76,"60％以上","90％（JSCE-K-541）","／","／"]
[null,null,"その他の試験",null,null,"建研式接着力試験器による引張強度試験、JIS A1108「コンクリートの圧縮強度試験方法」\n促進中性化試験：未処理に対してひび割れ内部の中性化が抑制されていることを確認（自社試験）",null,"浸透確認試験：コア試料のひび割れ位置から周辺にかけて亜硝酸リチウムの浸透による変色が認められる（自社試験）\n透水量試験（浸透量試験）：亜硝酸リチウムの浸透性能は既存製品に対して25％程度向上（自社試験）",null,"-",null,"NEXCO構造物施工管理要領「プライマーひびわれ含浸性能の照査項目」におけるひび割れ接着強さの規格値2.0N/mm2以上に対して2.9N/mm2（コンクリート基材破壊）（自社試験）",null,"NEXCO構造物施工管理要領「プライマーひびわれ含浸性能の照査項目」におけるひび割れ接着強さの規格値2.0N/mm2以上に対して2.9N/mm2（コンクリート基材破壊）（自社試験）",null,"透水性試験：無処理での透水率：51.62ｍｌ/㎡・日に対してSKY-MX：3.63ｍｌ/㎡・日（自社試験） \n中性化試験：無処理での中性化深さ増加量：平均5.4mmに対してSKY-SP：平均3.4mm（公的機関）",null,"セメントペースト中の塩分吸着効果の検証：セメントペースト中の塩分が減少し、ハイブリッドエポキシ樹脂に吸着されたことを確認\n鉄筋腐食抑制効果の検証：鉄筋の分極抵抗及び自然電位の増大を確認",null,"-",null,"-",null,"-",null,"-",null,"吸水率試験：吸水率は0％（自社試験）\n耐薬品性試験（20℃、7日間）：水道水、海水、酢酸等では異常なし、A重油、硫酸、塩酸等にはやや不良（自社試験）",null,"-",null,"-",null,"耐薬品性試験（20℃、7日間）：水道水、海水、酢酸等では異常なし、A重油、硫酸、塩酸等にはやや不良（自社試験）\n吸水率試験：吸水率は0％（自社試験）",null,"-",null,"・枡型試験体ひび割れ部の止水試験：従来工法で必要な先行水注入作業を不要とした施工により、止水効果を確認　・JWWAZ108:2016による浸出試験：浸出試験45項目全てに適合\n・枡型試験体の変形追従性確認試験：ひび割れ注入部の開き1.57mmまで止水状態を保ち、従来工法（同：0.31mm）と比べて約5倍の変形追従性を有していることを確認",null,"透水量試験（自社試験）を実施し、透水比54.1%を確認（自社試験）\n吸水率試験（自社試験）を実施し、吸水比45.3%を確認。中性化試験を実施し、中性化深さ比28%を確認。",null,"無機系止水材の性能評価試験を実施し、ひび割れ幅が0.15mm～2.0mmで水圧0.3MPaの止水を確認\nアルカリ性の付与試験を実施し30分経過後ゲル化進行を確認",null,"加圧力試験：試料を横置きにし、水を25ｍｌ注入した場合の加圧力を測定し、平均0.114N/m㎡を確認。",null,"耐水圧試験（1MPa・連続1000時間）：連続1200時間漏水なし",null,"-",null,"ひび割れ含浸材料の試験（NEXCO試験法426）：ひび割れ幅0.5㎜を設定した供試体5体に曲げ試験を実施し、曲げ強度の規格値2.0N/㎜2以上に対して、平均3.56N/㎜2を確認（自社試験）。\n含浸深さ：供試体5体に含浸深さの確認を実施し、5体ともに塗布面の反対側まで含浸しており、100㎜（供試体高さ）の含浸深さを確認（自社試験）。",null,"／"]
[null,"⑯","実施している性能評価試験",null,null,"JSCE-K572「けい酸塩系表面含浸材の試験方法（案）」：反応性確認試験\n反応性確認試験（JSCE-K572）：試験管内でのセメントペースト供試体（5^3mm3×5個）によるCS-21クリアーによるコンクリートの空隙充填効果の確認（自社試験）",null,"JSCE-K571「表面含浸材の試験方法（案）」の透水量試験に準じた浸透量試験",null,"建設省総合技術開発プロジェクト「注入材と充てん材の品質規格」に準じた試験方法",null,"JISA6024「建築補修用注入エポキシ樹脂」に準じた試験方法\nNEXCO構造物施工管理要領「プライマーひびわれ含浸性能の照査項目」に準じた試験方法",null,"JISA6024「建築補修用注入エポキシ樹脂」に準じた試験方法\nNEXCO構造物施工管理要領「プライマーひびわれ含浸性能の照査項目」に準じた試験方法",null,"-",null,"JISA6024「建築補修用エポキシ樹脂」\nNEXCO構造物施工管理要領「ひび割れ注入工法用エポキシ樹脂系ひび割れ注入材の品質規格」",null,"旧建設省総合技術開発プロジェクト「注入材と充てん材の品質規格」に準じた試験方法",null,"旧建設省総合技術開発プロジェクト「注入材と充てん材の品質規格」に準じた試験方法",null,"旧建設省総合技術開発プロジェクト「注入材と充てん材の品質規格」に準じた試験方法",null,"旧建設省総合技術開発プロジェクト「注入材と充てん材の品質規格」に準じた試験方法",null,"JISA1404「建築用セメント防水剤の試験方法」に準拠した吸水率試験",null,"JISR5201「セメントの物理試験方法」等",null,"JISR5201「セメントの物理試験方法」等",null,"建研式引張試験機による接着強さ試験\nJISA1404「建築用セメント防水剤の試験方法」に準拠した吸水率試験",null,"建設省総合技術開発プロジェクト「注入材と充てん材の品質規格」に準じた試験方法\nJISA6024「建築補修用注入エポキシ樹脂」に準じた試験方法",null,"-",null,"-",null,"無機系止水材の性能評価試験",null,"-",null,"-",null,"-",null,"NEXCO構造物施工管理要領「ひび割れ注入工法用エポキシ樹脂系ひび割れ注入材の品質規格」",null,"／"]
[null,"⑰","耐用年数",null,null,"3年（実績）",null,"実績15～20年程度",null,"-",null,"-",null,"-",null,"-",null,"-",null,"-",null,"-",null,"-",null,"-",null,"-",null,"-",null,"-",null,"-",null,"-",null,"-",null,"-",null,"-",null,"-",null,"-",null,"-",null,"-",null,"／"]
[null,"⑱","施工実績\n（過去３年）",null,"国土交通省：活用効果調査表数","7件（九州で0件）",null,"23件（九州で14件）",null,"16件(九州で2件）",null,"8件（九州で0件）",null,"8件（九州で0件）",null,"0件（九州で0件）",null,"1件（九州で0件）",null,"62件（九州で7件）",null,"62件（九州で7件）",null,"62件（九州で7件）",null,"62件（九州で7件）",null,"28件（九州で14件）",null,"34件（九州で32件）",null,"34件（九州で32件）",null,"31件（九州で3件）",null,"6件（九州で2件）",null,"0件（九州で0件）",null,"0件（九州で0件）",null,"0件（九州で0件）",null,"1件（九州で1件）",null,"0件（九州で0件）",null,"2件（九州で0件）",null,"0件(九州で0件)",null,"／"]
[null,null,null,null,"地方自治体：開発者ヒアリング","31件（九州で7件）",null,"229件（九州で52件）",null,"205件（九州で16件）",null,"23件（九州で3件）",null,"23件（九州で3件）",null,"未回答",null,"10件（九州で1件）",null,"338件（九州で19件）",null,"338件（九州で19件）",null,"338件（九州で19件）",null,"338件（九州で19件）",null,"54件（九州で5件）",null,"250件（九州で25件）",null,"250件（九州で25件）",null,"未回答",null,"355件（九州で58件）",null,"28件（九州で1件）",null,"2件（九州で0件）",null,"5件（九州で0件）",null,"16件（九州で12件）",null,"8件（九州で0件）",null,"4件（九州で0件）",null,"1件（九州で1件）",null,"／"]
[null,null,null,null,"その他：開発者ヒアリング","189件（九州で14件）",null,"9件（九州で1件）",null,"14件（九州で0件）",null,"88件（九州で3件）",null,"88件（九州で3件）",null,"未回答",null,"0件（九州で0件）",null,"14件（九州で0件）",null,"14件（九州で0件）",null,"14件（九州で0件）",null,"14件（九州で0件）",null,"29件（九州で0件）",null,"250件（九州で25件）",null,"250件（九州で25件）",null,"未回答",null,"41件（九州で4件）",null,"96件（九州で1件）",null,"7件（九州で0件）",null,"50件（九州で0件）",null,"7件（九州で0件）",null,"0件（九州で0件）",null,"1件（九州で0件）",null,"12件（九州で4件）",null,"／"]
[null,"⑲","特許等","特許",null,"第5379413号「コンクリートの補修方法」",null,"-",null,"-",null,"-",null,"-",null,"-",null,"-",null,"第2875985号「接着剤注入装置への接着剤の充填方法及び接着剤注入装置用ストレーナー」第2875986号「接着剤注入装置」",null,"第2875985号「接着剤注入装置への接着剤の充填方法及び接着剤注入装置用ストレーナー」第2875986号「接着剤注入装置」",null,"第2875985号「接着剤注入装置への接着剤の充填方法及び接着剤注入装置用ストレーナー」第2875986号「接着剤注入装置」",null,"第2875985号「接着剤注入装置への接着剤の充填方法及び接着剤注入装置用ストレーナー」第2875986号「接着剤注入装置」",null,"-",null,"-",null,"-",null,"-",null,"第5074118号「コンクリート構造物への注入充填材の注入工法、および注入工法に使用する注入器」",null,"第6171438号「セメント系組成体製構造物の止水工法」",null,"-",null,"-",null,"-",null,"特開2020-186644：止水注入剤",null,"第6555717号：「被覆シーリング用粘着テープ又はシート」",null,"-",null,"／"]
[null,null,null,"建設技術審査証明",null,"-",null,"-",null,"-",null,"-",null,"-",null,"-",null,"-",null,"-",null,"-",null,"-",null,"-",null,"-",null,"-",null,"-",null,"-",null,"-",null,"-",null,"-",null,"-",null,"-",null,"-",null,"-",null,"-",null,"／"]
[null,"⑳","生産供給体制（機械保有台数等）",null,null,"技術提供可能地域：全国（特殊な機械等は不要）",null,"-",null,"技術提供可能地域：全国。特殊な機械は不要。",null,"-",null,"-",null,"未回答",null,"技術提供可能地域：全国",null,"技術提供可能地域：全国。特殊な機械は不要。",null,"技術提供可能地域：全国。特殊な機械は不要。",null,"技術提供可能地域：全国。特殊な機械は不要。",null,"技術提供可能地域：全国。特殊な機械は不要。",null,"-",null,"-",null,"-",null,"未回答",null,"水循環型穿孔用電気ドリル（IPHﾐｽﾄﾀﾞｲﾔ）九州内37台/九州外297台、吸塵付ﾃﾞｨｽｸｸﾞﾗｲﾝﾀﾞ（VDRﾀﾞｲﾔﾓﾝﾄﾞ吸塵ｼｽﾃﾑ）九州内26台/九州外263台",null,"生産供給体制：全国、機械保有台数：0台",null,"-",null,"施工代理店",null,"-",null,"技術提供可能地域：全国",null,"-",null,"技術提供可能地域：全国　汎用機械により供給(練り混ぜ)可能",null,"／"]
[null,"㉑","備考",null,null,"・美観の回復が必要ない場合には、「コンクリート改質剤CS-21（CB-020055-V）」（表面含浸材）を適用可能。",null,"・本技術の注入材は、同社の既NETIS登録技術のである材料（亜硝酸リチウム）と他社の材料とを使用しているため、本技術は低圧注入機（リハビリシリンダー）に加えて、亜硝酸リチウムを先行注入する一連の施工方法を対象とした新技術である（ただし使用する注入材はMCRアーマ＃600（三菱マテリアル株式会社）相当の超微粒子セメント系注入材である）。",null,"・補修材料（ショーボンド　グラウトLV）自体はひび割れ注入工法で使用可能（ショーボンドCAP工法としてはひび割れ被覆工法（塗布浸透））。",null,"                                             　　　　　　　　　　　　　　　               -",null,"                                             　　　　　　　　　　　　　　　               -",null,"注意事項：複数の用途の異なる製品仕様（SKY-SP：けい酸塩系含浸材、SKY-G1：カルシウム系混和剤、SKY-MX：シリコーン系含浸防水剤、SKY-CSP：超微粉末シリカ配合高炉スラグセメント等）が、1技術としてNETISに登録されているため、活用に当たっては各現場ごとの用途について事前に開発者に問合せを行うものとする。",null,"                                             　　　　　　　　　　　　　　　             -",null,"注意事項：複数の製品仕様が1技術としてNETISに登録されているため、活用に当たっては各現場ごとの用途について事前に開発者に問合せを行うものとする。",null,"注意事項：複数の製品仕様が1技術としてNETISに登録されているため、活用に当たっては各現場ごとの用途について事前に開発者に問合せを行うものとする。",null,"注意事項：複数の製品仕様が1技術としてNETISに登録されているため、活用に当たっては各現場ごとの用途について事前に開発者に問合せを行うものとする。",null,"注意事項：複数の製品仕様が1技術としてNETISに登録されているため、活用に当たっては各現場ごとの用途について事前に開発者に問合せを行うものとする。",null,"・注入に際し10mm程度の小径の注入プラグを躯体へ取付けるため穿孔穴が必要となる。\n・材料が背面へ漏出したりジャンカ部に入り、使用数量が大幅に増加する場合は、別途協議の必要がある。",null,"躯体への注入孔の穿孔が必要となるケースもある（用いる注入器具による)。",null,"躯体への注入孔の穿孔が必要となるケースもある（用いる注入器具による)。",null,"                                             　　　　　　　　　　　　　　　               -",null,"・網状なひび割れの場合、断面注入（36孔/㎡）する場合がある。\n・コンクリート断面が欠損している場合、断面修復後、断面注入（36孔/㎡）する場合がある。",null,"・止水作業に際して、漏水と混ざった白濁水が発生する。施工環境によっては予め濁水処理を含めた施工計画の検討を要する場合がある。\n・温水(40℃以上) に直接触れる場合には、本工法の採用は不可。",null,"2～3回塗布することで最大0.6mmまでひび割れを修復することができる。",null,"-",null,"・本技術はコンクリートひび割れ注入（エポキシ樹脂）において、低圧注入を自動で行える注入器の工法技術である。",null,"-",null,"-",null,"-",null,"／"]
["総括","㉒","耐久性",null,null,"・本工法の補修材料の一つであるCSパテの、建研式接着力試験器による引張強度は1.73N/mm2であり、自社基準である一般的な新旧コンクリートの付着強度1.0N/mm2以上を満足している（NETIS情報、補完情報より）。\n・本工法の補修材料の一つであるCSパテの圧縮強度は36.2N/mm2であり、自社基準である一般的なコンクリートの圧縮強度24N/mm2以上を満足している（NETIS情報、補完情報より）。\n・中性化促進試験において、ひび割れに対して直角方向に割った供試体内部の中性化範囲は補修を行っていない供試体より小さい（補完情報より）。",null,"・亜硝酸リチウムの浸透確認試験において、採取したコア試料のひび割れ位置から周辺にかけて亜硝酸リチウムの浸透による変色が認められる（NETIS情報より）。\n・亜硝酸リチウムの透水量試験（浸透量試験）において亜硝酸リチウムの浸透性能は既存製品に対して25％程度向上している。",null,"・旧建設省総合技術開発プロジェクト「注入材と充てん材の品質規格」に準じた試験を実施し、粘度1000mPa・s以下、モルタル付着強度6N/mm2以上、硬化収縮0.1%以下、可使時間30分以上、硬化時間16時間以内、付着力耐久性保持率60%以上の基準を満足しており、土木補修用エポキシ樹脂注入材1種の品質規格に適合している（補完情報より）。",null,"・JISA6024「建築補修用注入エポキシ樹脂」に準じた試験を実施し、粘度100～1000mPa・s、接着強度6N/mm2以上（湿潤時等3N/mm2以上）、硬化収縮率3％以下、引張強度15N/mm2以上、引張破壊伸び10％以下等の基準を満足しており、硬質系エポキシ樹脂低粘度形の品質規格に適合している（補完情報より）。\n・NEXCO構造物施工管理要領「プライマーひびわれ含浸性能の照査項目」に規定された試験を実施し、ひび割れ接着強度2N/mm2以上の基準を満足している（補完情報より）。",null,"・JISA6024「建築補修用注入エポキシ樹脂」に準じた試験を実施し、粘度100～1000mPa・s、接着強度6N/mm2以上（湿潤時等3N/mm2以上）、硬化収縮率3％以下、引張強度15N/mm2以上、引張破壊伸び10％以下等の基準を満足しており、硬質系エポキシ樹脂低粘度形の品質規格に適合している（補完情報より）。\n・NEXCO構造物施工管理要領「プライマーひびわれ含浸性能の照査項目」に規定された試験を実施し、ひび割れ接着強度2N/mm2以上の基準を満足している（補完情報より）。",null,"・本工法の補修材料であるSKY-SPは、中性化試験において、無処理での中性化深さ増加量平均5.4mmに対して平均3.4mmであり、中性化抑制効果が認められる（NETIS、補完情報より）。\n\n・本工法の補修材料であるSKY-MXは、透水性試験において無処理での透水率51.62ｍｌ/㎡・日に対して3.63ｍｌ/㎡・日であり、透水抑制効果が認められる（補完情報より）。",null,"・JISA6024「建築補修用注入エポキシ樹脂」に準じた試験を実施し、硬質形エポキシ樹脂低粘度系の、粘度100～1000mPa・s、付着強度6.0N/m㎡以上（低温、湿潤、乾湿繰返し時3.0N/m㎡以上）、硬化収縮率3％以下、引張強度15.0N/m㎡以上、引張破壊伸び10%以下の基準を満足している（NETIS情報、補完情報より）。\n・［防錆性］：セメントペースト中の塩分吸着効果の検証、鉄筋腐食抑制効果の検証において、防錆性が認められる（NETIS情報より）。",null,"・本工法の補修材料であるBLグラウトは、旧建設省総合技術開発プロジェクト「注入材と充てん材の品質規格」に準じた試験を実施し、粘度1000mPa・s以下、モルタル付着強さ6N/mm2以上、硬化収縮0.1%以下、可使時間30分以上、硬化時間16時間以内、付着力耐久性保持率60%以上の基準を満足しており、土木補修用エポキシ樹脂注入材1種の品質規格に適合している（補完情報より）。",null,"・本工法の補修材料であるBLグラウトは、旧建設省総合技術開発プロジェクト「注入材と充てん材の品質規格」に準じた試験を実施し、粘度1000mPa・s以下、モルタル付着強さ6N/mm2以上、硬化収縮0.1%以下、伸び率100%以上、可使時間30分以上、硬化時間24時間以内、付着力耐久性保持率60%以上の基準を満足しており、土木補修用エポキシ樹脂注入材3種の品質規格に適合している（補完情報より）。",null,"・本工法の補修材料であるBLグラウトは、旧建設省総合技術開発プロジェクト「注入材と充てん材の品質規格」に準じた試験を実施し、粘度1000mPa・s以下、モルタル付着強さ6N/mm2以上、硬化収縮0.1%以下、伸び率50%以上、可使時間30分以上、硬化時間16時間以内、付着力耐久性保持率60%以上の基準を満足しており、土木補修用エポキシ樹脂注入材2種の品質規格に適合している（補完情報より）。",null,"・本工法の補修材料であるBLグラウトは、旧建設省総合技術開発プロジェクト「注入材と充てん材の品質規格」に準じた試験を実施し、粘度1000mPa・s以下、モルタル付着強さ6N/mm2以上、硬化収縮0.1%以下、可使時間30分以上、硬化時間16時間以内、付着力耐久性保持率60%以上の基準を満足しており、土木補修用エポキシ樹脂注入材1種の品質規格に適合している（補完情報より）。",null,"\n・JISA1404「建築用セメント防水剤の試験方法」に準拠した試験におけるコンクリートブロックに塗布した際の吸水率は0％である（補完情報より）。\n・耐薬品性試験において、水道水、海水、酢酸等では質量減少等の異常はない（補完情報より）。",null,"・本工法の補修材料であるハイスタッフの水比70％での材齢28日の圧縮強度は32.0Ｎ/mm2であり、自社基準の27Ｎ/mm2以上を満足している（補完情報より）。\n・本工法の補修材料であるハイスタッフの水比70％での粘度は49mPa・ｓであり、自社基準の100mPa・ｓ以下を満足している（補完情報より）。　（参考：JISA6024における低粘度形エポキシ樹脂：粘度100～1000mPa・ｓ）\n・ひび割れ内部に水が残存していたり、湿潤面でも注入が可能であり、高炉スラグのポゾラン反応による長期耐久性に優れた水和物が生成できる（評価情報より）。",null,"・速硬性を有することにより、寒冷期、粗大なひび割れ等に適用可能（NETIS情報）。\n・本工法の補修材料であるハイスタッフの水比70％での材齢28日の圧縮強度は32.6Ｎ/mm2であり、自社基準の24Ｎ/mm2以上を満足している（補完情報より）。\n・本工法の補修材料であるハイスタッフの水比70％での粘度は34mPa・ｓであり、自社基準の100mPa・ｓ以下を満足している（補完情報より）。　（参考：JISA6024における低粘度形エポキシ樹脂：粘度100～1000mPa・ｓ）\n・ひび割れ内部に水が残存していたり、湿潤面でも注入が可能であり、高炉スラグのポゾラン反応による長期耐久性に優れた水和物が生成できる（評価情報より）。",null,"・本工法の補修材料であるビトグラウト-Nの粘性は12100mPa・sであり、自社規格の12000±2000mPa・sを満足している（補完情報より）。\n・本工法の補修材料であるビトグラウト-Nの接着強度は1.14N/mm2であり、自社規格の1.05±0.23N/mm2を満足している（補完情報より）。\n・耐薬品性試験において、水道水、海水、酢酸等では質量減少等の異常はない（補完情報より）。\n・JISA1404「建築用セメント防水剤の試験方法」に準拠した試験におけるコンクリートブロックに塗布した際の吸水率は0％である（補完情報より）。",null,"・本工法の補修材料であるIPH E-396Hは、建設省総合技術開発プロジェクト「注入材と充てん材の品質規格」に準じた試験を実施し、粘度1000mPa・s以下、モルタル付着強度6N/mm2以上、硬化収縮0.1%以下、可使時間30分以上、硬化時間16時間以内、付着力耐久性保持率60%以上の基準を満足しており、土木補修用エポキシ樹脂注入材1種の品質規格に適合している（補完情報より）。\n・本工法の補修材料であるIPH E-396Hは、JISA6024「建築補修用注入エポキシ樹脂」に準じた試験を実施し、粘度100～1000mPa・s、接着強度6N/mm2以上（湿潤時等3N/mm2以上）、硬化収縮率3％以下、引張強度15N/mm2以上、引張破壊伸び10％以下等の基準を満足しており、硬質系エポキシ樹脂低粘度形の品質規格に適合している（補完情報より）。",null,"・引張強度は約1.11N/mm2であり、自社規格である0.70N/mm2以上を満足している（補完情報より）。\n・伸び率は約362％であり、自社規格である300％以上を満足している（補完情報より）。",null,"・透水量試験（自社試験）を実施し、けい酸塩素評価基準の透水抑制率：C（60%以下）を確認（NETIS情報より）。\n・吸水率試験を実施し、けい酸塩素評価基準の吸水抑制率：C（60%以下）を確認（NETIS情報より）。\n・中性化試験を実施し、けい酸塩素評価基準の中性化抑制率：C（60%以下）を確認（NETIS情報より）。",null,"・止水能力：無機系止水材の性能評価試験を実施し、ひび割れ幅が0.15mm～2.0mmで水圧0.3MPaの止水を確認（補完情報より）。\n・時間の経過とともに保水力の高いハニカム結晶ジェルの成長が可能となることを確認（NETIS情報より）。",null,"・本技術は注入器の技術であり、ひび割れ注入後の耐久性は注入材の性能による（補完情報より）。",null,"・付着強度試験を実施し、従来の1液型ポリウレタン樹脂注入工法の0.29N/mm2に対して、0.48N/mm2を確認している（NETIS情報より）。\n・硬化収縮率は、従来の1液型ポリウレタン樹脂注入工法の80.7%に対して、75.9%を確認している（NETIS情報より）。\n・耐水圧試験（1.0MPa-1,000時間）を実施し、連続1200時間漏水がないことを確認している（NETIS情報より）。\n・引張強度試験を実施し、従来の1液型ポリウレタン樹脂注入工法の1.31N/mm2に対して、1.51N/mm2を確認している（NETIS情報より）。\n・伸び率は、従来の1液型ポリウレタン樹脂注入工法の460%に対して、460%を確認している（NETIS情報より）。",null,"・JISA6024「建築補修用注入エポキシ樹脂」に準じた試験を実施し、硬質形エポキシ樹脂低粘度系の、粘性100～1000mPa・s、付着強度標準6.0N/m㎡以上（低温、湿潤、乾湿繰返し時3.0N/m㎡以上）、硬化収縮率3％以下、引張強度15.0N/m㎡以上、伸び率10%以下の基準を満足している（補完情報より）。\n・NEXCO構造物施工管理要領「ひび割れ注入工法用エポキシ樹脂系ひび割れ注入材の品質規格」に規定された試験を実施し、付着力耐久性保持率60％以上の基準を満足している（補完情報より）。\n・補修材料の性能試験結果は、エポキシ樹脂系（AT-50A)の結果である（補完情報より）。\n・シールテープの限界注入圧試験を実施し、従来の不透明なシール材を用いた自動式低圧注入工法と同等の0.4MPaを確認している（補完情報より）。",null,"・NEXCO構造物施工管理要領「ひび割れ注入工法用エポキシ樹脂系ひび割れ注入材の品質規格」に準じた試験を実施し、粘度100～1000mPa・s、接着強度6N/mm2以上（湿潤時等3N/mm2以上）、硬化収縮率3％以下、引張強度15N/mm2以上、引張破壊伸び10％以下等の基準を満足しており、硬質系エポキシ樹脂低粘度形の品質規格に適合している（補完情報より）。\n・ひび割れ含浸材料の試験（NEXCO試験法426）を実施し、幅0.5㎜のひび割れに本製品を含浸させた供試体の曲げ強度が自社基準の2.0N/㎜2以上を満足している（補完情報より）。",null,"／"]
[null,"㉓","施工性\n(留意事項含む）",null,null,"・湿潤面への適用も可能（NETIS情報より）。",null,"・低圧注入機は分解可能なため再注入やリサイクルが可能（NETIS情報より）。",null,"・幅が0.3mm以下のコンクリート構造物のひび割れに塗布のみで施工可能（NETIS情報より）。\n・湿潤面への適用も可能である（NETIS情報より）。",null,"・鉛直面でひび割れ幅0.05mm以上0.8mm以下、上向きで0.05mm以上0.5mm以下のひび割れに塗布のみで施工可能（補完情報より）。\n・湿潤面への適用も可能（NETIS情報より）。",null,"・鉛直面でひび割れ幅0.05mm以上0.8mm以下、上向きで0.05mm以上0.5mm以下のひび割れに塗布のみで施工可能（補完情報より）。\n・湿潤面への適用も可能（NETIS情報より）。",null,"・5～35℃に適用可能（NETIS情報より）。\n・大気中における新設、既設のコンクリート構築物で流水量の少ない漏水個所に対応（NETIS情報より）。",null,"・-5.0℃以上に適用可能（NETIS情報より）。\n・湿潤状態に適用可能(降雨後にコンクリート表面を乾燥させ、多少濡れが残る程度)（NETIS情報より）。",null,"・0.1㎜以下の微細ひび割れへも充填可能（評価情報より）。\n・気温が5℃を下回る場合には、エポキシ樹脂を加温し、可使時間内に注入を終了する必要がある（評価情報より）。",null,"・0.1㎜以下の微細ひび割れへも充填可能（評価情報より）。\n・気温が5℃を下回る場合には、エポキシ樹脂を加温し、可使時間内に注入を終了する必要がある（評価情報より）。\n・特にひび割れの進行が見込まれる場合、また温度の影響でひび割れ幅が伸縮している場合に適する（補完情報より）。",null,"・0.1㎜以下の微細ひび割れへも充填可能（評価情報より）。\n・気温が5℃を下回る場合には、エポキシ樹脂を加温し、可使時間内に注入を終了する必要がある（評価情報より）。\n・揺変性を付与しているのでダレにくい。柔軟性に優れ５０％の伸びを有する（補完情報より）。",null,"・0.1㎜以下の微細ひび割れへも充填可能（評価情報より）。\n・気温が5℃を下回る場合には、エポキシ樹脂を加温し、可使時間内に注入を終了する必要がある（評価情報より）。\n・コンクリート湿潤面や鋼材に対する接着性に優れる（補完情報より）。",null,"・高圧で止水材を注入するため、微細な隙間にも充填できる（補完情報より）。\n・逆止弁が設置してある高圧注入止水用プラグを使用するため、止水作業が簡単である（補完情報より）。\n・施工箇所の中で、水圧の低いところから注入を進める必要がある（評価情報より）。\n・ゲル化剤の配合比により、可使時間、硬化時間の調整を可能として、修繕対象である現場の諸条件に対応する事が可能（補完情報より）。",null,"・低粘性で流動性が良く、低圧（0.2～0.3N/mm2（MPa））で微細なひび割れへの高い注入性が得られる（NETIS情報、補完情報より）。　（参考：土木工事標準積算基準書における注入圧力：0.4MPa以下）\n・温度は常温域（5～30℃）では問題はないが、凍結温度域や高温で保管した場合には材料を練混ぜてスラリーにした際の性状悪化が懸念されるため注意を要する（評価情報より）。",null,"・低粘性で流動性が良く、低圧（0.2～0.3N/mm2（MPa））で微細なひび割れへの高い注入性が得られる（NETIS情報、補完情報より）。　（参考：土木工事標準積算基準書における注入圧力：0.4MPa以下）\n・温度は常温域（5～30℃）では問題はないが、凍結温度域や高温で保管した場合には材料を練混ぜてスラリーにした際の性状悪化が懸念されるため注意を要する（評価情報より）。",null,"・ひび割れ中心部まで注入孔を削孔し、そこから高圧注入を行うので、ひび割れ全域に注入材が行き渡るため耐久性に優れる（補完情報より）。\n・湿潤面に適用可、漏水箇所に適用可（流出水が多い場合は高吸水性樹脂の少量添加等を検討）（NETIS情報より）。",null,"・劣化コンクリート構造物に鉄筋かぶり深さまで穿孔し、注入初段で反力エアー及び水分を瞬時に排出する機能付き注入器を用い、超低圧（0.06～0.02N/mm2）で注入し、樹脂硬化まで加圧を続けることにより微細なひび割れまで充填できる（補完情報より）。\n・ひび割れ幅0.01mmまで充填が可能。湿潤面・漏水箇所での施工が可能（補完情報より）。",null,"・自硬型止水材により、漏水空隙内部の乾湿何れの状態問わず安定した止水効果が得られる（NETIS情報より）。\n・2液混合の自硬時間は200秒(20℃)と速硬性を有し、作業時間の低減が可能（NETIS情報より）。\n",null,"・粉末A剤とB剤を40±2℃の温水で、それぞれ別のバケツ内にてハンドミキ サーを用い3分間攪拌し溶解する（NETIS情報より）。\n・噴霧する場合、溶解したA剤とB剤はそれぞれ別の噴霧器を使用する(A剤とB剤が接触するとゲルが生じ噴霧器 のノズルが閉塞するため)（NETIS情報より）。\n",null,"・粘性度調整によりひび割れ幅の対応範囲が広がり、止水能力、施工性が向上（NETIS情報より）。",null,"・追い打ち作業が必要となった場合、本体後部より追加充填が可能であり、本体の取り外し、再充填、再取付の作業が不要となり作業性が向上する（NETIS情報より）。\n・樹脂が無くならない様に定期的に確認が必要（NETIS情報より）。\n・本体を座金に取り付けた後に、ピストンを押さないこと。ピストン後部(追い打ち充填口)より液漏れが発生する場合がある（NETIS情報より）。",null,"・湿潤面への適用も可能（補完情報より）。\n・水と直接接触する箇所には適用不可（NETIS情報より）。\n・-5～60℃に適用可能（補完情報より）。\n・コンクリート構造物に注入孔を削孔し、注入孔に設置した注入プラグから注入材を拡散させる施工方法となるため、ひび割れ深さに応じて注入孔の長さを変更することが可能である（NETIS情報より）。",null,"・透明な専用シールテープであるため、注入中に充填状況が確認でき、未充填箇所の発生を防ぐことが可能である（NETIS情報より）。\n・表面が湿潤している躯体、表面に埃や白華、下地処理時に発生した削り粉が付着している躯体の場合、躯体表面との密着性が低下し、注入時に注入材が流出する可能性があるため、躯体表面の乾燥、清掃が必要である（NETIS情報より）。\n・5℃～40℃に適用可能（NETIS情報より）。",null,"・施工方向は、下向きのみである（補完情報より）。\n・材料は透明ではないため、塗布面に色がつくことに留意すること（NETIS情報より）。\n・ひび割れ幅0.5ｍｍを設定した供試体において、100ｍｍの含浸深さを確認している（補完情報より）。",null,"補完調査、WGでの検討は未実施"]
[null,"㉔","その他（留意事項含む）",null,null,"・九州地方（国土交通省）での活用実績はない（補完情報より）。\n・試験結果は自社試験によるものである（補完情報より）。",null,"・NETISでは亜硝酸イオンにより防錆、リチウムイオンによりアルカリシリカ反応抑制に効果があると記載されているが、実施されている試験は亜硝酸リチウムの浸透性に関する自社での試験であるため、採用に当たっては過去の実証結果、開発者の意見等を勘案して要検討（NETIS情報より）。",null,"-",null,"・九州地方（国土交通省）での活用実績はない（補完情報より）。\n・試験結果は自社試験によるものである（NETIS情報、補完情報より）。",null,"・九州地方（国土交通省）での活用実績はない（補完情報より）。\n・試験結果は自社試験によるものである（NETIS情報、補完情報より）。",null,"・本工法は含浸複合注入工法とされており、ひび割れ注入工の施工前に表面含浸材にあたる材料の1次注入、塗布を行う技術である（NETIS情報より）。\n・九州地方（国土交通省）での活用実績はない（評価情報より）。",null,"・本技術の試験結果は、公的機関によるものであるが証明書等は提出されていない（NETIS情報、補完情報より）。",null,"・特に効果の高い適用範囲としてはひび割れ幅が0.2～1.0mmのひび割れであるが、ひび割れ幅が5ｍｍを超える場合、及び漏水がありひび割れ幅が変動する場合は他の工法の採用や併用を検討する必要がある（評価情報より）。\n・旧建設省総合技術開発プロジェクト「注入材と充てん材の品質規格」に準じた試験以外の試験結果は、自社試験によるものである（補完情報より）。",null,"・特に効果の高い適用範囲としてはひび割れ幅が0.2～1.0mmのひび割れであるが、ひび割れ幅が5ｍｍを超える場合、及び漏水がありひび割れ幅が変動する場合は他の工法の採用や併用を検討する必要がある（評価情報より）。",null,"・特に効果の高い適用範囲としてはひび割れ幅が0.2～1.0mmのひび割れであるが、ひび割れ幅が5ｍｍを超える場合、及び漏水がありひび割れ幅が変動する場合は他の工法の採用や併用を検討する必要がある（評価情報より）。",null,"・特に効果の高い適用範囲としてはひび割れ幅が0.2～1.0mmのひび割れであるが、ひび割れ幅が5ｍｍを超える場合、及び漏水がありひび割れ幅が変動する場合は他の工法の採用や併用を検討する必要がある（評価情報より）。\n・旧建設省総合技術開発プロジェクト「注入材と充てん材の品質規格」に準じた試験以外の試験結果は、自社試験によるものである（補完情報より）。",null,"・中間工程として、従来技術ではカッター切断、コンクリート取壊し撤去が必要であったが、本技術では注入孔の削孔だけなので、産業廃棄物の発生はなくなり、騒音・振動・粉塵も大幅に減少した（評価情報より）。\n・A重油、硫酸、塩酸等を漏水に含む箇所には適さない（評価情報より）。\n・試験結果は自社試験によるものである（補完情報より）。",null,"・主成分が超微粒子で、微小のクラックまで注入することが出来るが、材料単価が高価なため、通常のエポキシ樹脂系注入材の使用箇所で使用すると経済性が悪くなる（評価情報より）。\n・保管はセメントと同様に湿気に注意するとともに、可能な限り一定温度で保管することが必要である（評価情報より）。・試験結果は自社試験によるものである（補完情報より）。",null,"・主成分が超微粒子で、微小のクラックまで注入することが出来るが、材料単価が高価なため、通常のエポキシ樹脂系注入材の使用箇所で使用すると経済性が悪くなる（評価情報より）。\n・保管はセメントと同様に湿気に注意するとともに、可能な限り一定温度で保管することが必要である（評価情報より）。・試験結果は自社試験によるものである（補完情報より）。",null,"・ゲル化時間が従来工法より長いため、作業完了後も注入材落下の危険があるため落下防止養生等の作業が必要である（評価情報より）。\n・注入剤を高圧注入するため、作業手順を間違うと注入剤を飛散させることがあり、第三者に影響がある現場では取り扱いに注意を要する（評価情報より）。\n・試験結果は自社試験によるものである（補完情報より）。",null,"・5℃以下の環境では凍結に対する対応が必要である（評価情報より）。\n・無機系注入材と同時採用の場合は、無機系注入を先行する必要がある（評価情報より）。\n・中性化抑制、塩害抑制、アルカリシリカ反応抑制、防錆性については現在岐阜大学と共同で試験中（補完情報より）。",null,"・九州地方（国土交通省）での活用実績はない（補完情報より）。\n・試験結果は自社試験によるものである（補完情報より）。\n・JWWAZ108:2016による浸出試験結果は、公的機関によるものであるが、証明書等は提出されていない（補完情報より）。\n・粘性度の測定方法はJIS Z 8803に準拠（補完情報より）。",null,"・九州地方（国土交通省）での活用実績はない（補完情報より）。\n・試験結果は自社試験によるものである（補完情報より）。",null,"・九州地方（国土交通省）での活用実績はない（補完情報より）。\n・試験結果は自社試験、民間委託によるものである（補完情報より）。",null,"・九州地方（国土交通省）での活用実績はない（評価情報より）。\n・施工費における注入材料は、JIS-A6024適合品（低粘度「AICA　JB-23」+中粘度「AICA　JB-20」）であるが、他の材料も適用できるため、使用する材料を選定する際は、開発会社へ確認する(補完情報より）。",null,"・九州地方（国土交通省）での活用実績はない（評価情報より）。\n・試験結果は、公的機関と自社試験によるものである。\n・試験結果における自社基準は、従来技術（1液型ポリウレタン樹脂注入工法）の試験結果を基準としている（補完情報より）。",null,"・シールテープを用いたひび割れ注入には、手動式低圧注入工法に加え、自動式注入工法も使用可能である（NETIS情報より）。\n・注入材料は、エポキシ樹脂系を使用すること（補完情報より）。\n・九州地方（国土交通省）での活用実績はない（評価情報より）。\n・試験結果は自社試験によるものである（補完情報より）。",null,"・九州地方（国土交通省）での活用実績はない（評価情報より）。\n・試験結果は、自社試験によるものである（補完情報より）。",null,"／"]
["注1）施工費用：2025年4月福岡県久留米市  注2）／：補完調査未実施"]
[null,null,null,null,null,{"$f":"G30","v":"新技術"},null,{"$f":"I30","v":"新技術"},null,{"$f":"K30","v":"新技術"},null,{"$f":"M30","v":"新技術"},null,{"$f":"O30","v":"新技術"},null,{"$f":"Q30","v":"新技術"},null,{"$f":"S30","v":"新技術"},null,{"$f":"U30","v":"新技術"},null,{"$f":"W30","v":"新技術"},null,{"$f":"Y30","v":"新技術"},null,{"$f":"AA30","v":"新技術"},null,{"$f":"AC30","v":"新技術"},null,{"$f":"AE30","v":"新技術"},null,{"$f":"AG30","v":"新技術"},null,{"$f":"AI30","v":"新技術"},null,{"$f":"AK30","v":"新技術"},null,{"$f":"AM30","v":"新技術"},null,{"$f":"AO30","v":"新技術"},null,{"$f":"AQ30","v":"新技術"},null,{"$f":"AS30","v":"新技術"},null,{"$f":"AU30","v":"新技術"},null,{"$f":"AW30","v":"新技術"},null,{"$f":"AY30","v":"新技術"},null,{"$f":"BA30","v":"新技術"}]
[null,null,"施工費用　注1）",null,"施工費",{"$f":"G31","v":1900},null,7139,null,1130,null,4310,null,4310,null,"未回答",null,6306,null,6306,null,6306,null,6306,null,6306,null,26348,null,"-",null,"-",null,"未回答",null,8975,null,15940,null,4118,null,19547,null,6306,null,21034,null,5152,null,3845,null,"／"]
[null,null,null,null,"材料費",{"$f":"G32","v":600},null,2532,null,1440,null,400,null,400,null,"未回答",null,3093,null,3401,null,3517,null,3517,null,3368,null,11421,null,"材料単価1,500（円/kg）",null,"材料単価1,650（円/kg）",null,"未回答",null,4915,null,10719,null,400,null,7815,null,3000,null,3276,null,2890,null,1333,null,"／"]
[null,null,null,null,"合計",2500,null,9671,null,2570,null,4710,null,4710,null,"未回答",null,9399,null,9707,null,9823,null,9823,null,9674,null,37769,null,"-",null,"-",null,"未回答",null,13890,null,26659,null,4518,null,27362,null,9306,null,24310,null,8042,null,5178,null,"／"]
[null,null,null,null,"備考","ひび割れ幅0.2mm、塗布量CS-21クリアー12g/m、CSパテ10g/m",null,"ひび割れ幅0.5mm、ひび割れ深さ100mm",null,"ひび割れ幅0.3mm以下",null,"ひび割れ幅0.5mm",null,"ひび割れ幅0.5mm",null,"-",null,"-",null,"ひび割れ幅0.2～0.5mm",null,"ひび割れ幅0.2～0.5mm",null,"ひび割れ幅0.2～0.5mm",null,"ひび割れ幅0.2～0.5mm",null,"ひび割れ幅0.5mm、ひび割れ深さ100mm",null,"-",null,"-",null,"ひび割れ幅0.5mm、ひび割れ深さ100mm",null,"ひび割れ幅0.5mm",null,"ひび割れ幅0.5mm、ひび割れ深さ100mm",null,"ひび割れ幅0.2mm、ひび割れ深さ50mm",null,"ひび割れ幅0.5mm、ひび割れ深さ100mm",null,"ひび割れ幅0.5mm、ひび割れ深さ100mm、注入材（エポキシ樹脂系）を含む",null,"ひび割れ幅0.5mm、ひび割れ深さ100mm",null,"ひび割れ幅0.5mm、ひび割れ深さ100mm",null,"ひび割れ幅0.5㎜、深さ100㎜",null,"／"]
[null,null,"施工日数",null,null,0.01,null,3.90625E-2,null,5.8823529411764705E-3,null,1.1111111111111112E-2,null,1.1111111111111112E-2,null,"未回答",null,5.8000000000000003E-2,null,5.7803468208092484E-2,null,5.7803468208092484E-2,null,5.7803468208092484E-2,null,5.7803468208092484E-2,null,0.14285714285714285,null,"-",null,"-",null,"未回答",null,5.5741360089186169E-2,null,0.1,null,0.02,null,0.1,null,3.8461538461538464E-2,null,0.13333333333333333,null,0.05,null,0.02,null,"／"]
[null,null,"施工規模",null,null,"100m以上",null,"100ｍ",null,"170ｍ以上施工箇所点在は別途",null,90,null,90,null,"未回答",null,100,null,"100m以上施工箇所点在は別途",null,"100m以上施工箇所点在は別途",null,"100m以上施工箇所点在は別途",null,"100m以上施工箇所点在は別途",null,100,null,"-",null,"-",null,"未回答",null,50,null,100,null,100,null,100,null,100,null,30,null,100,null,"100ｍ以上",null,"／"]
[null,null,"費用比較",null,null,"-",null,"（9,671-8,813）/8,813=9.7%",null,"-",null,"-",null,"-",null,"-",null,"（9,399-8,813）/8,813=6.6%",null,"（9,707-8,813）/8,813=10.1%",null,"（9,823-8,813）/8,813=11.5%",null,"（9,823-8,813）/8,813=11.5%",null,"（9,674-8,813）/8,813=9.8%",null,"（37,769-8,813）/8,813=328.6%",null,"-",null,"-",null,"-",null,"（13,890-8,813）/8,813=57.6%",null,"（26,659-8,813）/8,813=202.5%",null,"-",null,"（27,362-8,813）/8,813=210.5%",null,"（9,306-8,813）/8,813=5.6%",null,"（24,310-8,813）/8,813=175.8%",null,"（8,042-8,813）/8,813=-8.7%",null,"（5,178-8,813）/8,813=-41.2%",null,"／"]
[null,null,"日数比較",null,null,"-",null,"（0.039-0.039）/0.039=0.2%",null,"-",null,"-",null,"-",null,"-",null,"（0.058-0.039）/0.039=48.7%",null,"（0.058-0.039）/0.039=48.2%",null,"（0.058-0.039）/0.039=48.2%",null,"（0.058-0.039）/0.039=48.2%",null,"（0.058-0.039）/0.039=48.2%",null,"（0.143-0.039）/0.039=266.3%",null,"-",null,"-",null,"-",null,"（0.056-0.039）/0.039=42.9%",null,"（0.100-0.039）/0.039=156.4%",null,"-",null,"（0.100-0.039）/0.039=156.4%",null,"（0.038-0.039）/0.039=-1.4%",null,"（0.133-0.039）/0.039=241.9%",null,"（0.050-0.039）/0.039=28.2%",null,"（0.020-0.039）/0.039=-48.7%",null,"／"]
[null,null,"試験項目",null,"ひび割れ補修材料",{"$f":"G43","v":"CSパテ"},null,{"$f":"I43","v":"MCRアーマ＃600（他社（三菱マテリアル株式会社）の製品のため参考値）"},null,{"$f":"K43","v":"ショーボンド　グラウトLV（通年用）"},null,{"$f":"M43","v":"アルファテック388S"},null,{"$f":"O43","v":"アルファテック388W"},null,{"$f":"Q43","v":"-"},null,{"$f":"S43","v":"ADOX1380WH"},null,{"$f":"U43","v":"ショーボンド　BLグラウト（夏用・冬用）"},null,{"$f":"W43","v":"ショーボンド　BLグラウト100（夏用・冬用）"},null,{"$f":"Y43","v":"ショーボンド　DDグラウト50（通年用）"},null,{"$f":"AA43","v":"ショーボンド　WBグラウト（通年用）"},null,{"$f":"AC43","v":"アルファー・ゾル-G（ゲル化剤の添加率：原液換算で5％）"},null,{"$f":"AE43","v":"ハイスタッフ（水比70％）"},null,{"$f":"AG43","v":"ハイスタッフZ（水比70％）"},null,{"$f":"AI43","v":"ビトグラウト-N"},null,{"$f":"AK43","v":"IPH E-396H"},null,{"$f":"AM43","v":"特殊水性エマルション ミクストグラウト主剤+親水性ポリウレタン樹脂 ミクストグラウト硬化剤"},null,{"$f":"AO43","v":"A剤(バクテリア・乳酸カルシウム)+B剤(反応促進剤)"},null,{"$f":"AQ43","v":"アウターシール主剤(ケイ酸系)+アウターシールB促進剤(カルシウム化合物)"},null,{"$f":"AS43","v":"エポキシ樹脂"},null,{"$f":"AU43","v":"ポリウレタン樹脂"},null,{"$f":"AW43","v":"エポキシ樹脂（AT-50）"},null,{"$f":"AY43","v":"アクリル系樹脂注入材"},null,{"$f":"BA43","v":"／"}]
[null,null,null,null,"試験規格",{"$f":"G44","v":"新技術の試験結果"},null,"新技術の試験結果",null,"新技術の試験結果",null,"新技術の試験結果",null,"新技術の試験結果",null,"新技術の試験結果",null,"新技術の試験結果",null,"新技術の試験結果",null,"新技術の試験結果",null,"新技術の試験結果",null,"新技術の試験結果",null,"新技術の試験結果",null,"新技術の試験結果",null,"新技術の試験結果",null,"新技術の試験結果",null,"新技術の試験結果",null,"新技術の試験結果",null,"新技術の試験結果",null,"新技術の試験結果",null,"新技術の試験結果",null,"新技術の試験結果",null,"新技術の試験結果",null,"新技術の試験結果",null,"新技術の試験結果"]
[null,null,"補修材料の性能\n\n判定の凡例\n○：基準を満足\n△：基準と同程度\n－：上記以外","粘性",null,"-",null,{"$f":"I45","v":"-"},null,"145mPa・s",null,"﻿600mPa・s   ",null,"﻿600mPa・s   ",null,"-",null,"330mPa・s",null,620,null,410,null,"チキソトロピック係数　4",null,688,null,"-",null,"49mPa・ｓ",null,"34mPa・ｓ",null,"12100mPa・s",null,"666mPa・s　（686mPa・s）",null,"147mPa・s（主剤）　500mPa・s(硬化剤）",null,"-",null,"-",null,"-",null,"（100～300mPa・s）",null,"320mPa・s",null,"132mPa・s（JIS K 6833-1）",null,"／"]
[null,null,null,"モルタル付着強度\n（接着強度）\n（N/m㎡）","標準（乾燥）","-",null,"-",null,"6.8N/mm2",null,"8.7N/mm2（セメントモルタル基材破壊）  ",null,"8.5N/mm2（セメントモルタル基材破壊）  ",null,"-",null,"8.1N/m㎡",null,"8N/mm2",null,"9.8N/mm2",null,"8.9N/mm2",null,"10.6N/mm2",null,"1.42N/mm2（下地：コンクリート、被着体：コンクリート）",null,"1.5N/mm2",null,"2.2N/mm2",null,"1.14N/mm2（コンクリート対コンクリート）",null,"8.0N/mm2　（7.4N/mm2）",null,"1.36N/mm2（乾燥面）",null,"-",null,"-",null,"-",null,"（0.48N/mm2）",null,8.5,null,"7.1N/m㎡（JSCE-K-541）",null,"／"]
[null,null,null,null,"低温時","-",null,"-",null,"-",null,"-",null,"6.0N/mm2（セメントモルタル基材破壊）  ",null,"-",null,"7.5N/m㎡",null,"-",null,"-",null,"-",null,"-",null,"-",null,"-",null,"-",null,"-",null,"-",null,"-",null,"-",null,"-",null,"-",null,"-",null,8.1,null,"-",null,"／"]
[null,null,null,null,"湿潤時","-",null,"-",null,"（5.2N/mm2）",null,"4.5N/mm2（セメントモルタル基材破壊）  ",null,"4.5N/mm2（セメントモルタル基材破壊）  ",null,"-",null,"7.2N/m㎡",null,"-",null,"-",null,"-",null,"（6.4N/mm2（モルタル破壊））",null,"-",null,"-",null,"-",null,"-",null,"（7.3N/mm2）",null,"0.87N/m㎡",null,"-",null,"-",null,"-",null,"-",null,8.1999999999999993,null,"6.4N/m㎡（JSCE-K-541）",null,"／"]
[null,null,null,null,"乾湿繰返し時","-",null,"-",null,"-",null,"4.0N/mm2（セメントモルタル基材破壊）  ",null,"4.0N/mm2（セメントモルタル基材破壊）  ",null,"-",null,"7.6N/m㎡",null,"-",null,"-",null,"-",null,"-",null,"-",null,"-",null,"-",null,"-",null,"（8.7N/mm2）",null,"-",null,"-",null,"-",null,"-",null,"-",null,7.9,null,"6.3N/m㎡（JSCE-K-541）",null,"／"]
[null,null,null,"硬化収縮率（％）","（型・試験片の寸法差）","-",null,"-",null,0,null,"-",null,"-",null,"-",null,"-",null,0,null,"-",null,1E-3,null,0,null,"-",null,"-",null,"-",null,"-",null,"-",null,"材齢28日：28.7%",null,"-",null,"-",null,"-",null,0.75900000000000001,null,1.4999999999999999E-2,null,"2.5％（JIS A 6024）",null,"／"]
[null,null,null,null,"（固体・液体時の密度差）","-",null,"-",null,"-",null,1.2999999999999999E-2,null,1.4999999999999999E-2,null,"-",null,0.02,null,"-",null,"-",null,"-",null,"-",null,"-",null,"-",null,"-",null,"-",null,0.02,null,"-",null,"-",null,"-",null,"-",null,"-",null,"-",null,"2.5％（JIS A 6024）",null,"／"]
[null,null,null,"引張強度（N/mm2）",null,"1.73N/mm2（建研式接着力試験器）",null,"-",null,"（30N/mm2）",null,"15N/mm2",null,"20N/mm2",null,"-",null,"35.3N/m㎡",null,"（7日：58.5N/mm2）",null,"-",null,"-",null,"（7日：88.6N/mm2）",null,"0.29N/mm2",null,"-",null,"-",null,"0.65N/mm2（20℃）",null,"（42.7N/mm2）",null,"1.11N/m㎡",null,"-",null,"-",null,"-",null,"1.51N/mm2",null,30,null,"43.4N/m㎡（JSCE-K-541）",null,"／"]
[null,null,null,"伸び率（％）",null,"-",null,"-",null,"-",null,9.5000000000000001E-2,null,7.0000000000000007E-2,null,"-",null,0,null,"-",null,1.88,null,0.57999999999999996,null,"-",null,3,null,"-",null,"-",null,"600％（20℃）",null,0.05,null,3.62,null,"-",null,"-",null,"-",null,4.5999999999999996,null,5.8000000000000003E-2,null,"3％（JSCE-K-541）",null,"／"]
[null,null,null,"圧縮強度（N/mm2）",null,"36.2N/mm2（JIS A1108）",null,"36.7N/mm2",null,"（60N/mm2）",null,"35N/mm2（JISK7208）",null,"40N/mm2（JISK7208）",null,"-",null,"-",null,"（7日：78.9N/mm2）",null,"-",null,"-",null,"（7日：89.6N/mm2）",null,"-",null,"32.0N/mm2（JISR5201）",null,"32.6N/mm2（JISR5201）",null,"-",null,"57N/mm2（JISK7181）",null,"-",null,"-",null,"-",null,"-",null,"-",null,60,null,"-",null,"／"]
[null,null,null,"可使時間",null,"5分（20℃）",null,"-",null,"134分",null,"60分（20℃）",null,"30分（20℃）",null,"-",null,"-",null,"180分",null,"69分",null,"49分",null,"114分",null,"ゲル化剤の添加率による　添加率5％で4時間程度でゲル化",null,"-",null,"ゲルタイム27分",null,"120分",null,"88分",null,"3分43秒（223秒）（20℃）",null,"-",null,"2液攪拌後　60分間程度",null,"-",null,"-",null,"30分",null,"30～120分（JSCE-K-541）",null,"／"]
[null,null,null,"硬化時間",null,"2時間（20℃）",null,"-",null,"6時間",null,{"$f":"M56","v":"24時間"},null,"24時間",null,"-",null,"-",null,"13時間",null,"14時間",null,"15時間",null,"7時間",null,"ゲル化剤の添加率による　添加率5％で6時間程度で硬化",null,"-",null,"-",null,"4時間",null,"16時間",null,"15～20分",null,"-",null,"-",null,"-",null,"（20～60秒）",null,"-",null,"0.5～3.5時間（ドライングコーダー）",null,"／"]
[null,null,null,"付着力耐久性保持率（％）",null,"-",null,"-",null,1.25,null,"-",null,"-",null,"-",null,0.94,null,0.93,null,1.37,null,1.48,null,0.84,null,"-",null,"-",null,"-",null,"-",null,1.24,null,"-",null,"-",null,"-",null,"-",null,"-",null,0.76,null,"90％（JSCE-K-541）",null,"／"]
[null,null,null,null,"品質・出来形",{"$f":"LEFT(F39,1)","v":"-"},null,{"$f":"LEFT(H39,1)","v":"○"},null,{"$f":"LEFT(J39,1)","v":"-"},null,{"$f":"LEFT(L39,1)","v":"-"},null,{"$f":"LEFT(N39,1)","v":"-"},null,{"$f":"LEFT(P39,1)","v":"-"},null,{"$f":"LEFT(R39,1)","v":"-"},null,{"$f":"LEFT(T39,1)","v":"-"},null,{"$f":"LEFT(V39,1)","v":"-"},null,{"$f":"LEFT(X39,1)","v":"-"},null,{"$f":"LEFT(Z39,1)","v":"-"},null,{"$f":"LEFT(AB39,1)","v":"-"},null,{"$f":"LEFT(AD39,1)","v":"-"},null,{"$f":"LEFT(AF39,1)","v":"-"},null,{"$f":"LEFT(AH39,1)","v":"-"},null,{"$f":"LEFT(AJ39,1)","v":"-"},null,{"$f":"LEFT(AL39,1)","v":"-"},null,{"$f":"LEFT(AN39,1)","v":"-"},null,{"$f":"LEFT(AP39,1)","v":"-"},null,{"$f":"LEFT(AR39,1)","v":"-"},null,{"$f":"LEFT(AT39,1)","v":"-"},null,{"$f":"LEFT(AV39,1)","v":"-"},null,{"$f":"LEFT(AX39,1)","v":"-"},null,{"$f":"LEFT(AZ39,1)","v":"／"}]
[null,null,null,null,"安全性",{"$f":"LEFT(F40,1)","v":"△"},null,"△",null,"△",null,"-",null,"△",null,"△",null,"△",null,"△",null,"△",null,"△",null,"△",null,"△",null,"△",null,"△",null,"-",null,"△",null,"△",null,"△",null,"△",null,"△",null,"△",null,"△",null,"△",null,"／"]
[null,null,null,null,"施工性","△",null,{"$f":"LEFT(H41,1)","v":"△"},null,"○",null,"○",null,"○",null,"○",null,"○",null,"△",null,"○",null,"○",null,"○",null,"○",null,"○",null,"○",null,"○",null,"○",null,"○",null,"△",null,"○",null,"○",null,"○",null,"○",null,"○",null,"／"]
[null,null,null,null,"環境","△",null,"○",null,"△",null,"-",null,"△",null,"△",null,"△",null,"△",null,"△",null,"△",null,"△",null,"△",null,"△",null,"△",null,"-",null,"△",null,"△",null,"△",null,"△",null,"△",null,"△",null,"△",null,"○",null,"／"]

{"sheet":"仕様の整理","index":5,"n_rows":27,"n_cols":32,"rows_kept":27,"cut":false,"hidden":false,"merged":[[1,12,2,12],[1,9,1,11],[1,17,2,17],[1,13,2,13]]}
[null," 対象工種の仕様の整理",null,null,"登録技術：",{"$f":"SUMPRODUCT((E4:E1000<>\"\")/COUNTIF(E4:E1000,E4:E1000&\"\"))&\"技術\"&MAX(B:B)&\"仕様\"","v":"19技術24仕様"},"検索結果：",{"$f":"\"\"&SUM(IF((A4:A1000<>\"\")*(A4:A1000<>\"-\")*(E4:E1000<>\"\"),1/COUNTIFS(A4:A1000,\"<>\",A4:A1000,\"<>-\",E4:E1000,E4:E1000)))&\"技術\"&COUNT(A:A)&\"仕様\"","v":"19技術24仕様"},null,null,null,null,"→検索結果",null,null,null,null,null,null,null,null,"→絶対順位"]
[null,"基本情報",null,null,null,null,null,null,null,"現場の条件\n（水分の影響、変動の大きなひび割れ）",null,null,"条件一致","対象工法","ひび割れ被覆工法","ひび割れ注入工法","ひび割れ充填工法","現場条件","湿潤状態","漏水状態","温度変化等によるひび割れ幅の変化がある"]
["検索順位","番号","技術\n番号","技術名","NETIS登録番号","技術の種類","審議終了技術","更新日","種類","湿潤状態","漏水状態","ひび割れの変動が大きい",null,null,{"$f":"検索!S5","v":""},{"$f":"検索!S6","v":""},{"$f":"検索!S7","v":""},null,{"$f":"検索!S10","v":""},{"$f":"検索!S11","v":""},{"$f":"検索!S12","v":""},"九州本社","Aの技術","九州でA","記号","登録年度","登録番号","審議終了","仕様","地整","重み付け","絶対順位"]
[{"$f":"IF(検索!$U$1=\"条件検索\", IF(M4=\"○\", COUNTIFS(M:M,\"○\",AF:AF,\"<\"&AF4)+1, \"-\"), IF(検索!$U$1=\"技術名検索\", IF(検索!$B$33=仕様の整理!E4, 仕様の整理!AF4, \"-\"), \"-\"))","v":20},1,"1-1","CS-21ひび割れ補修セット","CG-110003-VG","NETIS掲載期間終了技術","○","令和6年11月","ひび割れ被覆工法","○",null,null,{"$f":"IF(AND($N4=\"○\",$R4=\"○\"),\"○\",\"\")","v":"○"},{"$f":"IF(OR(AND($O$3=\"\", $P$3=\"\", $Q$3=\"\"), COUNTIF($O4:$Q4,\"○\")>0), \"○\", \"\")","v":"○"},{"$f":"IF(O$3=I4,\"○\",\"\")","v":""},{"$f":"IF(P$3=I4,\"○\",\"\")","v":""},{"$f":"IF(Q$3=I4,\"○\",\"\")","v":""},{"$f":"IF(OR(AND($S$3=\"\", $T$3=\"\", $U$3=\"\"), COUNTIF(S4:U4,\"○\")>0), \"○\", \"\")","v":"○"},{"$f":"IF(AND(S$3=J4,$S$3=\"○\"),\"○\",\"\")","v":""},{"$f":"IF(AND(T$3=K4,$T$3=\"○\"),\"○\",\"\")","v":""},{"$f":"IF(AND(U$3=L4,$U$3=\"○\"),\"○\",\"\")","v":""},{"$f":"HLOOKUP($C4,DB!$1:$1048576,9,0)","v":"-"},{"$f":"RIGHT(E4,LEN(E4)-FIND(\"-\",E4,FIND(\"-\",E4)+1))","v":"VG"},{"$f":"IF(AND(V4=\"◎\",W4=\"A\"),1,2)","v":2},{"$f":"VLOOKUP(W4,条件!D:E,2,0)","v":2},{"$f":"IFERROR(IF(VALUE(LEFT(MID(E4,FIND(\"-\",E4)+1,FIND(\"-\",E4,FIND(\"-\",E4)+1)-FIND(\"-\",E4)-1),2))>=90,\"19\"&LEFT(MID(E4,FIND(\"-\",E4)+1,FIND(\"-\",E4,FIND(\"-\",E4)+1)-FIND(\"-\",E4)-1),2),\"20\"&LEFT(MID(E4,FIND(\"-\",E4)+1,FIND(\"-\",E4,FIND(\"-\",E4)+1)-FIND(\"-\",E4)-1),2)),\"\")","v":"2011"},{"$f":"MID(E4, FIND(\"-\", E4) + 3, FIND(\"-\", E4, FIND(\"-\", E4) + 1) - FIND(\"-\", E4) - 3)","v":"0003"},{"$f":"IF(G4=\"\",2,1)","v":1},{"$f":"MID(C4,FIND(\"-\",C4)+1,LEN(C4))","v":"1"},{"$f":"VLOOKUP(LEFT(E4,2),条件!A:B,2,0)","v":"03"},{"$f":"(X4&Y4&Z4&AA4&AB4&TEXT(AC4,\"00\")&AD4)*1","v":222011000310103},{"$f":"_xlfn.RANK.EQ(AE4,AE:AE,1)","v":20}]
[{"$f":"IF(検索!$U$1=\"条件検索\", IF(M5=\"○\", COUNTIFS(M:M,\"○\",AF:AF,\"<\"&AF5)+1, \"-\"), IF(検索!$U$1=\"技術名検索\", IF(検索!$B$33=仕様の整理!E5, 仕様の整理!AF5, \"-\"), \"-\"))","v":21},2,"2-1","リハビリシリンダー工法","CG-110017-VG","NETIS掲載期間終了技術","○","令和6年11月","ひび割れ注入工法","○","-",null,{"$f":"IF(AND($N5=\"○\",$R5=\"○\"),\"○\",\"\")","v":"○"},{"$f":"IF(OR(AND($O$3=\"\", $P$3=\"\", $Q$3=\"\"), COUNTIF($O5:$Q5,\"○\")>0), \"○\", \"\")","v":"○"},{"$f":"IF(O$3=I5,\"○\",\"\")","v":""},"","",{"$f":"IF(OR(AND($S$3=\"\", $T$3=\"\", $U$3=\"\"), COUNTIF(S5:U5,\"○\")>0), \"○\", \"\")","v":"○"},{"$f":"IF(AND(S$3=J5,$S$3=\"○\"),\"○\",\"\")","v":""},{"$f":"IF(AND(T$3=K5,$T$3=\"○\"),\"○\",\"\")","v":""},{"$f":"IF(AND(U$3=L5,$U$3=\"○\"),\"○\",\"\")","v":""},{"$f":"HLOOKUP($C5,DB!$1:$1048576,9,0)","v":"-"},"VG",{"$f":"IF(AND(V5=\"◎\",W5=\"A\"),1,2)","v":2},{"$f":"VLOOKUP(W5,条件!D:E,2,0)","v":2},"2011","0017",{"$f":"IF(G5=\"\",2,1)","v":1},"1",{"$f":"VLOOKUP(LEFT(E5,2),条件!A:B,2,0)","v":"03"},{"$f":"(X5&Y5&Z5&AA5&AB5&TEXT(AC5,\"00\")&AD5)*1","v":222011001710103},{"$f":"_xlfn.RANK.EQ(AE5,AE:AE,1)","v":21}]
[{"$f":"IF(検索!$U$1=\"条件検索\", IF(M6=\"○\", COUNTIFS(M:M,\"○\",AF:AF,\"<\"&AF6)+1, \"-\"), IF(検索!$U$1=\"技術名検索\", IF(検索!$B$33=仕様の整理!E6, 仕様の整理!AF6, \"-\"), \"-\"))","v":22},3,"3-1","ショーボンドCAP工法","KT-120057-VG","NETIS掲載期間終了技術","○","令和6年11月","ひび割れ被覆工法","○",null,null,"○","○","","","","○","","","",{"$f":"HLOOKUP($C6,DB!$1:$1048576,9,0)","v":"-"},"VG",2,{"$f":"VLOOKUP(W6,条件!D:E,2,0)","v":2},"2012","0057",1,"1",{"$f":"VLOOKUP(LEFT(E6,2),条件!A:B,2,0)","v":"07"},222012005710107,22]
[{"$f":"IF(検索!$U$1=\"条件検索\", IF(M7=\"○\", COUNTIFS(M:M,\"○\",AF:AF,\"<\"&AF7)+1, \"-\"), IF(検索!$U$1=\"技術名検索\", IF(検索!$B$33=仕様の整理!E7, 仕様の整理!AF7, \"-\"), \"-\"))","v":23},4,"4-1","ひび割れ補修浸透性エポキシ樹脂塗布工法","CB-130007-VG","NETIS掲載期間終了技術","○","令和6年11月","ひび割れ被覆工法","○",null,null,"○","○","","","","○","","","",{"$f":"HLOOKUP($C7,DB!$1:$1048576,9,0)","v":"-"},"VG",2,{"$f":"VLOOKUP(W7,条件!D:E,2,0)","v":2},"2013","0007",1,"1",{"$f":"VLOOKUP(LEFT(E7,2),条件!A:B,2,0)","v":"05"},222013000710105,23]
[{"$f":"IF(検索!$U$1=\"条件検索\", IF(M8=\"○\", COUNTIFS(M:M,\"○\",AF:AF,\"<\"&AF8)+1, \"-\"), IF(検索!$U$1=\"技術名検索\", IF(検索!$B$33=仕様の整理!E8, 仕様の整理!AF8, \"-\"), \"-\"))","v":24},5,"4-2","ひび割れ補修浸透性エポキシ樹脂塗布工法","CB-130007-VG","NETIS掲載期間終了技術","○","令和6年11月","ひび割れ被覆工法","○",null,null,"○","○","","","","○","","","",{"$f":"HLOOKUP($C8,DB!$1:$1048576,9,0)","v":"-"},"VG",2,{"$f":"VLOOKUP(W8,条件!D:E,2,0)","v":2},"2013","0007",1,"2",{"$f":"VLOOKUP(LEFT(E8,2),条件!A:B,2,0)","v":"05"},222013000710205,24]
[{"$f":"IF(検索!$U$1=\"条件検索\", IF(M9=\"○\", COUNTIFS(M:M,\"○\",AF:AF,\"<\"&AF9)+1, \"-\"), IF(検索!$U$1=\"技術名検索\", IF(検索!$B$33=仕様の整理!E9, 仕様の整理!AF9, \"-\"), \"-\"))","v":2},6,"8-1","ハイドロフィット工法(含浸複合注入工法)","KT-160095-VR","事後評価済技術","○","令和6年11月","ひび割れ注入工法","○","-","○","○","○","","","","○","","","",{"$f":"HLOOKUP($C9,DB!$1:$1048576,9,0)","v":"-"},"VR",2,{"$f":"VLOOKUP(W9,条件!D:E,2,0)","v":1},"2016","0095",1,"1",{"$f":"VLOOKUP(LEFT(E9,2),条件!A:B,2,0)","v":"07"},212016009510107,2]
[{"$f":"IF(検索!$U$1=\"条件検索\", IF(M10=\"○\", COUNTIFS(M:M,\"○\",AF:AF,\"<\"&AF10)+1, \"-\"), IF(検索!$U$1=\"技術名検索\", IF(検索!$B$33=仕様の整理!E10, 仕様の整理!AF10, \"-\"), \"-\"))","v":3},7,"9-1","ハイブリッドエポキシ樹脂","HK-170005-VR","事後評価済技術","○","令和6年11月","ひび割れ注入工法","○",null,null,"○","○","","","","○","","","",{"$f":"HLOOKUP($C10,DB!$1:$1048576,9,0)","v":"-"},"VR",2,{"$f":"VLOOKUP(W10,条件!D:E,2,0)","v":1},"2017","0005",1,"1",{"$f":"VLOOKUP(LEFT(E10,2),条件!A:B,2,0)","v":"09"},212017000510109,3]
[{"$f":"IF(検索!$U$1=\"条件検索\", IF(M11=\"○\", COUNTIFS(M:M,\"○\",AF:AF,\"<\"&AF11)+1, \"-\"), IF(検索!$U$1=\"技術名検索\", IF(検索!$B$33=仕様の整理!E11, 仕様の整理!AF11, \"-\"), \"-\"))","v":13},8,"11-1","ビックス工法","QS-990009-VG","NETIS掲載期間終了技術","○","令和6年11月","ひび割れ注入工法",null,null,null,"○","○","","","","○","","","",{"$f":"HLOOKUP($C11,DB!$1:$1048576,9,0)","v":"-"},"VG",2,{"$f":"VLOOKUP(W11,条件!D:E,2,0)","v":2},"1999","0009",1,"1",{"$f":"VLOOKUP(LEFT(E11,2),条件!A:B,2,0)","v":"01"},221999000910101,13]
[{"$f":"IF(検索!$U$1=\"条件検索\", IF(M12=\"○\", COUNTIFS(M:M,\"○\",AF:AF,\"<\"&AF12)+1, \"-\"), IF(検索!$U$1=\"技術名検索\", IF(検索!$B$33=仕様の整理!E12, 仕様の整理!AF12, \"-\"), \"-\"))","v":14},9,"11-2","ビックス工法","QS-990009-VG","NETIS掲載期間終了技術","○","令和6年11月","ひび割れ注入工法",null,null,"○","○","○","","","","○","","","",{"$f":"HLOOKUP($C12,DB!$1:$1048576,9,0)","v":"-"},"VG",2,{"$f":"VLOOKUP(W12,条件!D:E,2,0)","v":2},"1999","0009",1,"2",{"$f":"VLOOKUP(LEFT(E12,2),条件!A:B,2,0)","v":"01"},221999000910201,14]
[{"$f":"IF(検索!$U$1=\"条件検索\", IF(M13=\"○\", COUNTIFS(M:M,\"○\",AF:AF,\"<\"&AF13)+1, \"-\"), IF(検索!$U$1=\"技術名検索\", IF(検索!$B$33=仕様の整理!E13, 仕様の整理!AF13, \"-\"), \"-\"))","v":15},10,"11-3","ビックス工法","QS-990009-VG","NETIS掲載期間終了技術","○","令和6年11月","ひび割れ注入工法",null,null,"○","○","○","","","","○","","","",{"$f":"HLOOKUP($C13,DB!$1:$1048576,9,0)","v":"-"},"VG",2,{"$f":"VLOOKUP(W13,条件!D:E,2,0)","v":2},"1999","0009",1,"3",{"$f":"VLOOKUP(LEFT(E13,2),条件!A:B,2,0)","v":"01"},221999000910301,15]
[{"$f":"IF(検索!$U$1=\"条件検索\", IF(M14=\"○\", COUNTIFS(M:M,\"○\",AF:AF,\"<\"&AF14)+1, \"-\"), IF(検索!$U$1=\"技術名検索\", IF(検索!$B$33=仕様の整理!E14, 仕様の整理!AF14, \"-\"), \"-\"))","v":16},11,"11-4","ビックス工法","QS-990009-VG","NETIS掲載期間終了技術","○","令和6年11月","ひび割れ注入工法","○",null,null,"○","○","","","","○","","","",{"$f":"HLOOKUP($C14,DB!$1:$1048576,9,0)","v":"-"},"VG",2,{"$f":"VLOOKUP(W14,条件!D:E,2,0)","v":2},"1999","0009",1,"4",{"$f":"VLOOKUP(LEFT(E14,2),条件!A:B,2,0)","v":"01"},221999000910401,16]
[{"$f":"IF(検索!$U$1=\"条件検索\", IF(M15=\"○\", COUNTIFS(M:M,\"○\",AF:AF,\"<\"&AF15)+1, \"-\"), IF(検索!$U$1=\"技術名検索\", IF(検索!$B$33=仕様の整理!E15, 仕様の整理!AF15, \"-\"), \"-\"))","v":18},12,"12-1","アルファー・ゾル-G注入工法","SK-050009-VG","NETIS掲載期間終了技術","○","令和6年11月","ひび割れ注入工法","○","○","○","○","○","","","","○","","","",{"$f":"HLOOKUP($C15,DB!$1:$1048576,9,0)","v":"-"},"VG",2,{"$f":"VLOOKUP(W15,条件!D:E,2,0)","v":2},"2005","0009",1,"1",{"$f":"VLOOKUP(LEFT(E15,2),条件!A:B,2,0)","v":"02"},222005000910102,18]
[{"$f":"IF(検索!$U$1=\"条件検索\", IF(M16=\"○\", COUNTIFS(M:M,\"○\",AF:AF,\"<\"&AF16)+1, \"-\"), IF(検索!$U$1=\"技術名検索\", IF(検索!$B$33=仕様の整理!E16, 仕様の整理!AF16, \"-\"), \"-\"))","v":11},13,"13-1","ハイスタッフ","QS-980215-VG","NETIS掲載期間終了技術","○","令和6年11月","ひび割れ注入工法","○","-",null,"○","○","","","","○","","","",{"$f":"HLOOKUP($C16,DB!$1:$1048576,9,0)","v":"-"},"VG",2,{"$f":"VLOOKUP(W16,条件!D:E,2,0)","v":2},"1998","0215",1,"1",{"$f":"VLOOKUP(LEFT(E16,2),条件!A:B,2,0)","v":"01"},221998021510101,11]
[{"$f":"IF(検索!$U$1=\"条件検索\", IF(M17=\"○\", COUNTIFS(M:M,\"○\",AF:AF,\"<\"&AF17)+1, \"-\"), IF(検索!$U$1=\"技術名検索\", IF(検索!$B$33=仕様の整理!E17, 仕様の整理!AF17, \"-\"), \"-\"))","v":12},14,"13-2","ハイスタッフ","QS-980215-VG","NETIS掲載期間終了技術","○","令和6年11月","ひび割れ注入工法","○","-",null,"○","○","","","","○","","","",{"$f":"HLOOKUP($C17,DB!$1:$1048576,9,0)","v":"-"},"VG",2,{"$f":"VLOOKUP(W17,条件!D:E,2,0)","v":2},"1998","0215",1,"2",{"$f":"VLOOKUP(LEFT(E17,2),条件!A:B,2,0)","v":"01"},221998021510201,12]
[{"$f":"IF(検索!$U$1=\"条件検索\", IF(M18=\"○\", COUNTIFS(M:M,\"○\",AF:AF,\"<\"&AF18)+1, \"-\"), IF(検索!$U$1=\"技術名検索\", IF(検索!$B$33=仕様の整理!E18, 仕様の整理!AF18, \"-\"), \"-\"))","v":17},15,"14-1","ビトパッカー工法","KK-020003-VG","NETIS掲載期間終了技術","○","令和6年11月","ひび割れ注入工法","○","○","○","○","○","","","","○","","","",{"$f":"HLOOKUP($C18,DB!$1:$1048576,9,0)","v":"-"},"VG",2,{"$f":"VLOOKUP(W18,条件!D:E,2,0)","v":2},"2002","0003",1,"1",{"$f":"VLOOKUP(LEFT(E18,2),条件!A:B,2,0)","v":"04"},222002000310104,17]
[{"$f":"IF(検索!$U$1=\"条件検索\", IF(M19=\"○\", COUNTIFS(M:M,\"○\",AF:AF,\"<\"&AF19)+1, \"-\"), IF(検索!$U$1=\"技術名検索\", IF(検索!$B$33=仕様の整理!E19, 仕様の整理!AF19, \"-\"), \"-\"))","v":19},16,"15-1","IPHシステム内圧充填接合補強工法","CG-070007-VG","NETIS掲載期間終了技術","○","令和6年11月","ひび割れ注入工法","○","○",null,"○","○","","","","○","","","",{"$f":"HLOOKUP($C19,DB!$1:$1048576,9,0)","v":"-"},"VG",2,{"$f":"VLOOKUP(W19,条件!D:E,2,0)","v":2},"2007","0007",1,"1",{"$f":"VLOOKUP(LEFT(E19,2),条件!A:B,2,0)","v":"03"},222007000710103,19]
[{"$f":"IF(検索!$U$1=\"条件検索\", IF(M20=\"○\", COUNTIFS(M:M,\"○\",AF:AF,\"<\"&AF20)+1, \"-\"), IF(検索!$U$1=\"技術名検索\", IF(検索!$B$33=仕様の整理!E20, 仕様の整理!AF20, \"-\"), \"-\"))","v":4},17,"16-1","ミクストグラウト","CG-180004-A","事後評価未実施技術","○","令和6年11月","ひび割れ注入工法","○","○",null,"○","○","","","","○","","","",{"$f":"HLOOKUP($C20,DB!$1:$1048576,9,0)","v":"-"},"A",2,{"$f":"VLOOKUP(W20,条件!D:E,2,0)","v":1},"2018","0004",1,"1",{"$f":"VLOOKUP(LEFT(E20,2),条件!A:B,2,0)","v":"03"},212018000410103,4]
[{"$f":"IF(検索!$U$1=\"条件検索\", IF(M21=\"○\", COUNTIFS(M:M,\"○\",AF:AF,\"<\"&AF21)+1, \"-\"), IF(検索!$U$1=\"技術名検索\", IF(検索!$B$33=仕様の整理!E21, 仕様の整理!AF21, \"-\"), \"-\"))","v":5},18,"17-1","バジリスクER7 液体ひび割れ補修剤","HK-180017-A","事後評価未実施技術","○","令和6年11月","ひび割れ被覆工法",null,null,null,"○","○","","","","○","","","",{"$f":"HLOOKUP($C21,DB!$1:$1048576,9,0)","v":"-"},"A",2,{"$f":"VLOOKUP(W21,条件!D:E,2,0)","v":1},"2018","0017",1,"1",{"$f":"VLOOKUP(LEFT(E21,2),条件!A:B,2,0)","v":"09"},212018001710109,5]
[{"$f":"IF(検索!$U$1=\"条件検索\", IF(M22=\"○\", COUNTIFS(M:M,\"○\",AF:AF,\"<\"&AF22)+1, \"-\"), IF(検索!$U$1=\"技術名検索\", IF(検索!$B$33=仕様の整理!E22, 仕様の整理!AF22, \"-\"), \"-\"))","v":6},19,"18-1","アルカリ反応型高圧注入剤(アウターシール剤)","KT-180135-A","事後評価未実施技術","○","令和6年11月","ひび割れ注入工法","○","○",null,"○","○","","","","○","","","",{"$f":"HLOOKUP($C22,DB!$1:$1048576,9,0)","v":"-"},"A",2,{"$f":"VLOOKUP(W22,条件!D:E,2,0)","v":1},"2018","0135",1,"1",{"$f":"VLOOKUP(LEFT(E22,2),条件!A:B,2,0)","v":"07"},212018013510107,6]
[{"$f":"IF(検索!$U$1=\"条件検索\", IF(M23=\"○\", COUNTIFS(M:M,\"○\",AF:AF,\"<\"&AF23)+1, \"-\"), IF(検索!$U$1=\"技術名検索\", IF(検索!$B$33=仕様の整理!E23, 仕様の整理!AF23, \"-\"), \"-\"))","v":7},20,"19-1","e-ジェクター工法「自動式樹脂注入工法」","KK-190024-A","事後評価未実施技術","○","令和6年11月","ひび割れ注入工法",null,null,null,"○","○","","","","○","","","",{"$f":"HLOOKUP($C23,DB!$1:$1048576,9,0)","v":"-"},"A",2,{"$f":"VLOOKUP(W23,条件!D:E,2,0)","v":1},"2019","0024",1,"1",{"$f":"VLOOKUP(LEFT(E23,2),条件!A:B,2,0)","v":"04"},212019002410104,7]
[{"$f":"IF(検索!$U$1=\"条件検索\", IF(M24=\"○\", COUNTIFS(M:M,\"○\",AF:AF,\"<\"&AF24)+1, \"-\"), IF(検索!$U$1=\"技術名検索\", IF(検索!$B$33=仕様の整理!E24, 仕様の整理!AF24, \"-\"), \"-\"))","v":9},21,"20-1","UG-Ⅰグラウト工法","KK-200030-A","事後評価未実施技術","○","令和6年11月","ひび割れ注入工法","○","○",null,"○","○","","","","○","","","",{"$f":"HLOOKUP($C24,DB!$1:$1048576,9,0)","v":"-"},"A",2,{"$f":"VLOOKUP(W24,条件!D:E,2,0)","v":1},"2020","0030",1,"1",{"$f":"VLOOKUP(LEFT(E24,2),条件!A:B,2,0)","v":"04"},212020003010104,9]
[{"$f":"IF(検索!$U$1=\"条件検索\", IF(M25=\"○\", COUNTIFS(M:M,\"○\",AF:AF,\"<\"&AF25)+1, \"-\"), IF(検索!$U$1=\"技術名検索\", IF(検索!$B$33=仕様の整理!E25, 仕様の整理!AF25, \"-\"), \"-\"))","v":8},22,"21-1","ひび割れへのシールテープ「せこたん」を用いた手動式低圧注入工法","TH-200001-A","事後評価未実施技術","○","令和6年11月","ひび割れ注入工法","○",null,null,"○","○","","","","○","","","",{"$f":"HLOOKUP($C25,DB!$1:$1048576,9,0)","v":"-"},"A",2,{"$f":"VLOOKUP(W25,条件!D:E,2,0)","v":1},"2020","0001",1,"1",{"$f":"VLOOKUP(LEFT(E25,2),条件!A:B,2,0)","v":"08"},212020000110108,8]
[{"$f":"IF(検索!$U$1=\"条件検索\", IF(M26=\"○\", COUNTIFS(M:M,\"○\",AF:AF,\"<\"&AF26)+1, \"-\"), IF(検索!$U$1=\"技術名検索\", IF(検索!$B$33=仕様の整理!E26, 仕様の整理!AF26, \"-\"), \"-\"))","v":1},23,"22-1","浸透性アクリル系樹脂注入材「クラックブロック」","QS-230015-A","九州の技術","○","令和7年2月","ひび割れ注入工法","○",null,null,"○","○","","","","○","","","",{"$f":"HLOOKUP($C26,DB!$1:$1048576,9,0)","v":"◎"},"A",1,{"$f":"VLOOKUP(W26,条件!D:E,2,0)","v":1},"2023","0015",1,"1",{"$f":"VLOOKUP(LEFT(E26,2),条件!A:B,2,0)","v":"01"},112023001510101,1]
[{"$f":"IF(検索!$U$1=\"条件検索\", IF(M27=\"○\", COUNTIFS(M:M,\"○\",AF:AF,\"<\"&AF27)+1, \"-\"), IF(検索!$U$1=\"技術名検索\", IF(検索!$B$33=仕様の整理!E27, 仕様の整理!AF27, \"-\"), \"-\"))","v":10},24,"23-1","コンクリートひび割れ補修工法　「ミクロカプセルGP工法」","KT-230319-A","事後評価未実施技術",null,"令和6年3月","ひび割れ注入工法","○",null,null,"○","○","","","","○","","","",{"$f":"HLOOKUP($C27,DB!$1:$1048576,9,0)","v":"-"},"A",2,{"$f":"VLOOKUP(W27,条件!D:E,2,0)","v":1},"2023","0319",2,"1",{"$f":"VLOOKUP(LEFT(E27,2),条件!A:B,2,0)","v":"07"},212023031920107,10]

{"sheet":"条件","index":6,"n_rows":20,"n_cols":9,"rows_kept":20,"cut":false,"hidden":false,"merged":[]}
[null,null,null,null,null,"検索用"]
["QS","01",null,"VR",1,null,"CG-110003-VG","CS-21ひび割れ補修セット",{"$f":"IF(LEN(G2)-LEN(SUBSTITUTE(G2,\"-\",\"\"))>=2,LEFT(G2,FIND(\"-\",G2,FIND(\"-\",G2)+1)-1),G2)","v":"CG-110003"}]
["QSK","01",null,"VE",1,null,"CG-110017-VG","リハビリシリンダー工法",{"$f":"IF(LEN(G3)-LEN(SUBSTITUTE(G3,\"-\",\"\"))>=2,LEFT(G3,FIND(\"-\",G3,FIND(\"-\",G3)+1)-1),G3)","v":"CG-110017"}]
["SK","02",null,"AE",1,null,"KT-120057-VG","ショーボンドCAP工法","KT-120057"]
["SKK","02",null,"A",1,null,"CB-130007-VG","ひび割れ補修浸透性エポキシ樹脂塗布工法","CB-130007"]
["CG","03",null,"VG",2,null,"KT-160095-VR","ハイドロフィット工法(含浸複合注入工法)","KT-160095"]
["CGK","03",null,null,null,null,"HK-170005-VR","ハイブリッドエポキシ樹脂","HK-170005"]
["KK","04",null,null,null,null,"QS-990009-VG","ビックス工法","QS-990009"]
["KKK","04",null,null,null,null,"SK-050009-VG","アルファー・ゾル-G注入工法","SK-050009"]
["CB","05",null,null,null,null,"QS-980215-VG","ハイスタッフ","QS-980215"]
["CBK","05",null,null,null,null,"KK-020003-VG","ビトパッカー工法","KK-020003"]
["HR","06",null,null,null,null,"CG-070007-VG","IPHシステム内圧充填接合補強工法","CG-070007"]
["HRK","06",null,null,null,null,"CG-180004-A","ミクストグラウト","CG-180004"]
["KT","07",null,null,null,null,"HK-180017-A","バジリスクER7 液体ひび割れ補修剤","HK-180017"]
["KTK","07",null,null,null,null,"KT-180135-A","アルカリ反応型高圧注入剤(アウターシール剤)","KT-180135"]
["TH","08",null,null,null,null,"KK-190024-A","e-ジェクター工法「自動式樹脂注入工法」","KK-190024"]
["THK","08",null,null,null,null,"KK-200030-A","UG-Ⅰグラウト工法","KK-200030"]
["HK","09",null,null,null,null,"TH-200001-A","ひび割れへのシールテープ「せこたん」を用いた手動式低圧注入工法","TH-200001"]
["HKK","09",null,null,null,null,"QS-230015-A","浸透性アクリル系樹脂注入材「クラックブロック」","QS-230015"]
["TS",10,null,null,null,null,"KT-230319-A","コンクリートひび割れ補修工法　「ミクロカプセルGP工法」","KT-230319"]

{"sheet":"同意書","index":7,"n_rows":22,"n_cols":3,"rows_kept":22,"cut":false,"hidden":false,"merged":[[3,2,3,18],[4,2,4,18],[5,2,5,18]]}
[]
[null,"工法比較表データベース借用同意書"]
[]
[null,"業務名・工事名"]
[null,"会社名"]
[null,"氏名"]
[]
[]
[]
[null,"借用者は、工法比較法データベース（以下「DB」と称する）を九州技術事務所から借用する場合に際し、以下の事項を遵守することを同意いたします。 "]
[null,"（使用目的）","1).借用者は、DBを借用申請書に記載された業務・工事にのみ使用します。なお、DBのリバースエンジニアリング、配布及び公衆送信等はいかなる目的においても行いません。"]
[null,"（使用範囲)","2).DBの使用は、九州地方整備局管内の業務・工事における関係者に限定します。"]
[null,"（データの複製）","3).借用者は、九州技術事務所から借用したデータの複製は行いません。"]
[null,"（権利関係）","4).DB及びDBを利用したものに係わる権利は、いずれも借用者に帰属しないことを確認します。"]
[null,"（守秘義務）","5).借用者は、DBによって知り得た情報を他に漏らしません。"]
[null,"（免責事項）","6).借用者は、DBの使用によって損害及び紛争等が生じても、九州技術事務所が一切責任を負わないことに同意します。 "]
[null,"（同意内容の変更）","7).借用者は、この同意書の内容に変更が生じた場合、その変更が生じた日から２週間以内に九州技術事務所（qsr-kyugi-netis@ki.mlit.go.jp）へ報告します。"]
[null,"（利用実態調査の記入）","8).借用者は、利用実態調査を正確かつ誠実に記入し、利用期限内に提出することを同意します。"]
[null,"（協議事項）","9).借用者は、本同意書に定めのない事項及び本同意書に関して疑義が生じた事項に関しては、九州技術事務所（qsr-kyugi-netis@ki.mlit.go.jp）と協議します。  "]
[]
[]
[null,"同意"]