{"text_format":"1","workbook":"xlsx","n_sheets":8,"sheets":["検索","更新履歴","詳細版","簡易版","DB","仕様の整理","条件","同意書"],"not_rendered":{"charts":0,"images":5,"macros":1,"external_links":0,"defined_names":13,"comments":0,"pivot_tables":0},"unopened":[],"bounds":{"document_bytes":16777216,"sheet_cells":100000,"rows_first":2000,"rows_last":500,"rows_between":2000,"halvings":0,"cell_chars":16384,"cell_head_chars":4096},"cells_cut":0,"cells_raw":0,"read":"whole","date_system":"1900"}

{"sheet":"検索","index":0,"n_rows":27,"n_cols":21,"rows_kept":27,"cut":false,"hidden":false,"merged":[[29,1,29,3],[29,6,29,12],[3,13,3,14]]}
[null,null,null,null,null,null,null,null,null,null,null,null,"ver.",2.38,null,"借用同意書：",null,"問い合わせ先："," kouhouhikakuhyou-db@kyugikyo.or.jp",null,"条件検索"]
[null,null,null,null,null,null,null,null,null,null,null,null,null,null,null,"ご利用期間：","2026-02-10","～",{"$f":"IF(Q2=\"\",\"\",EOMONTH(Q2, 0))","v":"2026-02-28"}]
[null,null,null,null,null,null,null,null,null,null,null,null,null,null,null,{"$f":"仕様の整理!F1","v":"2技術2仕様"},{"$f":"仕様の整理!H1","v":"2技術2仕様"},{"$f":"\"検索結果：全\"&$P$3&\"仕様の内、\"&$Q$3&\"が検索されました。\"","v":"検索結果：全2技術2仕様仕様の内、2技術2仕様が検索されました。"}]
["本システムは、毎月NETIS情報を確認し、追加があれば更新していきますので、最新版を入手してお使いください。",null,null,null,null,null,null,null,null,null,null,null,null,"令和4年1月現在",null,null,null,null,{"$f":"\"工法比較表検索結果[\"&$P$3&\"の内、\"&$Q$3&\"]\"","v":"工法比較表検索結果[2技術2仕様の内、2技術2仕様]"}]
[]
[]
[]
[]
[null,null,null,null,null,null,null,null,null,null,null,null,null,null,null,null,true]
[null,null,null,null,null,null,null,null,null,null,null,null,null,null,null,null,true]
[]
[]
[]
[]
[]
[]
[]
[]
[]
[]
[]
[]
[]
[]
[]
[]
["新技術の検索"]

{"sheet":"更新履歴","index":1,"n_rows":145,"n_cols":2,"rows_kept":145,"cut":false,"hidden":false,"merged":[]}
[null,"■更新履歴"]
[null,"2018/03/15＜Ver1.00＞"]
[null,"・Ver1.00アップロード"]
[]
[null,"2018/4/27\n＜Ver1.04＞"]
[null,"・NETIS掲載期間終了技術（有用な新技術、活用の多い技術以外）1技術を削除しました。"]
[]
[null,"2018/05/29\n＜Ver1.05＞"]
[null,"・新規登録は無し。"]
[]
[null,"2018/06/28\n＜Ver1.06＞"]
[null,"・新規登録は無し。"]
[]
[null,"2018/07/31\n＜Ver1.07＞"]
[null,"・新規登録は無し。"]
[]
[null,"2018/08/31\n＜Ver1.08＞"]
[null,"・新規登録は無し。"]
[]
[null,"2018/09/28\n＜Ver1.09＞"]
[null,"・新規登録は無し。"]
[]
[null,"2018/10/31\n＜Ver1.10＞"]
[null,"・新規登録は無し。"]
[]
[null,"2018/11/30\n＜Ver1.11＞"]
[null,"・ＮＥＴＩＳ登録状況を確認し1技術を新規登録しました（NETIS申請情報のみ）。"]
[]
[null,"2018/12/25\n＜Ver1.12＞"]
[null,"・新規登録は無し。"]
[]
[null,"2019/1/31\n＜Ver1.13＞"]
[null,"・新規登録は無し。"]
[null,"・NETIS掲載期間終了技術（有用な新技術、活用の多い技術以外）1技術を削除しました。"]
[]
[null,"2019/2/28\n＜Ver1.14＞"]
[null,"・新規登録は無し。"]
[]
[null,"2019/3/29\n＜Ver1.15＞"]
[null,"・新規登録は無し。"]
[]
[null,"2019/4/26\n＜Ver2.04＞"]
[null,"・新規登録は無し。"]
[]
[null,"2019/5/31\n＜Ver2.05＞"]
[null,"・新規登録は無し。"]
[]
[null,"2019/6/28\n＜Ver2.06＞"]
[null,"・新規登録は無し。"]
[]
[null,"2019/7/31\n＜Ver2.07＞"]
[null,"・新規登録は無し。"]
[]
[null,"2019/8/30\n＜Ver2.08＞"]
[null,"・新規登録は無し。"]
[]
[null,"2019/9/30\n＜Ver2.09＞"]
[null,"・新規登録は無し。"]
[]
[null,"2019/10/31\n＜Ver2.10＞"]
[null,"・新規登録は無し。"]
[]
[null,"2019/11/29\n＜Ver2.11＞"]
[null,"・新規登録は無し。"]
[]
[null,"2019/12/31\n＜Ver2.12＞"]
[null,"・新規登録は無し。"]
[]
[null,"2020/1/31\n＜Ver2.13＞"]
[null,"・新規登録は無し。"]
[]
[null,"2020/2/28\n＜Ver2.14＞"]
[null,"・新規登録は無し。"]
[]
[null,"2020/3/31\n＜Ver2.15＞"]
[null,"・新規登録は無し。"]
[]
[null,"2020/4/30\n＜Ver2.16＞"]
[null,"・新規登録は無し。"]
[]
{"$rows_left_out":66}
{"sheet":"詳細版","index":2,"n_rows":61,"n_cols":5,"rows_kept":61,"cut":false,"hidden":false,"merged":[[4,0,20,0],[4,1,4,4],[4,5,4,7],[4,8,4,10],[5,2,5,4],[5,5,5,7],[5,8,5,10],[6,2,6,4],[6,5,6,7],[6,8,6,10],[7,2,7,4],[7,5,7,7],[7,8,7,10],[14,8,14,10],[15,3,15,4],[15,5,15,7],[15,8,15,10],[16,3,16,4],[16,5,16,7],[16,8,16,10],[12,1,19,1],[12,2,19,2],[12,3,12,4],[12,5,12,7],[2,5,2,7],[2,8,2,10],[3,5,3,7],[3,8,3,10],[10,2,10,4],[10,5,10,7],[10,8,10,10],[11,2,11,4],[11,5,11,7],[11,8,11,10],[8,2,8,4],[8,5,8,7],[8,8,8,10],[9,2,9,4],[9,5,9,7],[9,8,9,10],[12,8,12,10],[13,3,13,4],[13,5,13,7],[13,8,13,10],[14,3,14,4],[14,5,14,7],[19,3,19,4],[19,5,19,7],[19,8,19,10],[20,2,20,4],[20,5,20,7],[20,8,20,10],[17,3,17,4],[17,5,17,7],[17,8,17,10],[18,3,18,4],[18,5,18,7],[18,8,18,10],[27,5,27,7],[27,8,27,10],[28,5,28,7],[28,8,28,10],[29,0,29,4],[29,5,29,7],[29,8,29,10],[24,5,24,7],[24,8,24,10],[25,5,25,7],[25,8,25,10],[26,5,26,7],[26,8,26,10],[21,0,28,0],[21,1,28,1],[21,2,21,3],[21,5,21,7],[21,8,21,10],[22,2,28,3],[22,5,22,7],[22,8,22,10],[23,5,23,7],[23,8,23,10],[33,6,33,7],[33,9,33,10],[34,6,34,7],[34,9,34,10],[35,2,35,4],[35,6,35,7],[35,9,35,10],[30,0,56,0],[30,1,30,4],[30,6,30,7],[30,9,30,10],[31,1,34,1],[31,2,34,3],[31,6,31,7],[31,9,31,10],[32,6,32,7],[32,9,32,10],[39,5,39,7],[39,8,39,10],[40,5,40,7],[40,8,40,10],[41,5,41,7],[41,8,41,10],[36,2,36,4],[36,6,36,7],[36,9,36,10],[37,2,38,3],[37,6,37,7],[37,9,37,10],[38,6,38,7],[38,9,38,10],[39,2,42,3],[48,2,48,4],[48,5,48,7],[48,8,48,10],[49,2,49,4],[49,5,49,7],[49,8,49,10],[42,5,42,7],[42,8,42,10],[43,1,47,1],[43,2,47,2],[43,3,43,4],[44,3,45,4],[46,3,46,4],[47,3,47,4],[47,5,47,7],[47,8,47,10],[37,1,42,1],[54,5,54,7],[54,8,54,10],[50,1,52,1],[50,2,52,3],[50,5,50,7],[50,8,50,10],[51,5,51,7],[51,8,51,10],[52,5,52,7],[52,8,52,10],[60,0,60,4],[3,0,3,4],[57,0,59,0],[57,2,57,4],[57,5,57,7],[57,8,57,10],[58,2,58,4],[58,5,58,7],[58,8,58,10],[59,2,59,4],[59,5,59,7],[59,8,59,10],[55,2,55,4],[55,5,55,7],[55,8,55,10],[56,2,56,4],[56,5,56,7],[56,8,56,10],[53,1,54,1],[53,2,54,2],[53,3,53,4],[53,5,53,7],[53,8,53,10],[54,3,54,4]]}
[]
["コンクリート構造物補修工（電気防食工法）"]
[{"$f":"検索!S4","v":"工法比較表検索結果[2技術2仕様の内、2技術2仕様]"}]
[]
["ＮＥＴＩＳ情報","技術名"]
[null,"①","ＮＥＴＩＳ登録番号"]
[null,"②","技術の位置付け（有用な新技術）"]
[null,"③","開発者（本社が存在する都道府県）"]
[null,"④","開発者における九州地方との関連性（九州登録九州本社：◎、九州外登録九州本社：○、九州に共同開発者有り：△、その他：－）"]
[null,"⑤","九州地方への機能性（九州地方に支店等を有する場合：○、その他：－）"]
[null,"⑥","技術概要"]
[null,"⑦","概要図"]
[null,"⑧","施工条件・適用条件等","種類"]
[null,null,null,"適用対象"]
[null,null,null,"陽極設置方法"]
[null,null,null,"適用気温"]
[null,null,null,"適用部位"]
[null,null,null,"設置面積"]
[null,null,null,"現場条件"]
[null,null,null,"維持管理"]
[null,"⑨","比較する従来技術"]
["評価情報","⑩","評価基準",null,"項目"]
[null,null,"・A：従来技術より極めて優れる\n・B：従来技術より優れる\n・C：従来技術と同等\n・D：従来技術より劣る",null,"経済性"]
[null,null,null,null,"工程"]
[null,null,null,null,"品質・出来形"]
[null,null,null,null,"安全性"]
[null,null,null,null,"施工性"]
[null,null,null,null,"環境"]
[null,null,null,null,"総合評価"]
["統一した従来技術"]
["補完調査情報"]
[null,"⑪","概算施工費用　注1）",null,"施工費"]
[null,null,null,null,"材料費"]
[null,null,null,null,"合計"]
[null,null,null,null,"備考"]
[null,"⑫","概算施工日数"]
[null,"⑬","施工規模"]
[null,"⑭","統一した従来技術との比較",null,"経済性"]
[null,null,null,null,"工程"]
[null,null,"判定の凡例\n○：従来技術より優れる\n△：従来技術と同程度\n－：上記以外",null,"品質・出来形"]
[null,null,null,null,"安全性"]
[null,null,null,null,"施工性"]
[null,null,null,null,"環境"]
[null,"⑮","陽極システムの性能","要求性能"]
[null,null,null,"耐久性能"]
[]
[null,null,null,"防食性能"]
[null,null,null,"その他の試験"]
[null,"⑯","実施している性能評価試験"]
[null,"⑰","耐用年数"]
[null,"⑱","施工実績\n(過去3年)",null,"国土交通省：活用効果調査表数"]
[null,null,null,null,"地方自治体：開発者ヒアリング"]
[null,null,null,null,"その他：開発者ヒアリング"]
[null,"⑲","特許等","特許"]
[null,null,null,"建設技術審査証明"]
[null,"⑳","生産供給体制（機械保有台数等）"]
[null,"㉑","備考"]
["総括","㉒","耐久性"]
[null,"㉓","施工性\n(留意事項含む）"]
[null,"㉔","その他（留意事項含む）"]
["注1）施工費用：2020年4月福岡県久留米市　注2）／：補完調査未実施"]

{"sheet":"簡易版","index":3,"n_rows":6,"n_cols":26,"rows_kept":6,"cut":false,"hidden":false,"merged":[[4,25,5,25],[4,19,4,24],[4,18,5,18],[4,17,5,17],[4,3,5,3],[4,4,5,4],[4,5,5,5],[4,6,5,6],[4,7,5,7],[4,8,4,10],[4,11,4,13],[4,14,4,16]]}
[null,null,null,"コンクリート構造物補修工（電気防食工法）"]
[null,null,null,{"$f":"検索!S4","v":"工法比較表検索結果[2技術2仕様の内、2技術2仕様]"}]
[]
[]
[null,null,null,"番号","技術名","NETIS番号","開発者","種類","耐久性能1",null,null,"耐久性能2",null,null,"防食性能",null,null,"対象面積当り\n概算施工費用","対象面積当り\n概算施工日数","統一した従来技術との比較",null,null,null,null,null,"概要"]
[null,null,null,null,null,null,null,null,"実施された試験","基準・比較対象","試験結果","実施された試験","基準・比較対象","試験結果","実施された試験","基準・比較対象","試験結果",null,null,"経済性","工程","品質・出来形","安全性","施工性","環境"]

{"sheet":"DB","index":4,"n_rows":84,"n_cols":11,"rows_kept":84,"cut":false,"hidden":false,"merged":[[78,8,78,10],[80,8,80,10],[81,8,81,10],[82,8,82,10],[83,8,83,10],[62,8,62,10],[63,8,63,10],[64,8,64,10],[65,8,65,10],[66,8,66,10],[67,8,67,10],[68,8,68,10],[76,8,76,10],[77,8,77,10],[83,3,83,4],[62,5,62,7],[63,5,63,7],[64,5,64,7],[65,5,65,7],[66,5,66,7],[67,5,67,7],[68,5,68,7],[76,5,76,7],[77,5,77,7],[78,5,78,7],[80,5,80,7],[81,5,81,7],[82,5,82,7],[83,5,83,7],[62,1,62,4],[63,1,66,1],[63,2,66,3],[67,2,67,4],[68,2,68,4],[76,3,77,4],[78,3,78,4],[81,3,82,4],[71,5,71,7],[47,3,47,4],[30,6,30,7],[31,6,31,7],[32,6,32,7],[33,6,33,7],[34,6,34,7],[35,6,35,7],[36,6,36,7],[37,6,37,7],[38,6,38,7],[31,2,34,3],[44,3,45,4],[46,3,46,4],[60,0,60,4],[47,5,47,7],[48,2,48,4],[48,5,48,7],[35,2,35,4],[43,1,47,1],[36,2,36,4],[57,0,59,0],[57,2,57,4],[56,2,56,4],[30,0,56,0],[30,1,30,4],[55,2,55,4],[54,3,54,4],[53,1,54,1],[53,2,54,2],[53,3,53,4],[50,1,52,1],[50,2,52,3],[49,2,49,4],[37,1,42,1],[31,1,34,1],[43,3,43,4],[43,2,47,2],[2,5,2,7],[3,5,3,7],[59,2,59,4],[58,2,58,4],[14,3,14,4],[15,3,15,4],[16,3,16,4],[39,2,42,3],[12,3,12,4],[11,2,11,4],[58,5,58,7],[59,5,59,7],[51,5,51,7],[52,5,52,7],[53,5,53,7],[24,5,24,7],[25,5,25,7],[26,5,26,7],[27,5,27,7],[37,2,38,3],[20,2,20,4],[19,3,19,4],[17,3,17,4],[29,0,29,4],[22,2,28,3],[21,0,28,0],[21,1,28,1],[21,2,21,3],[4,0,20,0],[4,1,4,4],[5,2,5,4],[10,2,10,4],[9,2,9,4],[8,2,8,4],[7,2,7,4],[6,2,6,4],[13,3,13,4],[12,1,19,1],[12,2,19,2],[18,3,18,4],[54,5,54,7],[55,5,55,7],[56,5,56,7],[57,5,57,7],[21,5,21,7],[22,5,22,7],[23,5,23,7],[14,5,14,7],[15,5,15,7],[16,5,16,7],[49,5,49,7],[17,5,17,7],[19,5,19,7],[20,5,20,7],[28,5,28,7],[29,5,29,7],[18,5,18,7],[12,5,12,7],[13,5,13,7],[50,5,50,7],[39,5,39,7],[40,5,40,7],[41,5,41,7],[42,5,42,7],[4,5,4,7],[5,5,5,7],[6,5,6,7],[7,5,7,7],[8,5,8,7],[9,5,9,7],[10,5,10,7],[11,5,11,7],[2,8,2,10],[3,8,3,10],[4,8,4,10],[5,8,5,10],[6,8,6,10],[7,8,7,10],[8,8,8,10],[9,8,9,10],[10,8,10,10],[11,8,11,10],[12,8,12,10],[13,8,13,10],[14,8,14,10],[15,8,15,10],[16,8,16,10],[17,8,17,10],[18,8,18,10],[19,8,19,10],[20,8,20,10],[21,8,21,10],[22,8,22,10],[23,8,23,10],[24,8,24,10],[25,8,25,10],[26,8,26,10],[27,8,27,10],[28,8,28,10],[29,8,29,10],[30,9,30,10],[31,9,31,10],[32,9,32,10],[33,9,33,10],[34,9,34,10],[35,9,35,10],[36,9,36,10],[37,9,37,10],[38,9,38,10],[39,8,39,10],[40,8,40,10],[41,8,41,10],[42,8,42,10],[47,8,47,10],[48,8,48,10],[49,8,49,10],[50,8,50,10],[51,8,51,10],[52,8,52,10],[53,8,53,10],[54,8,54,10],[55,8,55,10],[56,8,56,10],[57,8,57,10],[58,8,58,10],[59,8,59,10],[72,5,72,7],[73,5,73,7],[74,5,74,7],[69,5,69,7],[70,5,70,7],[69,8,69,10],[70,8,70,10],[71,8,71,10],[72,8,72,10],[73,8,73,10],[74,8,74,10]]}
[null,null,null,null,null,"5-1",null,null,"6-1"]
["電気防食工",null,null,null,null,{"$f":"IF(LEN(VLOOKUP(F1,仕様の整理!$C:$E,3,0))-LEN(SUBSTITUTE(VLOOKUP(F1,仕様の整理!$C:$E,3,0),\"-\",\"\"))>=2,LEFT(VLOOKUP(F1,仕様の整理!$C:$E,3,0),FIND(\"-\",VLOOKUP(F1,仕様の整理!$C:$E,3,0),FIND(\"-\",VLOOKUP(F1,仕様の整理!$C:$E,3,0))+1)-1),VLOOKUP(F1,仕様の整理!$C:$E,3,0))","v":"CB-020037"},null,null,{"$f":"IF(LEN(VLOOKUP(I1,仕様の整理!$C:$E,3,0))-LEN(SUBSTITUTE(VLOOKUP(I1,仕様の整理!$C:$E,3,0),\"-\",\"\"))>=2,LEFT(VLOOKUP(I1,仕様の整理!$C:$E,3,0),FIND(\"-\",VLOOKUP(I1,仕様の整理!$C:$E,3,0),FIND(\"-\",VLOOKUP(I1,仕様の整理!$C:$E,3,0))+1)-1),VLOOKUP(I1,仕様の整理!$C:$E,3,0))","v":"KT-180059"}]
[null,null,null,null,null,{"$f":"IFERROR(\"作成日：\"&VLOOKUP(F$1,仕様の整理!$C:$O,6,0),\"-\")","v":"作成日：令和3年12月"},null,null,{"$f":"IFERROR(\"作成日：\"&VLOOKUP(I$1,仕様の整理!$C:$O,6,0),\"-\")","v":"作成日：令和3年12月"}]
[null,null,null,null,null,"電源方式：流電陽極方式、陽極システムの形状：点状陽極方式",null,null,"電源方式：流電陽極方式、陽極システムの形状：線状陽極方式"]
["ＮＥＴＩＳ情報","技術名",null,null,null,{"$f":"IF(VLOOKUP(F$1,仕様の整理!$C:$O,4,0)=\"NETIS掲載期間終了技術\",VLOOKUP(F$1,仕様の整理!$C:$O,2,0),VLOOKUP(F$1,仕様の整理!$C:$O,2,0)&\"（\"&VLOOKUP(F$1,仕様の整理!$C:$O,4,0)&\"）\")&IF(VLOOKUP(F$1,仕様の整理!$C:$O,5,0)=\"○\",\"\",\"《新規登録技術》\")","v":"犠牲陽極材「ガルバシールド工法」"},null,null,{"$f":"IF(VLOOKUP(I$1,仕様の整理!$C:$O,4,0)=\"NETIS掲載期間終了技術\",VLOOKUP(I$1,仕様の整理!$C:$O,2,0),VLOOKUP(I$1,仕様の整理!$C:$O,2,0)&\"（\"&VLOOKUP(I$1,仕様の整理!$C:$O,4,0)&\"）\")&IF(VLOOKUP(I$1,仕様の整理!$C:$O,5,0)=\"○\",\"\",\"《新規登録技術》\")","v":"線状流電陽極方式電気防食工法（事後評価未実施技術）"}]
[null,"①","ＮＥＴＩＳ登録番号",null,null,{"$f":"IF(VLOOKUP(F$1,仕様の整理!$C:$J,4,0)=\"NETIS掲載期間終了技術\",\"NETIS掲載期間終了技術\",VLOOKUP(F$1,仕様の整理!$C:$J,3,0))","v":"NETIS掲載期間終了技術"},null,null,{"$f":"IF(VLOOKUP(I$1,仕様の整理!$C:$J,4,0)=\"NETIS掲載期間終了技術\",\"NETIS掲載期間終了技術\",VLOOKUP(I$1,仕様の整理!$C:$J,3,0))","v":"KT-180059-A"}]
[null,"②","技術の位置付け（有用な新技術）",null,null,"評価済み",null,null,"-"]
[null,"③","開発者（本社が存在する都道府県）",null,null,"フォスロック・インターナショナル・リミテッド（代理店：クリディエンス株式会社）（東京都）",null,null," 株式会社ナカボーテック（東京都）"]
[null,"④","開発者における九州地方との関連性（九州登録九州本社：◎、九州外登録九州本社：○、九州に共同開発者有り：△、その他：－）",null,null,"-",null,null,"-"]
[null,"⑤","九州地方への機能性（九州地方に支店等を有する場合：○、その他：－）",null,null,"-",null,null,"○（九州地方に支店を有する）"]
[null,"⑥","技術概要",null,null,"ガルバシールド工法は塩害・中性化等で劣化したコンクリート構造物の鉄筋腐食を亜鉛との電気化学的作用により抑制し、レンダロックモルタルにて断面修復する工法です。 ",null,null,"本技術は、コンクリート中の鋼材腐食に対し、線状の流電陽極ユニットを用いて防食する電気防食工法であり、従来は亜鉛シート方式電気防食工法(面状流電陽極方式)で対応していた。本技術の活用により、躯体の変状を目視観察可能となり、安全性の向上が図れた。"]
[null,"⑦","概要図"]
[null,"⑧","施工条件・適用条件等","種類",null,"電気防食工法（流電陽極方式、点状陽極方式（断面修復工を併用））",null,null,"電気防食工法（流電陽極方式、線状陽極方式）"]
[null,null,null,"適用対象",null,"全てのコンクリート構造物(例えば、橋梁、桟橋、ボックスカルバートなど)。塩害、中性化、凍結融解などにより鉄筋腐食が進行している、予測できるコンクリート構造物。",null,null,"RC構造物、PC構造物"]
[null,null,null,"陽極設置方法",null,"はつり後の鉄筋に薄型の亜鉛陽極を取り付け、断面修復を行う",null,null,"NAKAROD陽極（流電陽極材と電解質層をFRP製トラフで覆った陽極ユニット）をビスを用いて設置"]
[null,null,null,"適用気温",null,"外気温が0℃以上であること(材料が凍結しないこと)。断面修復は外気温が5℃以上であること",null,null,"【5℃～】"]
[null,null,null,"適用部位",null,"陽極からのかぶりは最低20mm必要【DASシリーズ：大気中部～海中部に適用可能】",null,null,"没水部、湾曲面以外の大気中部【飛沫帯部、干満帯部については適用を目指して性能検証中】"]
[null,null,null,"設置面積",null,"【DASシリーズ：φ20×1000mm～】",null,null,"【材料寸法：幅100mm×延長1000mm】"]
[null,null,null,"現場条件",null,"適切な作業スペースが確保されていること　",null,null,"陽極ユニッ トの設置作業ができる1m×0.5m=0.5㎡程度の作業スペースが必要"]
[null,null,null,"維持管理",null,"施工後はメンテナンスフリー、DASシリーズ：対応年数35年(材料により異なる)経過後に再施工",null,null,"設置から3年程度は年に1回の点検を行い、その後は5年に一度、橋梁点検要領に従って点検を行う【定期点検：初年度2回/年、初年度以降1 回/年　詳細点検：1 回/5年】"]
[null,"⑨","比較する従来技術",null,null,"断面修復工法(亜硝酸リチウム40%濃度混入)",null,null,"亜鉛シート方式電気防食工法(面状流電陽極方式)"]
["評価情報","⑩","評価基準",null,"項目","最新の活用効果評価結果,所見",null,null,"最新の活用効果評価結果,所見"]
[null,null,"・A：従来技術より極めて優れる\n・B：従来技術より優れる\n・C：従来技術と同等\n・D：従来技術より劣る",null,"経済性","C:-",null,null,"-"]
[null,null,null,null,"工程","D:留意事項：補修箇所の鉄筋の状態の把握が、斫り作業を終えなければ掴めないため、その対策に時間を要したという理由で劣る。",null,null,"-"]
[null,null,null,null,"品質・出来形","B:所見：安定した電気化学的反応が期待でき、腐食抑制に期待できる。",null,null,"-"]
[null,null,null,null,"安全性","C:-",null,null,"-"]
[null,null,null,null,"施工性","C:-",null,null,"-"]
[null,null,null,null,"環境","C:-",null,null,"-"]
[null,null,null,null,"総合評価","C:-",null,null,"-"]
["統一した従来技術",null,null,null,null,"電気防食工法（流電陽極方式、点状陽極方式）（経済性、工程は比較対象としない）",null,null,"電気防食工法（流電陽極方式、線状陽極方式）（経済性、工程は比較対象としない）"]
["補完調査情報",null,null,null,null,"従来技術","新技術",null,"従来技術","新技術"]
[null,"⑪","施工費用　注1）",null,"施工費","-",4225,null,"-",17900]
[null,null,null,null,"材料費","-",64000,null,"-",113900]
[null,null,null,null,"合計","-",68225,null,"-",131800]
[null,null,null,null,"備考","-","※1陽極材2本/㎡とした場合とする。\n※2陽極設置工のみの単価であり、はつり工、断面修復工を別途要する。",null,"-","※開発者の回答は「照合電極・端子類設置工、陽極設置工、モニタリングボックス設置工」の合計である。"]
[null,"⑫","施工日数",null,null,"-",6.7000000000000004E-2,null,"-",0.18]
[null,"⑬","施工規模",null,null,"-","2本/㎡",null,"-",100]
[null,"⑭","統一した従来技術との比較",null,"経済性","-","-",null,"-","-"]
[null,null,null,null,"工程","-","-",null,"-","-"]
[null,null,"判定の凡例\n○：従来技術より優れる\n△：従来技術と同程度\n－：上記以外",null,"品質・出来形","△：従来技術と同程度",null,null,"△：従来技術と同程度"]
[null,null,null,null,"安全性","△：従来技術と同程度",null,null,"△：従来技術と同程度"]
[null,null,null,null,"施工性","△：従来技術と同程度",null,null,"○：陽極のユニット化により施工性が向上"]
[null,null,null,null,"環境","△：従来技術と同程度",null,null,"△：従来技術と同程度"]
[null,"⑮","陽極システムの性能","要求性能",null,"実施された試験","基準・比較対象","試験結果","実施された試験","基準・比較対象","試験結果"]
[null,null,null,"耐久性能",null,"耐用年数","-","・DASシリーズ：最長35年","同一の材料を使用している亜鉛シート方式の耐久性評価（自社試験）","自社基準：陽極の設計耐用年数15年\n　電解質層の比抵抗　100Ω・㎝以下\n　FRP材の引張強度　80MPa以上\n　FRP材の曲げ強度　100MPa以上","施工後17年\n　電解質層の比抵抗　38.2Ω・㎝\n　FRP材の引張強度　平均142.7MPa\n　FRP材の曲げ強度　平均264.6MPa"]
[null,null,null,null,null,"-","-","-","加速試験によるNAKAROD方式電気防食工法の耐久性試験（自社試験）","設計耐用年数30年（陽極質量減少率50％）\n　積算電流量65.7Ah\n　電流密度25mA/㎡×0.01㎡×30年相当","積算電流量66.36Ahこのとき陽極質量減少率13.3％であった。"]
[null,null,null,"防食性能",null,"防食レベル","・電気防食（進行中の腐食を止める、復極量100mV以上）","・DASシリーズ：適用可能な性能を有する。","実構造物に対する試験施工（自社試験）","コンクリートライブラリー107\n復極量100mV以上","点検時に復極量100mV以上を確認。"]
[null,null,null,"その他の試験",null,"-",null,null,"-"]
[null,"⑯","実施している性能評価試験",null,null,"-",null,null,"-"]
[null,"⑰","耐用年数",null,null,"陽極の設計寿命35年（腐食環境により前後）（平成29年度時点で実績15年以上）",null,null,"陽極耐久性試験の試験結果30年（平成30年度時点で実績4年）"]
[null,"⑱","施工実績\n（過去３年）",null,"国土交通省：活用効果調査表数","39件（九州で7件）",null,null,"0件（九州で0件）"]
[null,null,null,null,"地方自治体：開発者ヒアリング","250件（九州で30件）",null,null,"9件（九州で0件）"]
[null,null,null,null,"その他：開発者ヒアリング","600件（九州で110件）",null,null,"2件（九州で0件）"]
[null,"⑲","特許等","特許",null,"第3099830号「鉄筋コンクリートの陰極防食工法」",null,null,"-"]
[null,null,null,"建設技術審査証明",null,"-",null,null,"-"]
[null,"⑳","生産供給体制（機械保有台数等）",null,null,"受注から納品まで2日程度（在庫保有の場合）",null,null,"-"]
[null,"㉑","備考",null,null,"注意事項：復数の製品仕様が1技術としてNETISに登録されているため活用にあたっては各現場毎の用途について開発者に問い合わせを行うものとする（本工法比較表においては、ガルバシールドDAS025での施工費用、施工日数（2本/1㎡とした場合）としている）。\n・ガルバシールドXP（鉄筋防錆用：亜鉛重量60g）：4,500円/個　　・ガルバシールドCC135、CC65（腐食抑制用：亜鉛重量60g）：4,500円/個\n・ガルバシールドXP2（腐食抑制用：亜鉛重量100g）：5,000円/個　　・ガルバシールドXP4（腐食抑制用：亜鉛重量160g）：7,700円/個\n・ガルバシールドDAS025（電気防食用：亜鉛重量370g）：24,000円/本　　・ガルバシールドDAS060（電気防食用：亜鉛重量890g）：32,000円/本\n［鉄筋防錆（新しい腐食の発生の抑制、マクロセル腐食対策）、腐食抑制（進行中の腐食の抑制）、電気防食（進行中の腐食を止める、復極量100mV以上）］",null,null,"-"]
["総括","㉒","耐久性",null,null,"・亜鉛を犠牲とする犠牲陽極材「ガルバシールド工法」を用いて防錆を行い、レンダロックモルタルにて断面修復する技術（補完情報より）。\n・断面修復時に鉄筋に設置することにより、マクロセル腐食の抑制が可能である。また腐食の進行に応じた陽極材を選定することにより、腐食の抑制、または腐食を止めることが可能である（補完情報より）。\n・ガルバシールドDASシリーズは、復極量の基準値100mV以上に適用可能な性能を有する（補完情報より）。",null,null,"・流電陽極方式であるため、交流電源の確保が難しい場所にも適用可能。・電圧・電流調整が不要で、落雷などによる停電の影響を受けないため保安管理が容易。・部分断面修復をした箇所にマクロセル腐食防止対策として部分的に適用することが可能。・陽極形状が線状であるため、コンクリート表面の変状目視観察が可能。（補完情報より）。\n・防食効果確認試験において、復極量の基準値100mV以上を満足させることができている（補完情報より）。\n・施工後17年（設計寿命15年）の同一の材料を使用しているシート陽極の耐久性評価において、電解質層の比抵抗は基準値100Ω・cmを下回っている。またFRP材の引張強度、曲げ強度は基準値80MPa、100MPaを上回っている（補完情報より）。"]
[null,"㉓","施工性\n(留意事項含む）",null,null,"・本技術は鉄筋に陽極を固定するため、断面修復工との併用となる（NETIS情報より）。\n・ガルバシールドは完全に固定するよう取り付けること（NETIS情報より）。\n・断面修復前に、必ずガルバシールドに十分な水打ちを行うこと（NETIS情報より）。",null,null,"・流電陽極材と電解質層をFRP製トラフで覆い、ユニット化したことにより、構成部材が減り、施工が簡略化されたため、施工性が向上し、工期を短縮できた（NETIS情報より）。"]
[null,"㉔","その他（留意事項含む）",null,null,"・ガルバシールドのタイプについては、防錆レベル(適用レベル)を、塩分量、対応年数等により、鉄筋防錆、腐食抑制、電気防食のいずれかに決定する（NETIS情報、補完情報より）。\n・ガルバシールドの設置間隔は鉄筋量(鉄筋表面積)により変化するので、カタログの換算式から設置間隔を決定する（NETIS情報より）。\n・設置間隔、有効半径、年数は、レンダロックモルタルが基準となり設定されている（NETIS情報より）。\n・維持管理については、防食期間を通して、要求される防食性能を維持できるように、維持管理計画を策定し、電気防食装置の維持管理を適切に行うこと（WGからのコメント）。",null,null,"・九州地方（国土交通省）での活用実績はない（評価情報より）。\n・試験結果は自社試験によるものである（補完情報より）。\n・維持管理については、防食期間を通して要求される防食性能を維持できるように維持管理計画を策定し、電気防食装置の維持管理を適切に行うこと（WGからのコメント）。"]
["注1）施工費用：2025年4月福岡県久留米市　注2）／：補完調査未実施"]
[]
[null,null,null,null,null,{"$f":"G31","v":"新技術"},null,null,{"$f":"J31","v":"新技術"}]
[null,"⑪","施工費用　注1）",null,"施工費",{"$f":"G32","v":4225},null,null,{"$f":"J32","v":17900}]
[null,null,null,null,"材料費",64000,null,null,113900]
[null,null,null,null,"合計",68225,null,null,131800]
[null,null,null,null,"備考","※1陽極材2本/㎡とした場合とする。\n※2陽極設置工のみの単価であり、はつり工、断面修復工を別途要する。",null,null,"※開発者の回答は「照合電極・端子類設置工、陽極設置工、モニタリングボックス設置工」の合計である。"]
[null,"⑫","施工日数",null,null,6.7000000000000004E-2,null,null,0.18]
[null,"⑬","施工規模",null,null,"2本/㎡",null,null,100]
[null,null,null,null,null,{"$f":"G38","v":"-"},null,null,"-"]
[null,null,null,null,null,"-",null,null,"-"]
[null,null,null,null,null,{"$f":"LEFT(F40,1)","v":"△"},null,null,{"$f":"LEFT(I40,1)","v":"△"}]
[null,null,null,null,null,{"$f":"LEFT(F41,1)","v":"△"},null,null,{"$f":"LEFT(I41,1)","v":"△"}]
[null,null,null,null,null,{"$f":"LEFT(F42,1)","v":"△"},null,null,{"$f":"LEFT(I42,1)","v":"○"}]
[null,null,null,null,null,{"$f":"LEFT(F43,1)","v":"△"},null,null,{"$f":"LEFT(I43,1)","v":"△"}]
[]
[null,null,null,"耐久性能",null,{"$f":"G45","v":"-"},null,null,{"$f":"J45","v":"自社基準：陽極の設計耐用年数15年\n　電解質層の比抵抗　100Ω・㎝以下\n　FRP材の引張強度　80MPa以上\n　FRP材の曲げ強度　100MPa以上"}]
[null,null,null,null,null,{"$f":"G46","v":"-"},null,null,{"$f":"J46","v":"設計耐用年数30年（陽極質量減少率50％）\n　積算電流量65.7Ah\n　電流密度25mA/㎡×0.01㎡×30年相当"}]
[null,null,null,"防食性能",null,{"$f":"G47","v":"・電気防食（進行中の腐食を止める、復極量100mV以上）"},null,null,{"$f":"J47","v":"コンクリートライブラリー107\n復極量100mV以上"}]
[]
{"$rows_left_out":5}
{"sheet":"仕様の整理","index":5,"n_rows":5,"n_cols":22,"rows_kept":5,"cut":false,"hidden":false,"merged":[[1,10,2,10]]}
[null," 対象工種の仕様の整理",null,null,"登録技術：",{"$f":"SUMPRODUCT((E4:E1000<>\"\")/COUNTIF(E4:E1000,E4:E1000&\"\"))&\"技術\"&MAX(B:B)&\"仕様\"","v":"2技術2仕様"},"検索結果：",{"$f":"\"\"&SUM(IF((A4:A1000<>\"\")*(A4:A1000<>\"-\")*(E4:E1000<>\"\"),1/COUNTIFS(A4:A1000,\"<>\",A4:A1000,\"<>-\",E4:E1000,E4:E1000)))&\"技術\"&COUNT(A:A)&\"仕様\"","v":"2技術2仕様"},null,null,"→検索結果","→絶対順位"]
[null,"基本情報",null,null,null,null,null,null,null,null,"条件一致"]
["検索順位","番号","技術\n番号","技術名","NETIS登録番号","技術の種類","審議終了技術","更新日","電源方式","陽極の形状",null,"九州本社","Aの技術","九州でA","記号","登録年度","登録番号","審議終了","仕様","地整","重み付け","絶対順位"]
[{"$f":"IF(検索!$U$1=\"条件検索\", IF(K4=\"○\", COUNTIFS(K:K,\"○\",V:V,\"<\"&V4)+1, \"-\"), IF(検索!$U$1=\"技術名検索\", IF(検索!$B$30=仕様の整理!E4, 仕様の整理!V4, \"-\"), \"-\"))","v":2},1,"5-1","犠牲陽極材「ガルバシールド工法」","CB-020037-VG","NETIS掲載期間終了技術","○","令和3年12月","流電陽極方式","線状陽極方式",{"$f":"IF(検索!Q9=TRUE,\"○\",\"×\")","v":"○"},{"$f":"HLOOKUP($C4,DB!$1:$1048576,9,0)","v":"-"},{"$f":"RIGHT(E4,LEN(E4)-FIND(\"-\",E4,FIND(\"-\",E4)+1))","v":"VG"},{"$f":"IF(AND(L4=\"◎\",M4=\"A\"),1,2)","v":2},{"$f":"VLOOKUP(M4,条件!D:E,2,0)","v":2},{"$f":"IFERROR(IF(VALUE(LEFT(MID(E4,FIND(\"-\",E4)+1,FIND(\"-\",E4,FIND(\"-\",E4)+1)-FIND(\"-\",E4)-1),2))>=90,\"19\"&LEFT(MID(E4,FIND(\"-\",E4)+1,FIND(\"-\",E4,FIND(\"-\",E4)+1)-FIND(\"-\",E4)-1),2),\"20\"&LEFT(MID(E4,FIND(\"-\",E4)+1,FIND(\"-\",E4,FIND(\"-\",E4)+1)-FIND(\"-\",E4)-1),2)),\"\")","v":"2002"},{"$f":"MID(E4, FIND(\"-\", E4) + 3, FIND(\"-\", E4, FIND(\"-\", E4) + 1) - FIND(\"-\", E4) - 3)","v":"0037"},{"$f":"IF(G4=\"\",2,1)","v":1},{"$f":"MID(C4,FIND(\"-\",C4)+1,LEN(C4))","v":"1"},{"$f":"VLOOKUP(LEFT(E4,2),条件!A:B,2,0)","v":"05"},{"$f":"(N4&O4&P4&Q4&R4&TEXT(S4,\"00\")&T4)*1","v":222002003710105},{"$f":"_xlfn.RANK.EQ(U4,U:U,1)","v":2}]
[{"$f":"IF(検索!$U$1=\"条件検索\", IF(K5=\"○\", COUNTIFS(K:K,\"○\",V:V,\"<\"&V5)+1, \"-\"), IF(検索!$U$1=\"技術名検索\", IF(検索!$B$30=仕様の整理!E5, 仕様の整理!V5, \"-\"), \"-\"))","v":1},2,"6-1","線状流電陽極方式電気防食工法","KT-180059-A","事後評価未実施技術","○","令和3年12月","流電陽極方式","点状陽極方式",{"$f":"IF(検索!Q10=TRUE,\"○\",\"×\")","v":"○"},{"$f":"HLOOKUP($C5,DB!$1:$1048576,9,0)","v":"-"},{"$f":"RIGHT(E5,LEN(E5)-FIND(\"-\",E5,FIND(\"-\",E5)+1))","v":"A"},{"$f":"IF(AND(L5=\"◎\",M5=\"A\"),1,2)","v":2},{"$f":"VLOOKUP(M5,条件!D:E,2,0)","v":1},{"$f":"IFERROR(IF(VALUE(LEFT(MID(E5,FIND(\"-\",E5)+1,FIND(\"-\",E5,FIND(\"-\",E5)+1)-FIND(\"-\",E5)-1),2))>=90,\"19\"&LEFT(MID(E5,FIND(\"-\",E5)+1,FIND(\"-\",E5,FIND(\"-\",E5)+1)-FIND(\"-\",E5)-1),2),\"20\"&LEFT(MID(E5,FIND(\"-\",E5)+1,FIND(\"-\",E5,FIND(\"-\",E5)+1)-FIND(\"-\",E5)-1),2)),\"\")","v":"2018"},{"$f":"MID(E5, FIND(\"-\", E5) + 3, FIND(\"-\", E5, FIND(\"-\", E5) + 1) - FIND(\"-\", E5) - 3)","v":"0059"},{"$f":"IF(G5=\"\",2,1)","v":1},{"$f":"MID(C5,FIND(\"-\",C5)+1,LEN(C5))","v":"1"},{"$f":"VLOOKUP(LEFT(E5,2),条件!A:B,2,0)","v":"07"},{"$f":"(N5&O5&P5&Q5&R5&TEXT(S5,\"00\")&T5)*1","v":212018005910107},{"$f":"_xlfn.RANK.EQ(U5,U:U,1)","v":1}]

{"sheet":"条件","index":6,"n_rows":24,"n_cols":17,"rows_kept":24,"cut":false,"hidden":false,"merged":[[22,8,23,8],[23,13,23,15],[23,16,23,18],[23,10,23,12],[22,16,22,18],[22,13,22,15],[22,10,22,12],[20,8,21,9],[20,10,20,18],[21,10,21,12],[21,13,21,15],[21,16,21,18]]}
[null,null,null,null,null,"検索用"]
["QS","01",null,"VR",1,null,"CB-020037-VG","犠牲陽極材「ガルバシールド工法」",{"$f":"IF(LEN(G2)-LEN(SUBSTITUTE(G2,\"-\",\"\"))>=2,LEFT(G2,FIND(\"-\",G2,FIND(\"-\",G2)+1)-1),G2)","v":"CB-020037"}]
["QSK","01",null,"VE",1,null,"KT-180059-A","線状流電陽極方式電気防食工法",{"$f":"IF(LEN(G3)-LEN(SUBSTITUTE(G3,\"-\",\"\"))>=2,LEFT(G3,FIND(\"-\",G3,FIND(\"-\",G3)+1)-1),G3)","v":"KT-180059"}]
["SK","02",null,"AE",1]
["SKK","02",null,"A",1]
["CG","03",null,"VG",2]
["CGK","03"]
["KK","04"]
["KKK","04"]
["CB","05"]
["CBK","05"]
["HR","06"]
["HRK","06"]
["KT","07"]
["KTK","07"]
["TH","08"]
["THK","08"]
["HK","09"]
["HKK","09"]
["TS",10]
[null,null,null,null,null,null,null,null,null,null,"陽極システムの形状"]
[null,null,null,null,null,null,null,null,null,null,"面上陽極",null,null,"線状陽極",null,null,"点状陽極"]
[null,null,null,null,null,null,null,null,"電源方式","外部電源","-",null,null,"-",null,null,"-"]
[null,null,null,null,null,null,null,null,null,"流電陽極","-",null,null,"線状流電陽極方式電気防食工法",null,null,"犠牲陽極材「ガルバシールド工法」"]

{"sheet":"同意書","index":7,"n_rows":22,"n_cols":3,"rows_kept":22,"cut":false,"hidden":false,"merged":[[3,2,3,18],[4,2,4,18],[5,2,5,18]]}
[]
[null,"工法比較表データベース借用同意書"]
[]
[null,"業務名・工事名"]
[null,"会社名"]
[null,"氏名"]
[]
[]
[]
[null,"借用者は、工法比較法データベース（以下「DB」と称する）を九州技術事務所から借用する場合に際し、以下の事項を遵守することを同意いたします。 "]
[null,"（使用目的）","1).借用者は、DBを借用申請書に記載された業務・工事にのみ使用します。なお、DBのリバースエンジニアリング、配布及び公衆送信等はいかなる目的においても行いません。"]
[null,"（使用範囲)","2).DBの使用は、九州地方整備局管内の業務・工事における関係者に限定します。"]
[null,"（データの複製）","3).借用者は、九州技術事務所から借用したデータの複製は行いません。"]
[null,"（権利関係）","4).DB及びDBを利用したものに係わる権利は、いずれも借用者に帰属しないことを確認します。"]
[null,"（守秘義務）","5).借用者は、DBによって知り得た情報を他に漏らしません。"]
[null,"（免責事項）","6).借用者は、DBの使用によって損害及び紛争等が生じても、九州技術事務所が一切責任を負わないことに同意します。 "]
[null,"（同意内容の変更）","7).借用者は、この同意書の内容に変更が生じた場合、その変更が生じた日から２週間以内に九州技術事務所（qsr-kyugi-netis@ki.mlit.go.jp）へ報告します。"]
[null,"（利用実態調査の記入）","8).借用者は、利用実態調査を正確かつ誠実に記入し、利用期限内に提出することを同意します。"]
[null,"（協議事項）","9).借用者は、本同意書に定めのない事項及び本同意書に関して疑義が生じた事項に関しては、九州技術事務所（qsr-kyugi-netis@ki.mlit.go.jp）と協議します。  "]
[]
[]
[null,"同意"]