{"text_format":"1","workbook":"xlsx","n_sheets":8,"sheets":["検索","更新履歴","詳細版","簡易版","DB","仕様の整理","条件","同意書"],"not_rendered":{"charts":0,"images":10,"macros":1,"external_links":0,"defined_names":12,"comments":0,"pivot_tables":0},"unopened":[],"bounds":{"document_bytes":16777216,"sheet_cells":100000,"rows_first":2000,"rows_last":500,"rows_between":2000,"halvings":0,"cell_chars":16384,"cell_head_chars":4096},"cells_cut":0,"cells_raw":0,"read":"whole","date_system":"1900"}

{"sheet":"検索","index":0,"n_rows":18,"n_cols":21,"rows_kept":18,"cut":false,"hidden":false,"merged":[[20,1,20,3],[20,6,20,12],[3,13,3,14]]}
[null,null,null,null,null,null,null,null,null,null,null,null,"ver.","1.00",null,"借用同意書：",null,"問い合わせ先："," kouhouhikakuhyou-db@kyugikyo.or.jp",null,"条件検索"]
[null,null,null,null,null,null,null,null,null,null,null,null,null,null,null,"ご利用期間：","2026-02-10","～",{"$f":"IF(Q2=\"\",\"\",EOMONTH(Q2, 0))","v":"2026-02-28"}]
[null,null,null,null,null,null,null,null,null,null,null,null,null,null,null,{"$f":"仕様の整理!F1","v":"9技術9仕様"},{"$f":"仕様の整理!H1","v":"9技術9仕様"},{"$f":"\"検索結果：全\"&$P$3&\"仕様の内、\"&$Q$3&\"が検索されました。\"","v":"検索結果：全9技術9仕様仕様の内、9技術9仕様が検索されました。"},{"$f":"\"検索条件：\"&_xlfn.TEXTJOIN(\",\",,R7,R8)","v":"検索条件：リフレクションクラック防止シート,シール材注入工法"}]
["本システムは、毎月NETIS情報を確認し、追加があれば更新していきますので、最新版を入手してお使いください。",null,null,null,null,null,null,null,null,null,null,null,null,"令和8年1月現在",null,null,null,null,{"$f":"\"工法比較表検索結果[\"&$P$3&\"の内、\"&$Q$3&\"]\"","v":"工法比較表検索結果[9技術9仕様の内、9技術9仕様]"}]
[]
[]
[null,null,null,null,null,null,null,null,null,null,null,null,null,null,null,"リフレクションクラック防止シート",true,{"$f":"IF(Q7=TRUE,P7,\"\")","v":"リフレクションクラック防止シート"}]
[null,null,null,null,null,null,null,null,null,null,null,null,null,null,null,"シール材注入工法",true,{"$f":"IF(Q8=TRUE,P8,\"\")","v":"シール材注入工法"}]
[]
[]
[]
[]
[]
[]
[]
[]
[]
["新技術の検索"]

{"sheet":"更新履歴","index":1,"n_rows":3,"n_cols":2,"rows_kept":3,"cut":false,"hidden":false,"merged":[]}
[null,"■更新履歴"]
[null,"2026/2/1＜Ver1.00＞"]
[null,"・初版アップロード"]

{"sheet":"詳細版","index":2,"n_rows":76,"n_cols":5,"rows_kept":76,"cut":false,"hidden":false,"merged":[[2,29,2,31],[2,5,2,7],[2,8,2,10],[2,11,2,13],[2,14,2,16],[2,17,2,19],[2,20,2,22],[2,23,2,25],[2,26,2,28],[4,17,4,19],[4,20,4,22],[4,23,4,25],[4,26,4,28],[4,29,4,31],[5,2,5,4],[5,5,5,7],[5,8,5,10],[5,11,5,13],[5,14,5,16],[4,1,4,4],[4,5,4,7],[4,8,4,10],[4,11,4,13],[4,14,4,16],[5,17,5,19],[5,20,5,22],[5,23,5,25],[5,26,5,28],[5,29,5,31],[6,29,6,31],[7,2,7,4],[7,5,7,7],[7,8,7,10],[7,11,7,13],[7,14,7,16],[7,17,7,19],[7,20,7,22],[7,23,7,25],[7,26,7,28],[7,29,7,31],[6,2,6,4],[6,5,6,7],[6,8,6,10],[6,11,6,13],[6,14,6,16],[6,17,6,19],[6,20,6,22],[6,23,6,25],[6,26,6,28],[8,29,8,31],[9,2,9,4],[9,5,9,7],[9,8,9,10],[9,11,9,13],[9,14,9,16],[9,17,9,19],[9,20,9,22],[9,23,9,25],[9,26,9,28],[9,29,9,31],[8,2,8,4],[8,5,8,7],[8,8,8,10],[8,11,8,13],[8,14,8,16],[8,17,8,19],[8,20,8,22],[8,23,8,25],[8,26,8,28],[10,29,10,31],[11,2,11,4],[11,5,11,7],[11,8,11,10],[11,11,11,13],[11,14,11,16],[11,17,11,19],[11,20,11,22],[11,23,11,25],[11,26,11,28],[11,29,11,31],[10,2,10,4],[10,5,10,7],[10,8,10,10],[10,11,10,13],[10,14,10,16],[10,17,10,19],[10,20,10,22],[10,23,10,25],[10,26,10,28],[12,1,16,1],[12,2,16,2],[12,3,12,4],[12,5,12,7],[12,8,12,10],[12,11,12,13],[12,14,12,16],[12,17,12,19],[12,20,12,22],[14,3,14,4],[14,5,14,7],[14,8,14,10],[14,11,14,13],[14,14,14,16],[14,17,14,19],[14,20,14,22],[16,3,16,4],[16,5,16,7],[16,8,16,10],[16,11,16,13],[16,14,16,16],[16,17,16,19],[16,20,16,22],[12,23,12,25],[12,26,12,28],[12,29,12,31],[13,3,13,4],[13,5,13,7],[13,8,13,10],[13,11,13,13],[13,14,13,16],[13,17,13,19],[13,20,13,22],[13,23,13,25],[13,26,13,28],[13,29,13,31],[14,23,14,25],[14,26,14,28],[14,29,14,31],[15,3,15,4],[15,5,15,7],[15,8,15,10],[15,11,15,13],[15,14,15,16],[15,17,15,19],[15,20,15,22],[15,23,15,25],[15,26,15,28],[15,29,15,31],[16,23,16,25],[16,26,16,28],[16,29,16,31],[17,2,17,4],[17,5,17,7],[17,8,17,10],[17,11,17,13],[17,14,17,16],[17,17,17,19],[17,20,17,22],[17,23,17,25],[17,26,17,28],[17,29,17,31],[18,2,18,4],[18,5,18,7],[18,8,18,10],[18,11,18,13],[18,14,18,16],[18,17,18,19],[18,20,18,22],[18,23,18,25],[18,26,18,28],[18,29,18,31],[19,0,26,0],[19,1,26,1],[19,2,19,3],[19,5,19,7],[19,8,19,10],[4,0,18,0],[19,29,19,31],[20,2,26,3],[20,5,20,7],[20,8,20,10],[20,11,20,13],[20,14,20,16],[20,17,20,19],[20,20,20,22],[20,23,20,25],[20,26,20,28],[19,11,19,13],[19,14,19,16],[19,17,19,19],[19,20,19,22],[19,23,19,25],[19,26,19,28],[20,29,20,31],[21,5,21,7],[21,8,21,10],[21,11,21,13],[21,14,21,16],[21,17,21,19],[21,20,21,22],[21,23,21,25],[21,26,21,28],[21,29,21,31],[22,23,22,25],[22,26,22,28],[22,29,22,31],[23,5,23,7],[23,8,23,10],[23,11,23,13],[23,14,23,16],[23,17,23,19],[23,20,23,22],[23,23,23,25],[22,5,22,7],[22,8,22,10],[22,11,22,13],[22,14,22,16],[22,17,22,19],[22,20,22,22],[23,26,23,28],[23,29,23,31],[24,5,24,7],[24,8,24,10],[24,11,24,13],[24,14,24,16],[24,17,24,19],[24,20,24,22],[24,23,24,25],[24,26,24,28],[24,29,24,31],[25,5,25,7],[25,8,25,10],[25,11,25,13],[25,14,25,16],[25,17,25,19],[25,20,25,22],[25,23,25,25],[25,26,25,28],[25,29,25,31],[26,23,26,25],[26,26,26,28],[26,29,26,31],[27,0,27,4],[27,5,27,7],[27,8,27,10],[27,11,27,13],[27,14,27,16],[27,17,27,19],[27,20,27,22],[26,5,26,7],[26,8,26,10],[26,11,26,13],[26,14,26,16],[26,17,26,19],[26,20,26,22],[29,1,33,1],[29,2,33,2],[29,3,29,4],[29,6,29,7],[29,9,29,10],[29,12,29,13],[27,23,27,25],[27,26,27,28],[27,29,27,31],[28,1,28,4],[28,6,28,7],[28,9,28,10],[28,12,28,13],[28,15,28,16],[28,18,28,19],[29,15,29,16],[29,18,29,19],[29,21,29,22],[29,24,29,25],[29,27,29,28],[29,30,29,31],[28,21,28,22],[28,24,28,25],[28,27,28,28],[28,30,28,31],[30,21,30,22],[30,24,30,25],[30,27,30,28],[30,30,30,31],[31,3,31,4],[31,6,31,7],[31,9,31,10],[31,12,31,13],[31,15,31,16],[31,18,31,19],[30,3,30,4],[30,6,30,7],[30,9,30,10],[30,12,30,13],[30,15,30,16],[30,18,30,19],[31,21,31,22],[31,24,31,25],[31,27,31,28],[31,30,31,31],[32,30,32,31],[33,3,33,4],[33,6,33,7],[33,9,33,10],[33,12,33,13],[33,15,33,16],[33,18,33,19],[33,21,33,22],[33,24,33,25],[33,27,33,28],[33,30,33,31],[32,3,32,4],[32,6,32,7],[32,9,32,10],[32,12,32,13],[32,15,32,16],[32,18,32,19],[32,21,32,22],[32,24,32,25],[32,27,32,28],[34,2,34,4],[34,6,34,7],[34,9,34,10],[34,12,34,13],[34,15,34,16],[34,18,34,19],[34,21,34,22],[34,24,34,25],[34,27,34,28],[34,30,34,31],[35,1,40,1],[35,2,36,3],[35,6,35,7],[35,9,35,10],[35,12,35,13],[35,15,35,16],[35,18,35,19],[35,21,35,22],[35,24,35,25],[35,27,35,28],[35,30,35,31],[36,6,36,7],[36,9,36,10],[36,12,36,13],[36,15,36,16],[36,18,36,19],[36,21,36,22],[36,24,36,25],[36,27,36,28],[36,30,36,31],[37,2,40,3],[37,5,37,7],[37,8,37,10],[37,11,37,13],[37,14,37,16],[37,17,37,19],[37,20,37,22],[37,23,37,25],[37,26,37,28],[37,29,37,31],[38,5,38,7],[38,8,38,10],[38,11,38,13],[38,14,38,16],[38,17,38,19],[38,20,38,22],[38,23,38,25],[38,26,38,28],[38,29,38,31],[40,14,40,16],[40,17,40,19],[40,20,40,22],[40,23,40,25],[40,26,40,28],[40,29,40,31],[39,5,39,7],[39,8,39,10],[39,11,39,13],[39,14,39,16],[39,17,39,19],[39,20,39,22],[39,23,39,25],[39,26,39,28],[39,29,39,31],[55,27,55,28],[55,30,55,31],[41,3,54,3],[41,6,41,7],[41,9,41,10],[41,12,41,13],[41,15,41,16],[41,18,41,19],[41,21,41,22],[63,29,63,31],[64,2,64,4],[64,5,64,7],[64,8,64,10],[64,11,64,13],[64,14,64,16],[64,17,64,19],[64,20,64,22],[64,23,64,25],[64,26,64,28],[64,29,64,31],[41,2,63,2],[63,3,63,4],[63,5,63,7],[63,8,63,10],[63,11,63,13],[63,14,63,16],[63,17,63,19],[63,20,63,22],[41,27,41,28],[41,30,41,31],[55,3,62,3],[55,6,55,7],[55,9,55,10],[65,29,65,31],[66,5,66,7],[66,8,66,10],[66,11,66,13],[66,14,66,16],[66,17,66,19],[66,20,66,22],[66,23,66,25],[66,26,66,28],[66,29,66,31],[65,5,65,7],[65,8,65,10],[65,11,65,13],[65,14,65,16],[65,17,65,19],[65,20,65,22],[65,23,65,25],[67,29,67,31],[68,1,69,1],[68,2,69,2],[68,3,68,4],[68,5,68,7],[68,8,68,10],[68,11,68,13],[68,14,68,16],[68,17,68,19],[68,20,68,22],[68,23,68,25],[68,26,68,28],[68,29,68,31],[69,3,69,4],[69,5,69,7],[69,8,69,10],[69,11,69,13],[69,14,69,16],[69,17,69,19],[65,1,67,1],[65,2,67,3],[67,5,67,7],[67,8,67,10],[67,11,67,13],[70,29,70,31],[71,2,71,4],[71,5,71,7],[71,8,71,10],[71,11,71,13],[71,14,71,16],[71,17,71,19],[69,20,69,22],[69,23,69,25],[69,26,69,28],[69,29,69,31],[70,2,70,4],[70,5,70,7],[70,8,70,10],[70,11,70,13],[70,14,70,16],[70,17,70,19],[70,20,70,22],[70,23,70,25],[70,26,70,28],[71,29,71,31],[28,0,71,0],[74,2,74,4],[74,5,74,7],[74,8,74,10],[74,11,74,13],[74,14,74,16],[74,17,74,19],[74,20,74,22],[74,23,74,25],[41,24,41,25],[41,1,63,1],[72,0,74,0],[72,2,72,4],[72,5,72,7],[72,8,72,10],[72,11,72,13],[55,12,55,13],[55,15,55,16],[55,18,55,19],[55,21,55,22],[55,24,55,25],[40,5,40,7],[40,8,40,10],[40,11,40,13],[67,26,67,28],[65,26,65,28],[67,14,67,16],[67,17,67,19],[67,20,67,22],[67,23,67,25],[63,23,63,25],[63,26,63,28],[71,20,71,22],[71,23,71,25],[71,26,71,28],[74,29,74,31],[73,17,73,19],[73,20,73,22],[73,23,73,25],[73,26,73,28],[73,29,73,31],[72,29,72,31],[73,2,73,4],[73,5,73,7],[73,8,73,10],[73,11,73,13],[73,14,73,16],[74,26,74,28],[72,17,72,19],[72,20,72,22],[72,23,72,25],[72,26,72,28],[72,14,72,16]]}
[]
["舗装版ひび割れ補修工"]
[{"$f":"検索!S4","v":"工法比較表検索結果[9技術9仕様の内、9技術9仕様]"}]
[]
["ＮＥＴＩＳ情報","技術名"]
[null,"①","ＮＥＴＩＳ登録番号"]
[null,"②","技術の位置付け（有用な新技術）"]
[null,"③","開発者（本社が存在する都道府県）"]
[null,"④","開発者における九州地方との関連性（九州登録九州本社：◎、九州外登録九州本社：○、九州に共同開発者有り：△、その他：－）"]
[null,"⑤","九州地方への機能性（九州地方に支店等を有する場合：○、その他：－）"]
[null,"⑥","技術概要"]
[null,"⑦","概要図"]
[null,"⑧","施工条件・適用条件等","種類"]
[null,null,null,"仕様"]
[null,null,null,"適用範囲"]
[null,null,null,"適用不可範囲"]
[null,null,null,"設計・施工"]
[null,"⑨","比較する従来技術"]
[null,"⑩","工法の特徴"]
["評価情報 ","⑪","評価基準",null,"項目"]
[null,null,"A：従来技術より極めて優れる\nB：従来技術より優れる\nC：従来技術と同等\nD：従来技術より劣る",null,"経済性"]
[null,null,null,null,"工程"]
[null,null,null,null,"品質・出来形"]
[null,null,null,null,"安全性"]
[null,null,null,null,"施工性"]
[null,null,null,null,"環境"]
[null,null,null,null,"総合評価"]
["統一した従来技術"]
["補完調査情報"]
[null,"⑫","概算施工費用","機械・労務"]
[null,null,null,"材料"]
[null,null,null,"合計"]
[null,null,null,"備考"]
[null,null,null,"標準施工規模"]
[null,"⑬","概算施工日数"]
[null,"⑭","統一した従来技術との比較",null,"経済性"]
[null,null,null,null,"工程"]
[null,null,"判定の凡例 \n○：従来技術より優れる\n△：従来技術と同程度\n－：上記以外",null,"品質・出来形"]
[null,null,null,null,"安全性"]
[null,null,null,null,"施工性"]
[null,null,null,null,"環境"]
[null,"⑮","舗装材の物性・性能","バインダー物性","使用材料"]
[null,null,null,null,"試験規格"]
[null,null,null,null,"針入度（25℃）：mm"]
[null,null,null,null,"軟化点：℃"]
[null,null,null,null,"伸度：cm"]
[null,null,null,null,"タフネス：N・m"]
[null,null,null,null,"テナシティ（25℃）：N・m"]
[null,null,null,null,"粗骨材の剥離面積率：％"]
[null,null,null,null,"フラース脆化点：℃"]
[null,null,null,null,"曲げ仕事量：kPa"]
[null,null,null,null,"曲げスティフネス（-20℃）：MPa"]
[null,null,null,null,"薄膜加熱質量変化率：％"]
[null,null,null,null,"薄膜加熱後の針入度残留率：％"]
[null,null,null,null,"引火点：℃"]
[null,null,null,"混合物物性","［参考］混合物"]
[null,null,null,null,"試験規格"]
[null,null,null,null,"マーシャル安定度：kN"]
[null,null,null,null,"フロー値：cm"]
[null,null,null,null,"動的安定度：回/mm"]
[null,null,null,null,"残留安定度：％"]
[null,null,null,null,"剥離抵抗性：％"]
[null,null,null,null,"カンタブロ損失率：％"]
[null,null,null,"その他の試験結果"]
[null,"⑯","実施している性能評価試験"]
[null,"⑰","施工実績\n（過去３年）",null,"国土交通省：活用効果調査表数"]
[null,null,null,null,"地方自治体：開発者ヒアリング"]
[null,null,null,null,"その他：開発者ヒアリング"]
[null,"⑱","特許等","特許"]
[null,null,null,"建設技術審査証明"]
[null,"⑲","生産供給体制（機械保有台数等）"]
[null,"⑳","備考"]
["総括","㉑","耐久性等"]
[null,"㉒","施工性\n(留意事項含む）"]
[null,"㉓","その他（留意事項含む）"]
["注1）施工費用：2025年4月福岡県久留米市　注2）／：補完調査未実施"]

{"sheet":"簡易版","index":3,"n_rows":6,"n_cols":17,"rows_kept":6,"cut":false,"hidden":false,"merged":[[4,12,4,15],[4,16,5,16],[4,3,5,3],[4,4,5,4],[4,5,5,5],[4,6,5,6],[4,7,5,7],[4,10,5,11],[4,8,5,9]]}
[null,null,null,"舗装版ひび割れ補修工"]
[null,null,null,{"$f":"検索!S4","v":"工法比較表検索結果[9技術9仕様の内、9技術9仕様]"}]
[]
[]
[null,null,null,"番号","技術名","NETIS番号","開発者","区分","対象改良長当り\n概算施工費用",null,"対象本数当り\n概算施工日数",null,"統一した従来技術との比較",null,null,null,"概要"]
[null,null,null,null,null,null,null,null,null,null,null,null,"品質・出来形","安全性","施工性","環境"]

{"sheet":"DB","index":4,"n_rows":128,"n_cols":32,"rows_kept":128,"cut":false,"hidden":false,"merged":[[82,11,82,13],[82,14,82,16],[82,17,82,19],[82,20,82,22],[82,23,82,25],[82,26,82,28],[82,29,82,31],[83,8,83,10],[83,11,83,13],[83,14,83,16],[83,17,83,19],[83,20,83,22],[83,23,83,25],[83,26,83,28],[83,29,83,31],[2,14,2,16],[2,17,2,19],[2,20,2,22],[2,23,2,25],[2,26,2,28],[2,29,2,31],[3,11,3,13],[3,14,3,16],[3,17,3,19],[3,20,3,22],[3,23,3,25],[3,26,3,28],[3,29,3,31],[3,5,3,7],[2,5,2,7],[2,8,2,10],[3,8,3,10],[2,11,2,13],[119,29,119,31],[120,29,120,31],[121,29,121,31],[122,29,122,31],[119,26,119,28],[120,26,120,28],[121,26,121,28],[122,26,122,28],[119,23,119,25],[120,23,120,25],[121,23,121,25],[122,23,122,25],[119,20,119,22],[120,20,120,22],[121,20,121,22],[122,20,122,22],[119,17,119,19],[120,17,120,19],[121,17,121,19],[123,29,123,31],[124,29,124,31],[125,29,125,31],[126,29,126,31],[127,29,127,31],[110,29,110,31],[111,29,111,31],[112,29,112,31],[113,29,113,31],[114,29,114,31],[115,29,115,31],[116,29,116,31],[117,29,117,31],[118,29,118,31],[123,26,123,28],[124,26,124,28],[125,26,125,28],[126,26,126,28],[127,26,127,28],[110,26,110,28],[111,26,111,28],[112,26,112,28],[113,26,113,28],[114,26,114,28],[115,26,115,28],[116,26,116,28],[117,26,117,28],[118,26,118,28],[123,23,123,25],[124,23,124,25],[125,23,125,25],[126,23,126,25],[127,23,127,25],[110,23,110,25],[111,23,111,25],[112,23,112,25],[113,23,113,25],[114,23,114,25],[115,23,115,25],[116,23,116,25],[117,23,117,25],[118,23,118,25],[123,20,123,22],[124,20,124,22],[125,20,125,22],[126,20,126,22],[127,20,127,22],[110,20,110,22],[111,20,111,22],[112,20,112,22],[113,20,113,22],[114,20,114,22],[115,20,115,22],[116,20,116,22],[117,20,117,22],[118,20,118,22],[122,17,122,19],[123,17,123,19],[124,17,124,19],[125,17,125,19],[126,17,126,19],[127,17,127,19],[110,17,110,19],[111,17,111,19],[112,17,112,19],[113,17,113,19],[114,17,114,19],[115,17,115,19],[116,17,116,19],[117,17,117,19],[118,17,118,19],[119,14,119,16],[120,14,120,16],[121,14,121,16],[122,14,122,16],[123,14,123,16],[124,14,124,16],[125,14,125,16],[126,14,126,16],[127,14,127,16],[110,14,110,16],[111,14,111,16],[112,14,112,16],[113,14,113,16],[114,14,114,16],[115,14,115,16],[116,14,116,16],[117,14,117,16],[118,14,118,16],[119,11,119,13],[120,11,120,13],[121,11,121,13],[122,11,122,13],[123,11,123,13],[124,11,124,13],[125,11,125,13],[126,11,126,13],[127,11,127,13],[110,11,110,13],[111,11,111,13],[112,11,112,13],[113,11,113,13],[114,11,114,13],[115,11,115,13],[116,11,116,13],[117,11,117,13],[118,11,118,13],[119,8,119,10],[120,8,120,10],[121,8,121,10],[122,8,122,10],[123,8,123,10],[124,8,124,10],[125,8,125,10],[126,8,126,10],[127,8,127,10],[110,8,110,10],[111,8,111,10],[112,8,112,10],[113,8,113,10],[114,8,114,10],[115,8,115,10],[116,8,116,10],[117,8,117,10],[118,8,118,10],[119,5,119,7],[120,5,120,7],[121,5,121,7],[122,5,122,7],[123,5,123,7],[124,5,124,7],[125,5,125,7],[126,5,126,7],[127,5,127,7],[110,5,110,7],[111,5,111,7],[112,5,112,7],[113,5,113,7],[114,5,114,7],[115,5,115,7],[116,5,116,7],[117,5,117,7],[118,5,118,7],[10,5,10,7],[76,5,76,7],[77,5,77,7],[78,5,78,7],[27,0,27,4],[28,1,28,4],[24,5,24,7],[25,5,25,7],[26,5,26,7],[20,2,26,3],[29,6,29,7],[30,6,30,7],[31,6,31,7],[33,6,33,7],[41,1,63,1],[29,1,33,1],[35,1,40,1],[29,2,33,2],[30,3,30,4],[29,3,29,4],[31,3,31,4],[32,3,32,4],[33,3,33,4],[37,2,40,3],[28,6,28,7],[13,5,13,7],[14,5,14,7],[15,5,15,7],[16,5,16,7],[17,5,17,7],[18,5,18,7],[27,5,27,7],[19,5,19,7],[20,5,20,7],[21,5,21,7],[22,5,22,7],[23,5,23,7],[4,1,4,4],[5,2,5,4],[6,2,6,4],[7,2,7,4],[8,2,8,4],[9,2,9,4],[19,0,26,0],[19,1,26,1],[19,2,19,3],[18,2,18,4],[17,2,17,4],[12,3,12,4],[13,3,13,4],[14,3,14,4],[15,3,15,4],[16,3,16,4],[12,2,16,2],[4,0,18,0],[10,2,10,4],[11,2,11,4],[12,1,16,1],[34,2,34,4],[63,3,63,4],[37,5,37,7],[38,5,38,7],[32,6,32,7],[34,6,34,7],[55,3,62,3],[36,6,36,7],[35,6,35,7],[41,2,63,2],[63,5,63,7],[39,5,39,7],[40,5,40,7],[41,3,54,3],[35,2,36,3],[74,2,74,4],[65,1,67,1],[68,1,69,1],[72,5,72,7],[73,5,73,7],[74,5,74,7],[64,2,64,4],[64,5,64,7],[65,2,67,3],[72,0,74,0],[28,0,71,0],[4,5,4,7],[5,5,5,7],[6,5,6,7],[7,5,7,7],[8,5,8,7],[9,5,9,7],[11,5,11,7],[12,5,12,7],[68,2,69,2],[69,3,69,4],[68,3,68,4],[65,5,65,7],[66,5,66,7],[67,5,67,7],[68,5,68,7],[69,5,69,7],[70,5,70,7],[71,5,71,7],[71,2,71,4],[70,2,70,4],[72,2,72,4],[73,2,73,4],[4,8,4,10],[5,8,5,10],[6,8,6,10],[7,8,7,10],[8,8,8,10],[9,8,9,10],[10,8,10,10],[11,8,11,10],[12,8,12,10],[13,8,13,10],[14,8,14,10],[15,8,15,10],[16,8,16,10],[17,8,17,10],[18,8,18,10],[19,8,19,10],[20,8,20,10],[21,8,21,10],[22,8,22,10],[23,8,23,10],[24,8,24,10],[25,8,25,10],[26,8,26,10],[27,8,27,10],[28,9,28,10],[29,9,29,10],[30,9,30,10],[31,9,31,10],[32,9,32,10],[33,9,33,10],[34,9,34,10],[35,9,35,10],[36,9,36,10],[37,8,37,10],[38,8,38,10],[39,8,39,10],[68,8,68,10],[69,8,69,10],[70,8,70,10],[71,8,71,10],[72,8,72,10],[73,8,73,10],[74,8,74,10],[40,8,40,10],[63,8,63,10],[64,8,64,10],[65,8,65,10],[66,8,66,10],[67,8,67,10],[4,11,4,13],[5,11,5,13],[6,11,6,13],[7,11,7,13],[8,11,8,13],[9,11,9,13],[10,11,10,13],[11,11,11,13],[12,11,12,13],[13,11,13,13],[14,11,14,13],[15,11,15,13],[16,11,16,13],[17,11,17,13],[18,11,18,13],[19,11,19,13],[20,11,20,13],[21,11,21,13],[22,11,22,13],[23,11,23,13],[24,11,24,13],[25,11,25,13],[26,11,26,13],[27,11,27,13],[28,12,28,13],[29,12,29,13],[30,12,30,13],[40,11,40,13],[63,11,63,13],[64,11,64,13],[65,11,65,13],[66,11,66,13],[31,12,31,13],[32,12,32,13],[33,12,33,13],[34,12,34,13],[35,12,35,13],[36,12,36,13],[37,11,37,13],[38,11,38,13],[39,11,39,13],[67,11,67,13],[68,11,68,13],[69,11,69,13],[70,11,70,13],[71,11,71,13],[72,11,72,13],[73,11,73,13],[74,11,74,13],[4,14,4,16],[5,14,5,16],[6,14,6,16],[7,14,7,16],[8,14,8,16],[9,14,9,16],[10,14,10,16],[11,14,11,16],[12,14,12,16],[13,14,13,16],[14,14,14,16],[15,14,15,16],[16,14,16,16],[17,14,17,16],[18,14,18,16],[19,14,19,16],[20,14,20,16],[21,14,21,16],[22,14,22,16],[23,14,23,16],[24,14,24,16],[25,14,25,16],[26,14,26,16],[27,14,27,16],[28,15,28,16],[38,14,38,16],[39,14,39,16],[40,14,40,16],[63,14,63,16],[64,14,64,16],[29,15,29,16],[30,15,30,16],[31,15,31,16],[32,15,32,16],[33,15,33,16],[34,15,34,16],[35,15,35,16],[36,15,36,16],[37,14,37,16],[65,14,65,16],[66,14,66,16],[67,14,67,16],[68,14,68,16],[69,14,69,16],[70,14,70,16],[71,14,71,16],[72,14,72,16],[73,14,73,16],[74,14,74,16],[4,17,4,19],[5,17,5,19],[6,17,6,19],[7,17,7,19],[8,17,8,19],[9,17,9,19],[10,17,10,19],[11,17,11,19],[12,17,12,19],[13,17,13,19],[14,17,14,19],[15,17,15,19],[16,17,16,19],[17,17,17,19],[18,17,18,19],[19,17,19,19],[20,17,20,19],[21,17,21,19],[22,17,22,19],[23,17,23,19],[24,17,24,19],[25,17,25,19],[26,17,26,19],[36,18,36,19],[37,17,37,19],[38,17,38,19],[39,17,39,19],[40,17,40,19],[27,17,27,19],[28,18,28,19],[29,18,29,19],[30,18,30,19],[31,18,31,19],[32,18,32,19],[33,18,33,19],[34,18,34,19],[35,18,35,19],[63,17,63,19],[64,17,64,19],[65,17,65,19],[66,17,66,19],[67,17,67,19],[68,17,68,19],[69,17,69,19],[70,17,70,19],[71,17,71,19],[72,17,72,19],[73,17,73,19],[74,17,74,19],[4,20,4,22],[5,20,5,22],[6,20,6,22],[7,20,7,22],[8,20,8,22],[9,20,9,22],[10,20,10,22],[11,20,11,22],[12,20,12,22],[13,20,13,22],[14,20,14,22],[15,20,15,22],[16,20,16,22],[17,20,17,22],[18,20,18,22],[19,20,19,22],[20,20,20,22],[21,20,21,22],[22,20,22,22],[23,20,23,22],[24,20,24,22],[25,20,25,22],[26,20,26,22],[27,20,27,22],[28,21,28,22],[29,21,29,22],[30,21,30,22],[31,21,31,22],[32,21,32,22],[33,21,33,22],[63,20,63,22],[64,20,64,22],[65,20,65,22],[66,20,66,22],[67,20,67,22],[68,20,68,22],[69,20,69,22],[34,21,34,22],[35,21,35,22],[36,21,36,22],[37,20,37,22],[38,20,38,22],[39,20,39,22],[40,20,40,22],[70,20,70,22],[71,20,71,22],[72,20,72,22],[73,20,73,22],[74,20,74,22],[4,23,4,25],[5,23,5,25],[6,23,6,25],[7,23,7,25],[8,23,8,25],[9,23,9,25],[10,23,10,25],[11,23,11,25],[12,23,12,25],[13,23,13,25],[14,23,14,25],[15,23,15,25],[16,23,16,25],[17,23,17,25],[18,23,18,25],[19,23,19,25],[20,23,20,25],[21,23,21,25],[22,23,22,25],[23,23,23,25],[24,23,24,25],[25,23,25,25],[26,23,26,25],[27,23,27,25],[28,24,28,25],[29,24,29,25],[30,24,30,25],[31,24,31,25],[63,23,63,25],[64,23,64,25],[65,23,65,25],[66,23,66,25],[67,23,67,25],[32,24,32,25],[33,24,33,25],[34,24,34,25],[35,24,35,25],[36,24,36,25],[37,23,37,25],[38,23,38,25],[39,23,39,25],[40,23,40,25],[68,23,68,25],[69,23,69,25],[70,23,70,25],[71,23,71,25],[72,23,72,25],[73,23,73,25],[74,23,74,25],[4,26,4,28],[5,26,5,28],[6,26,6,28],[7,26,7,28],[8,26,8,28],[9,26,9,28],[10,26,10,28],[11,26,11,28],[12,26,12,28],[13,26,13,28],[14,26,14,28],[15,26,15,28],[16,26,16,28],[17,26,17,28],[18,26,18,28],[19,26,19,28],[20,26,20,28],[21,26,21,28],[22,26,22,28],[23,26,23,28],[24,26,24,28],[25,26,25,28],[26,26,26,28],[27,26,27,28],[28,27,28,28],[29,27,29,28],[39,26,39,28],[40,26,40,28],[63,26,63,28],[64,26,64,28],[65,26,65,28],[30,27,30,28],[31,27,31,28],[32,27,32,28],[33,27,33,28],[34,27,34,28],[35,27,35,28],[36,27,36,28],[37,26,37,28],[38,26,38,28],[66,26,66,28],[67,26,67,28],[68,26,68,28],[69,26,69,28],[70,26,70,28],[71,26,71,28],[72,26,72,28],[73,26,73,28],[74,26,74,28],[4,29,4,31],[5,29,5,31],[6,29,6,31],[7,29,7,31],[8,29,8,31],[9,29,9,31],[10,29,10,31],[11,29,11,31],[12,29,12,31],[13,29,13,31],[14,29,14,31],[15,29,15,31],[16,29,16,31],[17,29,17,31],[18,29,18,31],[19,29,19,31],[20,29,20,31],[21,29,21,31],[22,29,22,31],[23,29,23,31],[24,29,24,31],[25,29,25,31],[26,29,26,31],[27,29,27,31],[28,30,28,31],[29,30,29,31],[30,30,30,31],[31,30,31,31],[32,30,32,31],[33,30,33,31],[34,30,34,31],[35,30,35,31],[36,30,36,31],[37,29,37,31],[38,29,38,31],[39,29,39,31],[67,29,67,31],[68,29,68,31],[69,29,69,31],[70,29,70,31],[71,29,71,31],[72,29,72,31],[73,29,73,31],[74,29,74,31],[40,29,40,31],[63,29,63,31],[64,29,64,31],[65,29,65,31],[66,29,66,31],[76,2,80,2],[76,3,76,4],[77,3,77,4],[78,3,78,4],[79,3,79,4],[80,3,80,4],[81,2,81,4],[81,5,81,7],[80,5,80,7],[79,5,79,7],[77,8,77,10],[77,11,77,13],[77,14,77,16],[77,17,77,19],[77,20,77,22],[77,23,77,25],[77,26,77,28],[77,29,77,31],[76,8,76,10],[76,11,76,13],[76,14,76,16],[76,17,76,19],[76,20,76,22],[76,23,76,25],[76,26,76,28],[76,29,76,31],[79,8,79,10],[79,11,79,13],[79,14,79,16],[79,17,79,19],[79,20,79,22],[79,23,79,25],[79,26,79,28],[79,29,79,31],[78,8,78,10],[78,11,78,13],[78,14,78,16],[78,17,78,19],[78,20,78,22],[78,23,78,25],[78,26,78,28],[78,29,78,31],[81,11,81,13],[81,14,81,16],[81,17,81,19],[81,20,81,22],[81,23,81,25],[81,26,81,28],[81,29,81,31],[80,8,80,10],[80,11,80,13],[80,14,80,16],[80,17,80,19],[80,20,80,22],[80,23,80,25],[80,26,80,28],[80,29,80,31],[84,5,84,7],[85,5,85,7],[86,5,86,7],[87,5,87,7],[88,5,88,7],[89,5,89,7],[90,5,90,7],[91,5,91,7],[81,8,81,10],[84,8,84,10],[86,8,86,10],[88,8,88,10],[90,8,90,10],[82,5,82,7],[83,5,83,7],[82,8,82,10],[92,5,92,7],[93,5,93,7],[94,5,94,7],[95,5,95,7],[96,5,96,7],[97,5,97,7],[98,5,98,7],[99,5,99,7],[100,5,100,7],[101,5,101,7],[102,5,102,7],[103,5,103,7],[104,5,104,7],[105,5,105,7],[106,5,106,7],[107,5,107,7],[108,5,108,7],[109,5,109,7],[84,11,84,13],[84,14,84,16],[84,17,84,19],[84,20,84,22],[84,23,84,25],[84,26,84,28],[84,29,84,31],[85,8,85,10],[85,11,85,13],[85,14,85,16],[85,17,85,19],[85,20,85,22],[85,23,85,25],[85,26,85,28],[85,29,85,31],[86,11,86,13],[86,14,86,16],[86,17,86,19],[86,20,86,22],[86,23,86,25],[86,26,86,28],[86,29,86,31],[87,8,87,10],[87,11,87,13],[87,14,87,16],[87,17,87,19],[87,20,87,22],[87,23,87,25],[87,26,87,28],[87,29,87,31],[88,11,88,13],[88,14,88,16],[88,17,88,19],[88,20,88,22],[88,23,88,25],[88,26,88,28],[88,29,88,31],[89,8,89,10],[89,11,89,13],[89,14,89,16],[89,17,89,19],[89,20,89,22],[89,23,89,25],[89,26,89,28],[89,29,89,31],[90,11,90,13],[90,14,90,16],[90,17,90,19],[90,20,90,22],[90,23,90,25],[90,26,90,28],[90,29,90,31],[91,8,91,10],[91,11,91,13],[91,14,91,16],[91,17,91,19],[91,20,91,22],[91,23,91,25],[91,26,91,28],[91,29,91,31],[92,8,92,10],[92,11,92,13],[92,14,92,16],[92,17,92,19],[92,20,92,22],[92,23,92,25],[92,26,92,28],[92,29,92,31],[93,8,93,10],[93,11,93,13],[93,14,93,16],[93,17,93,19],[93,20,93,22],[93,23,93,25],[93,26,93,28],[93,29,93,31],[94,8,94,10],[94,11,94,13],[94,14,94,16],[94,17,94,19],[94,20,94,22],[94,23,94,25],[94,26,94,28],[94,29,94,31],[95,8,95,10],[95,11,95,13],[95,14,95,16],[95,17,95,19],[95,20,95,22],[95,23,95,25],[95,26,95,28],[95,29,95,31],[96,8,96,10],[96,11,96,13],[96,14,96,16],[96,17,96,19],[96,20,96,22],[96,23,96,25],[96,26,96,28],[96,29,96,31],[97,8,97,10],[97,11,97,13],[97,14,97,16],[97,17,97,19],[97,20,97,22],[97,23,97,25],[97,26,97,28],[97,29,97,31],[98,8,98,10],[98,11,98,13],[98,14,98,16],[98,17,98,19],[98,20,98,22],[98,23,98,25],[98,26,98,28],[98,29,98,31],[99,8,99,10],[99,11,99,13],[99,14,99,16],[99,17,99,19],[99,20,99,22],[99,23,99,25],[99,26,99,28],[99,29,99,31],[100,8,100,10],[100,11,100,13],[100,14,100,16],[100,17,100,19],[100,20,100,22],[100,23,100,25],[100,26,100,28],[100,29,100,31],[101,8,101,10],[101,11,101,13],[101,14,101,16],[101,17,101,19],[101,20,101,22],[101,23,101,25],[101,26,101,28],[101,29,101,31],[102,8,102,10],[102,11,102,13],[102,14,102,16],[102,17,102,19],[102,20,102,22],[102,23,102,25],[102,26,102,28],[102,29,102,31],[103,8,103,10],[103,11,103,13],[103,14,103,16],[103,17,103,19],[103,20,103,22],[103,23,103,25],[103,26,103,28],[103,29,103,31],[104,8,104,10],[104,11,104,13],[104,14,104,16],[104,17,104,19],[104,20,104,22],[104,23,104,25],[104,26,104,28],[104,29,104,31],[105,8,105,10],[105,11,105,13],[105,14,105,16],[105,17,105,19],[105,20,105,22],[105,23,105,25],[105,26,105,28],[105,29,105,31],[106,8,106,10],[106,11,106,13],[106,14,106,16],[106,17,106,19],[106,20,106,22],[106,23,106,25],[106,26,106,28],[106,29,106,31],[107,8,107,10],[107,11,107,13],[107,14,107,16],[107,17,107,19],[107,20,107,22],[107,23,107,25],[107,26,107,28],[107,29,107,31],[108,8,108,10],[108,11,108,13],[108,14,108,16],[108,17,108,19],[108,20,108,22],[108,23,108,25],[108,26,108,28],[108,29,108,31],[109,8,109,10],[109,11,109,13],[109,14,109,16],[109,17,109,19],[109,20,109,22],[109,23,109,25],[109,26,109,28],[109,29,109,31]]}
[null,null,null,null,null,"1-1",null,null,"2-1",null,null,"3-1",null,null,"4-1",null,null,"5-1",null,null,"6-1",null,null,"7-1",null,null,"8-1",null,null,"9-1"]
["舗装版ひび割れ補修工",null,null,null,null,{"$f":"IF(LEN(VLOOKUP(F1,仕様の整理!$C:$E,3,0))-LEN(SUBSTITUTE(VLOOKUP(F1,仕様の整理!$C:$E,3,0),\"-\",\"\"))>=2,LEFT(VLOOKUP(F1,仕様の整理!$C:$E,3,0),FIND(\"-\",VLOOKUP(F1,仕様の整理!$C:$E,3,0),FIND(\"-\",VLOOKUP(F1,仕様の整理!$C:$E,3,0))+1)-1),VLOOKUP(F1,仕様の整理!$C:$E,3,0))","v":"KT-160100"},null,null,{"$f":"IF(LEN(VLOOKUP(I1,仕様の整理!$C:$E,3,0))-LEN(SUBSTITUTE(VLOOKUP(I1,仕様の整理!$C:$E,3,0),\"-\",\"\"))>=2,LEFT(VLOOKUP(I1,仕様の整理!$C:$E,3,0),FIND(\"-\",VLOOKUP(I1,仕様の整理!$C:$E,3,0),FIND(\"-\",VLOOKUP(I1,仕様の整理!$C:$E,3,0))+1)-1),VLOOKUP(I1,仕様の整理!$C:$E,3,0))","v":"KK-190032"},null,null,{"$f":"IF(LEN(VLOOKUP(L1,仕様の整理!$C:$E,3,0))-LEN(SUBSTITUTE(VLOOKUP(L1,仕様の整理!$C:$E,3,0),\"-\",\"\"))>=2,LEFT(VLOOKUP(L1,仕様の整理!$C:$E,3,0),FIND(\"-\",VLOOKUP(L1,仕様の整理!$C:$E,3,0),FIND(\"-\",VLOOKUP(L1,仕様の整理!$C:$E,3,0))+1)-1),VLOOKUP(L1,仕様の整理!$C:$E,3,0))","v":"QS-190045"},null,null,{"$f":"IF(LEN(VLOOKUP(O1,仕様の整理!$C:$E,3,0))-LEN(SUBSTITUTE(VLOOKUP(O1,仕様の整理!$C:$E,3,0),\"-\",\"\"))>=2,LEFT(VLOOKUP(O1,仕様の整理!$C:$E,3,0),FIND(\"-\",VLOOKUP(O1,仕様の整理!$C:$E,3,0),FIND(\"-\",VLOOKUP(O1,仕様の整理!$C:$E,3,0))+1)-1),VLOOKUP(O1,仕様の整理!$C:$E,3,0))","v":"KT-010233"},null,null,{"$f":"IF(LEN(VLOOKUP(R1,仕様の整理!$C:$E,3,0))-LEN(SUBSTITUTE(VLOOKUP(R1,仕様の整理!$C:$E,3,0),\"-\",\"\"))>=2,LEFT(VLOOKUP(R1,仕様の整理!$C:$E,3,0),FIND(\"-\",VLOOKUP(R1,仕様の整理!$C:$E,3,0),FIND(\"-\",VLOOKUP(R1,仕様の整理!$C:$E,3,0))+1)-1),VLOOKUP(R1,仕様の整理!$C:$E,3,0))","v":"KK-030026"},null,null,{"$f":"IF(LEN(VLOOKUP(U1,仕様の整理!$C:$E,3,0))-LEN(SUBSTITUTE(VLOOKUP(U1,仕様の整理!$C:$E,3,0),\"-\",\"\"))>=2,LEFT(VLOOKUP(U1,仕様の整理!$C:$E,3,0),FIND(\"-\",VLOOKUP(U1,仕様の整理!$C:$E,3,0),FIND(\"-\",VLOOKUP(U1,仕様の整理!$C:$E,3,0))+1)-1),VLOOKUP(U1,仕様の整理!$C:$E,3,0))","v":"KT-040013"},null,null,{"$f":"IF(LEN(VLOOKUP(X1,仕様の整理!$C:$E,3,0))-LEN(SUBSTITUTE(VLOOKUP(X1,仕様の整理!$C:$E,3,0),\"-\",\"\"))>=2,LEFT(VLOOKUP(X1,仕様の整理!$C:$E,3,0),FIND(\"-\",VLOOKUP(X1,仕様の整理!$C:$E,3,0),FIND(\"-\",VLOOKUP(X1,仕様の整理!$C:$E,3,0))+1)-1),VLOOKUP(X1,仕様の整理!$C:$E,3,0))","v":"KT-070102"},null,null,{"$f":"IF(LEN(VLOOKUP(AA1,仕様の整理!$C:$E,3,0))-LEN(SUBSTITUTE(VLOOKUP(AA1,仕様の整理!$C:$E,3,0),\"-\",\"\"))>=2,LEFT(VLOOKUP(AA1,仕様の整理!$C:$E,3,0),FIND(\"-\",VLOOKUP(AA1,仕様の整理!$C:$E,3,0),FIND(\"-\",VLOOKUP(AA1,仕様の整理!$C:$E,3,0))+1)-1),VLOOKUP(AA1,仕様の整理!$C:$E,3,0))","v":"CB-220031"},null,null,{"$f":"IF(LEN(VLOOKUP(AD1,仕様の整理!$C:$E,3,0))-LEN(SUBSTITUTE(VLOOKUP(AD1,仕様の整理!$C:$E,3,0),\"-\",\"\"))>=2,LEFT(VLOOKUP(AD1,仕様の整理!$C:$E,3,0),FIND(\"-\",VLOOKUP(AD1,仕様の整理!$C:$E,3,0),FIND(\"-\",VLOOKUP(AD1,仕様の整理!$C:$E,3,0))+1)-1),VLOOKUP(AD1,仕様の整理!$C:$E,3,0))","v":"KT-230031"}]
[null,null,null,null,null,{"$f":"IFERROR(\"作成日：\"&VLOOKUP(F$1,仕様の整理!$C:$N,6,0),\"-\")","v":"作成日：令和7年9月"},null,null,{"$f":"IFERROR(\"作成日：\"&VLOOKUP(I$1,仕様の整理!$C:$N,6,0),\"-\")","v":"作成日：令和7年9月"},null,null,{"$f":"IFERROR(\"作成日：\"&VLOOKUP(L$1,仕様の整理!$C:$N,6,0),\"-\")","v":"作成日：令和7年9月"},null,null,{"$f":"IFERROR(\"作成日：\"&VLOOKUP(O$1,仕様の整理!$C:$N,6,0),\"-\")","v":"作成日：令和7年9月"},null,null,{"$f":"IFERROR(\"作成日：\"&VLOOKUP(R$1,仕様の整理!$C:$N,6,0),\"-\")","v":"作成日：令和7年9月"},null,null,{"$f":"IFERROR(\"作成日：\"&VLOOKUP(U$1,仕様の整理!$C:$N,6,0),\"-\")","v":"作成日：令和7年9月"},null,null,{"$f":"IFERROR(\"作成日：\"&VLOOKUP(X$1,仕様の整理!$C:$N,6,0),\"-\")","v":"作成日：令和7年9月"},null,null,{"$f":"IFERROR(\"作成日：\"&VLOOKUP(AA$1,仕様の整理!$C:$N,6,0),\"-\")","v":"作成日：令和7年9月"},null,null,{"$f":"IFERROR(\"作成日：\"&VLOOKUP(AD$1,仕様の整理!$C:$N,6,0),\"-\")","v":"作成日：令和7年9月"}]
[null,null,null,null,null,{"$f":"VLOOKUP(F$1,仕様の整理!$C:$N,7,0)","v":"リフレクションクラック防止シート"},null,null,{"$f":"VLOOKUP(I$1,仕様の整理!$C:$N,7,0)","v":"リフレクションクラック防止シート"},null,null,{"$f":"VLOOKUP(L$1,仕様の整理!$C:$N,7,0)","v":"シール材注入工法"},null,null,{"$f":"VLOOKUP(O$1,仕様の整理!$C:$N,7,0)","v":"リフレクションクラック防止シート"},null,null,{"$f":"VLOOKUP(R$1,仕様の整理!$C:$N,7,0)","v":"リフレクションクラック防止シート"},null,null,{"$f":"VLOOKUP(U$1,仕様の整理!$C:$N,7,0)","v":"リフレクションクラック防止シート"},null,null,{"$f":"VLOOKUP(X$1,仕様の整理!$C:$N,7,0)","v":"シール材注入工法"},null,null,{"$f":"VLOOKUP(AA$1,仕様の整理!$C:$N,7,0)","v":"リフレクションクラック防止シート"},null,null,{"$f":"VLOOKUP(AD$1,仕様の整理!$C:$N,7,0)","v":"シール材注入工法"}]
["ＮＥＴＩＳ情報","技術名",null,null,null,{"$f":"IF(VLOOKUP(F$1,仕様の整理!$C:$N,4,0)=\"NETIS掲載期間終了技術\",VLOOKUP(F$1,仕様の整理!$C:$N,2,0),VLOOKUP(F$1,仕様の整理!$C:$N,2,0)&\"（\"&VLOOKUP(F$1,仕様の整理!$C:$N,4,0)&\"）\")&IF(VLOOKUP(F$1,仕様の整理!$C:$N,5,0)=\"○\",\"\",\"《新規登録技術》\")","v":"グラスグリッド（事後評価済技術）"},null,null,{"$f":"IF(VLOOKUP(I$1,仕様の整理!$C:$N,4,0)=\"NETIS掲載期間終了技術\",VLOOKUP(I$1,仕様の整理!$C:$N,2,0),VLOOKUP(I$1,仕様の整理!$C:$N,2,0)&\"（\"&VLOOKUP(I$1,仕様の整理!$C:$N,4,0)&\"）\")&IF(VLOOKUP(I$1,仕様の整理!$C:$N,5,0)=\"○\",\"\",\"《新規登録技術》\")","v":"UKロードマット（事後評価済技術）"},null,null,{"$f":"IF(VLOOKUP(L$1,仕様の整理!$C:$N,4,0)=\"NETIS掲載期間終了技術\",VLOOKUP(L$1,仕様の整理!$C:$N,2,0),VLOOKUP(L$1,仕様の整理!$C:$N,2,0)&\"（\"&VLOOKUP(L$1,仕様の整理!$C:$N,4,0)&\"）\")&IF(VLOOKUP(L$1,仕様の整理!$C:$N,5,0)=\"○\",\"\",\"《新規登録技術》\")","v":"イソシールAC 速硬化性常温クラックシール（事後評価済技術）"},null,null,{"$f":"IF(VLOOKUP(O$1,仕様の整理!$C:$N,4,0)=\"NETIS掲載期間終了技術\",VLOOKUP(O$1,仕様の整理!$C:$N,2,0),VLOOKUP(O$1,仕様の整理!$C:$N,2,0)&\"（\"&VLOOKUP(O$1,仕様の整理!$C:$N,4,0)&\"）\")&IF(VLOOKUP(O$1,仕様の整理!$C:$N,5,0)=\"○\",\"\",\"《新規登録技術》\")","v":"RCメッシュG"},null,null,{"$f":"IF(VLOOKUP(R$1,仕様の整理!$C:$N,4,0)=\"NETIS掲載期間終了技術\",VLOOKUP(R$1,仕様の整理!$C:$N,2,0),VLOOKUP(R$1,仕様の整理!$C:$N,2,0)&\"（\"&VLOOKUP(R$1,仕様の整理!$C:$N,4,0)&\"）\")&IF(VLOOKUP(R$1,仕様の整理!$C:$N,5,0)=\"○\",\"\",\"《新規登録技術》\")","v":"アスパワーシート"},null,null,{"$f":"IF(VLOOKUP(U$1,仕様の整理!$C:$N,4,0)=\"NETIS掲載期間終了技術\",VLOOKUP(U$1,仕様の整理!$C:$N,2,0),VLOOKUP(U$1,仕様の整理!$C:$N,2,0)&\"（\"&VLOOKUP(U$1,仕様の整理!$C:$N,4,0)&\"）\")&IF(VLOOKUP(U$1,仕様の整理!$C:$N,5,0)=\"○\",\"\",\"《新規登録技術》\")","v":"G・RDマット"},null,null,{"$f":"IF(VLOOKUP(X$1,仕様の整理!$C:$N,4,0)=\"NETIS掲載期間終了技術\",VLOOKUP(X$1,仕様の整理!$C:$N,2,0),VLOOKUP(X$1,仕様の整理!$C:$N,2,0)&\"（\"&VLOOKUP(X$1,仕様の整理!$C:$N,4,0)&\"）\")&IF(VLOOKUP(X$1,仕様の整理!$C:$N,5,0)=\"○\",\"\",\"《新規登録技術》\")","v":"クラックシールNX"},null,null,{"$f":"IF(VLOOKUP(AA$1,仕様の整理!$C:$N,4,0)=\"NETIS掲載期間終了技術\",VLOOKUP(AA$1,仕様の整理!$C:$N,2,0),VLOOKUP(AA$1,仕様の整理!$C:$N,2,0)&\"（\"&VLOOKUP(AA$1,仕様の整理!$C:$N,4,0)&\"）\")&IF(VLOOKUP(AA$1,仕様の整理!$C:$N,5,0)=\"○\",\"\",\"《新規登録技術》\")","v":"G･Asシート（事後評価済技術）"},null,null,{"$f":"IF(VLOOKUP(AD$1,仕様の整理!$C:$N,4,0)=\"NETIS掲載期間終了技術\",VLOOKUP(AD$1,仕様の整理!$C:$N,2,0),VLOOKUP(AD$1,仕様の整理!$C:$N,2,0)&\"（\"&VLOOKUP(AD$1,仕様の整理!$C:$N,4,0)&\"）\")&IF(VLOOKUP(AD$1,仕様の整理!$C:$N,5,0)=\"○\",\"\",\"《新規登録技術》\")","v":"常温硬化型舗装ひび割れ補修材「スーパーMDシール」（事後評価未実施技術）"}]
[null,"①","ＮＥＴＩＳ登録番号",null,null,{"$f":"IF(VLOOKUP(F$1,仕様の整理!$C:$G,4,0)=\"NETIS掲載期間終了技術\",\"NETIS掲載期間終了技術\",VLOOKUP(F$1,仕様の整理!$C:$G,3,0))","v":"KT-160100-VE"},null,null,{"$f":"IF(VLOOKUP(I$1,仕様の整理!$C:$G,4,0)=\"NETIS掲載期間終了技術\",\"NETIS掲載期間終了技術\",VLOOKUP(I$1,仕様の整理!$C:$G,3,0))","v":"KK-190032-VE"},null,null,{"$f":"IF(VLOOKUP(L$1,仕様の整理!$C:$G,4,0)=\"NETIS掲載期間終了技術\",\"NETIS掲載期間終了技術\",VLOOKUP(L$1,仕様の整理!$C:$G,3,0))","v":"QS-190045-VE"},null,null,{"$f":"IF(VLOOKUP(O$1,仕様の整理!$C:$G,4,0)=\"NETIS掲載期間終了技術\",\"NETIS掲載期間終了技術\",VLOOKUP(O$1,仕様の整理!$C:$G,3,0))","v":"NETIS掲載期間終了技術"},null,null,{"$f":"IF(VLOOKUP(R$1,仕様の整理!$C:$G,4,0)=\"NETIS掲載期間終了技術\",\"NETIS掲載期間終了技術\",VLOOKUP(R$1,仕様の整理!$C:$G,3,0))","v":"NETIS掲載期間終了技術"},null,null,{"$f":"IF(VLOOKUP(U$1,仕様の整理!$C:$G,4,0)=\"NETIS掲載期間終了技術\",\"NETIS掲載期間終了技術\",VLOOKUP(U$1,仕様の整理!$C:$G,3,0))","v":"NETIS掲載期間終了技術"},null,null,{"$f":"IF(VLOOKUP(X$1,仕様の整理!$C:$G,4,0)=\"NETIS掲載期間終了技術\",\"NETIS掲載期間終了技術\",VLOOKUP(X$1,仕様の整理!$C:$G,3,0))","v":"NETIS掲載期間終了技術"},null,null,{"$f":"IF(VLOOKUP(AA$1,仕様の整理!$C:$G,4,0)=\"NETIS掲載期間終了技術\",\"NETIS掲載期間終了技術\",VLOOKUP(AA$1,仕様の整理!$C:$G,3,0))","v":"CB-220031-VE"},null,null,{"$f":"IF(VLOOKUP(AD$1,仕様の整理!$C:$G,4,0)=\"NETIS掲載期間終了技術\",\"NETIS掲載期間終了技術\",VLOOKUP(AD$1,仕様の整理!$C:$G,3,0))","v":"KT-230031-A"}]
[null,"②","有用な技術の位置付け",null,null,"-",null,null,"-",null,null,"-",null,null,"評価済み",null,null,"評価済み",null,null,"評価済み",null,null,"評価済み",null,null,"-",null,null,"-"]
[null,"③","開発者（本社が存在する都道府県）",null,null,"\tサンゴバン株式会社（東京都）",null,null,"株式会社雄交（大阪府）",null,null,"日本特殊塗料株式会社（東京都）",null,null,"東亜道路工業株式会社（東京都）",null,null,"綾羽工業株式会社(滋賀県)",null,null,"株式会社ガイアート（東京都）",null,null,"ニチレキ株式会社(東京都）",null,null,"株式会社ガイアート（東京都）",null,null,"前田道路株式会社（東京都）、秩父コンクリート工業株式会社（東京都）"]
[null,"④","開発者における九州地方との関連性（九州登録九州本社：◎、九州外登録九州本社：○、九州に共同開発者有り：△、その他：－）",null,null,"-",null,null,"-",null,null,"-",null,null,"-",null,null,"-",null,null,"-",null,null,"-",null,null,"-",null,null,"-"]
[null,"⑤","九州地方への機能性（九州地方に支店等を有する場合：○、その他：－）",null,null,"-",null,null,"-",null,null,"○（九州地方に営業所を有する）",null,null,"○（九州地方に営業所を有する）",null,null,"-",null,null,"○（九州地方に営業所を有する）",null,null,"○（九州地方に営業所を有する）",null,null,"○（九州地方に支店等を有する）",null,null,"○（九州地方に支店等を有する）"]
[null,"⑥","技術概要",null,null,"　本技術は特殊アクリル樹脂で浸透コーティングした強靭なガラス繊維グリッドで、従来は不織布系リフレクションクラック抑制シートで対応していた。本技術の活用によりリフレクションクラック抑制効果が向上し、離型紙の剥離作業がないため1日あたりの敷設量もUPします。",null,null,"　本技術は、舗装版に生じた亀甲状クラックを補修するための貼付式アスファルトシート製品の技術であり、従来は舗装面クラック補修専用の過熱型シール材充填であった。本技術の活用により、品質、施工性の向上が期待できる。",null,null,"　舗装クラック等の補修を行う材料で、常温で施工でき、速硬化性を有するシール材。 線状クラックや小規模な範囲で効率よく施工出来る。 1～20mmのひび割れ幅に対応でき、伸び率が300%を超えるため、追従性、防水性に優れ、亀甲状クラックを抑える。",null,null,"　本技術は、ガラス繊維をメッシュ状に加工した基材を用いたリフレクションクラック抑制シートで、従来は基材にガラス繊維などを用いた材料で対応していた。本技術の活用により、舗装補修時に切削機による切断が容易になり、ブリスタリングの発生を抑制することが期待できる。",null,null,"　本技術はアスファルト舗装において、クラックやわだちの発生を抑制する防水機能を有したシート補強技術である。本技術の採用により、路面性能の低下抑制が期待できる。また、芯材はガラス繊維なので再生舗装材としてのリサイクル利用を妨げない。",null,null,"　本技術は、抗張力が高く耐久性の優れたグラスファイバーを基材としたクラック抑制機能、防水機能を持つ舗装補強マットで、従来は基材がガラス長繊維のもので対応していた。本技術の活用により舗装切削時の切削機による切断が容易に行え、切削廃材のリサイクルが可能である。",null,null,"　本技術は、新たに開発したクラックシール材によるクラックシール工であり、従来はブローンアスファルトなどを使用していた。本技術の活用により、シール効果の持続性が図れ、予防的修繕工法としての活用が期待される。",null,null,"本技術はシートの敷設により応力緩和層を形成するリフレクションクラック抑制シートであり、従来技術はガラス繊維等の基材を用いたシートで対応していた。本技術を活用することで修繕時の廃材から産業廃棄物を排除する必要がなくなり、廃材の完全なリサイクルが可能となる。",null,null,"本技術は、舗装のひび割れやコンクリート舗装の目地部の補修を行う常温で施工可能な２in１パッケージのポリウレタン系ひび割れ注入材で、従来は、加熱式アスファルト注入材で対応していた。本技術の活用により、安全性および品質の向上が図れる。"]
[null,"⑦","概要図"]
[null,"⑧","施工条件・適用条件等","種類",null,"リフレクションクラック防止シート",null,null,"リフレクションクラック防止シート",null,null,"シール材注入工法",null,null,"リフレクションクラック防止シート",null,null,"リフレクションクラック防止シート",null,null,"リフレクションクラック防止シート",null,null,"シール材注入工法",null,null,"リフレクションクラック防止シート",null,null,"シール材注入工法"]
[null,null,null,"仕様",null,"ガラス繊維グリッドを使用したリフレクションクラック抑制シート",null,null,"接着面に特殊ゴム化アスファルトを使用した装路面貼付け型のマット状クラック補修材",null,null,"速乾性と施工性に優れた舗装クラック速硬化性常温注入防水材",null,null,"基材にガラス繊維を用いたリフレクションクラック抑制シート",null,null,"アスファルト舗装クラック抑制防水シート\t",null,null,"防水機能を有した舗装補強・クラック抑制シート(G・RDマットⅡ）",null,null,"高耐久性加熱型アスファルト系ひびわれシール材",null,null,"ガラス繊維等の基材を使用しない再生可能なクラック抑制シート",null,null,"常温硬化型ポリウレタン系ひび割れ注入材"]
[null,null,null,"適用範囲",null,"・アスファルト舗装【・適用可能な既設舗装：制限なし】",null,null,"・舗装面小規模亀甲状クラック補修　・段差修正　・常温合材飛散防止　・鋼材・コンクリート構造物のすべり止め【・適用可能な既設舗装：ロールドAｓ、フォームドAs、ポーラスAs舗装以外】",null,null,"・舗装のクラック、及び目地補修全般(アスファルトクラック幅は1～20mm程度、コンクリート目地幅は10～60mm程度)【・適用可能な既設舗装：制限なし】",null,null,"・アスファルト舗装面、切削面上のクラック　・コンクリート舗装版上のクラック　・コンクリート舗装目地部・コンクリート舗装版と構造物の境界目地部　【・適用可能な既設舗装：硬質アスファルト、ポーラスアスファルト舗装以外の舗装】",null,null,"・アスファルト舗装部及びコンクリート床版上(アスファルトによるオーバーレイ必要)　・アスファルト舗装道路の新設時も適用可能【・適用可能な既設舗装：制限なし】",null,null,"・道路舗装面(クラック発生箇所、舗装補強箇所、埋設ジョイント箇所、コンクリート舗装目地部など)　・橋梁床版面【・適用可能な既設舗装：制限なし】",null,null,"・道舗装のクラック全般【・適用可能な既設舗装：アスファルト、半たわみ性、ロールドアスファルト舗装（バインダ：セミブローン、硬質アスファルトは不可、As混合物：開粒度、ポーラスは不可】",null,null,"・道路舗装面（クラック発生箇所、コンクリート舗装目地部、埋設ジョイント箇所など）　・橋梁床版面・適用可能な既設舗装：アスファルト、排水性、コンクリート",null,null,"アスファルト舗装やコンクリート舗装の目地部等、ひび割れ幅1㎜以上の破損個所"]
[null,null,null,"適用不可範囲",null,"・アスファルトではない舗装",null,null,"・濡れている施工面　・強風、強雨、降雪時は施工不可",null,null,"・湿潤状態　・舗装点検要領 舗装の診断区分Ⅲ",null,null,"・目安として、クラック幅が1cm以上の場合、事前にクラック中に注入目地材を充填する。・構造的に破損しているクラックは、適用不可。",null,null,"・路床・砕石路盤に直接敷設することはできない。",null,null,"・構造的に破壊しており、下からの打換えが必要な箇所。既設舗装面に幅の広いクラックがある場合で、路盤等の部分入れ換えやパッチング実施していない箇所。",null,null,"・舗装が構造的な破損にある状態。(沈下を伴った亀甲状クラックは、別途、打換え等の修繕工法の検討を要する)",null,null,"・構造的に破損しており、下層からの打換えが必要な箇所。",null,null,"ひび割れ幅1mm未満の破損個所\t"]
[null,null,null,"設計・施工",null,"・雨天、強風時及び降雪下での施工は不可　・作業スペース(ロール切り出し)として約2m×5m必要",null,null,"・UKロードマットと下地路面を密着させるため、UKロードマットを貼り付けたのち、マット表面を足踏みし、木槌、転圧棒、小型転圧機等で十分に加圧する。",null,null,"・路面温度 3～60℃以上　・施工後、沈下した場合は、再度注入が必要",null,null,"・シート接着後、タイヤローラーにて2往復程度転圧し、舗設前の作業車の走行による剥がれを防止する。",null,null,"・最低舗装厚4㎝以上。継手部の重ね代は10㎝、鋲止めは3～5本/mを標準。(鋲止め後も非常に透水性が低く、必要な防水機能は担保されている。)",null,null,"面的に使用する場合は、横断方向ならびに縦断方向に10㎝重ねて敷設すること。",null,null,"・材料溶解時の温度管理(過加熱は材料劣化の原因となる)をすること　・極度の盛り上がりがないように施工する",null,null,"面的に使用する場合、横断方向は路肩側からセンターに向かって製品を突き合わせるか10mmずつ重ねて敷き並べ、縦断方向も同様に敷設する。",null,null,"気温が5～35℃の範囲で施工を行う"]
[null,"⑨","比較する従来技術",null,null,"不織布系リフレクションクラック抑制シート",null,null,"舗装面クラック補修専用の加熱型シール材充填",null,null,"ブローンアスファルトによるシール材注入工",null,null," 不織布系クラック抑制シート",null,null,"不織布系クラック抑制シート",null,null,"ガラス長繊維シート",null,null,"ブローンアスファルトによるクラックシール",null,null,"ガラス繊維基材クラック抑制シート",null,null,"加熱式アスファルト注入材"]
[null,"⑩","工法の特徴",null,null,"・流動わだちの軽減（表層に改質アスファルト舗装を使用した場合）【・振動・騒音の低減】　・リフレクションクラック抑制【材料：特殊アクリル樹脂で浸透コーティングしたガラス繊維グリッド、格子サイズ：25mm×25mm】",null,null,"・マット裏面の自着層により接着剤の塗布不要　　【・防水性　・下地追従性　・骨材飛散抵抗性　・すべり抵抗性】【材料：改質アスファルトシート、合成繊維不織布シート、鉱物質粉粒】",null,null,"・速硬化性　・常温施工　・早期交通開放・材料：ポリウレア樹脂",null,null,"・再補修時の切削作業において、容易に細かく切断することが可能　・リフレクションクラック抑制　・ブリスタリングの発生抑制・防水機能（RCメッシュG-M）　【材料：特殊ゴム化アスファルトコンパウンドと高強度ガラス繊維メッシュから構成されたシート】",null,null,"・クラックおよび流動わだちの抑制　・アスファルト層の防水(下層への雨水浸透抑制)機能持続・切削時のアスファルト殻はそのまま再生材として利用可能　　【材料：ガラス繊維織物を芯材する特殊アスファルトシート】",null,null,"・引張強度がガラス長繊維シートの1.24倍向上　・常温施工　・リフレクションクラック抑制　・再補修時の切削機による切断が可能・防水機能を有し、常温型の橋梁用防水シートとして使用可能　【材料：SBS(スチレンブタジエン系熱可塑性エラストマー)、粘着付与樹脂（タッキファイヤー）】",null,null,"・割れ抵抗性　・剥がれ抵抗性【材料：アスファルト系ひび割れ補修材】",null,null,"・アスファルトと骨材のみの構成でクラック抑制効果が得られるシート　・人力の常温施工でじょく層の形成が可能　・切削廃材のリサイクルが可能　・リフレクションクラック抑制　・材料：アスファルト、骨材",null,null,"・常温施工・剥がれ抵抗性・割れ抵抗性・浸透性【・止水性】・材料：ポリウレタン系"]
["評価情報 ","⑪","評価基準",null,"項目","最新の活用効果評価結果,所見",null,null,"最新の活用効果評価結果,所見",null,null,"最新の活用効果評価結果,所見",null,null,"最新の活用効果評価結果,所見",null,null,"最新の活用効果評価結果,所見",null,null,"最新の活用効果評価結果,所見",null,null,"最新の活用効果評価結果,所見",null,null,"最新の活用効果評価結果,所見",null,null,"最新の活用効果評価結果,所見"]
[null,null,"・A：従来技術より極めて優れる\n・B：従来技術より優れる\n・C：従来技術と同等\n・D：従来技術より劣る",null,"経済性","D：-",null,null,"-",null,null,"-",null,null,"C：",null,null,"C：",null,null,"B：",null,null,"D：・本技術の経済性については、従来技術に対して材料費がコストアップするため劣る。",null,null,"-",null,null,"-"]
[null,null,null,null,"工程","C：-",null,null,"-",null,null,"-",null,null,"C：",null,null,"B：",null,null,"B：",null,null,"D：・本技術の工程については、従来技術に対して同等である。",null,null,"-",null,null,"-"]
[null,null,null,null,"品質・出来形","B：・ガラス繊維グリッドを使用することで引張強度及びリフレクションクラック抑制効果が向上する。",null,null,"-",null,null,"-",null,null,"B：",null,null,"B：",null,null,"B：",null,null,"B：・本技術の品質・出来形については、舗装耐久性が上がるため、従来技術に対して優れる。",null,null,"-",null,null,"-"]
[null,null,null,null,"安全性","C：-",null,null,"-",null,null,"-",null,null,"C：",null,null,"C：",null,null,"C：",null,null,"C：・本技術の安全性については、従来技術に対して同等である。",null,null,"-",null,null,"-"]
[null,null,null,null,"施工性","C：-",null,null,"-",null,null,"-",null,null,"C：",null,null,"B：",null,null,"C：",null,null,"C：・本技術の施工性については、従来技術に対して同等である。",null,null,"-",null,null,"-"]
[null,null,null,null,"環境","B：・離型紙の剥離作業がなく廃棄物が減少するため、周辺環境への影響を少なくすることができる。",null,null,"-",null,null,"-",null,null,"C：",null,null,"C：",null,null,"C：",null,null,"C：・本技術の環境については、従来技術に対して同等である。",null,null,"-",null,null,"-"]
[null,null,null,null,"総合評価","C：-",null,null,"-",null,null,"-",null,null,"C：",null,null,"C：【優れていた所】クラック抑制品質特性が向上し、鋲止め工法を採用することにより、工程の短縮及び品質・出来形の向上が図られている。",null,null,"C：【優れていた所】クラック抑制品質特性が向上し、鋲止め工法を採用することにより、工程の短縮及び品質・出来形の向上が図られている。",null,null,"C：・極度の盛り上がりがないように施工する必要がある。",null,null,"-",null,null,"-"]
["統一した従来技術",null,null,null,null,"・舗装版クラック補修工（クラック防止シート張）［補修幅1000mm、厚さ1.5mm］",null,null,"・舗装版クラック補修工（クラック防止シート張）［補修幅1000mm、厚さ1.5mm］",null,null,"舗装版クラック補修工（クラック補修）［補修幅10mm、補修深さ20mm］",null,null,"舗装版クラック補修工（クラック防止シート張）［補修幅1000mm、厚さ1.5mm］",null,null,"舗装版クラック補修工（クラック防止シート張）［補修幅1000mm、厚さ1.5mm］",null,null,"舗装版クラック補修工（クラック防止シート張）［補修幅1000mm、厚さ1.5mm］",null,null,"舗装版クラック補修工（クラック補修）［補修幅10mm、補修深さ20mm］",null,null,"舗装版クラック補修工（クラック防止シート張）［補修幅1000mm、厚さ1.5mm］",null,null,"・舗装版クラック補修工（クラック補修）［補修幅10mm、補修深さ20mm］"]
["補完調査情報",null,null,null,null,"従来技術","新技術",null,"従来技術","新技術",null,"従来技術","新技術",null,"従来技術","新技術",null,"従来技術","新技術",null,"従来技術","新技術",null,"従来技術","新技術",null,"従来技術","新技術",null,"従来技術","新技術"]
[null,"⑫","施工費用","機械・労務",null,"-",504,null,"-",7257,null,"-",391.1,null,"-",538,null,"-",431,null,"-",421,null,"-",295.60000000000002,null,"-",425,null,"-",205]
[null,null,null,"材料",null,"-",2340,null,"-",15000,null,"-",646.79999999999995,null,"-",2199,null,"-",1750,null,"-",1890,null,"-",140,null,"-",2090,null,"-",2320]
[null,null,null,"合計",null,2251,2844,null,2251,22257,null,386.8,1037.9000000000001,null,2251,2737,null,2251,2181,null,2251,2311,null,386.8,435.6,null,2251,2515,null,386.8,2525]
[null,null,null,"備考",null,"-","シート幅1.5ｍを1000㎡施工",null,"-","補修マット（50cm角）を1000㎡施工",null,"-","補修幅10mm,補修深さ20mm,延長1000ｍ,歩掛：標準歩掛",null,"-","シート幅：1.0ｍ,歩掛：標準歩掛",null,"-","シート幅1.0ｍを1000㎡施工",null,"-","シート幅：1.0ｍ,歩掛：標準歩掛",null,"-","補修幅10mm,補修深さ20mm,延長1000ｍ",null,"-","シート幅：1.0ｍ,歩掛：標準歩掛",null,"-","補修幅10mm,補修深,さ20mm,延長1000ｍ,歩掛：標準歩掛"]
[null,null,null,"標準施工規模",null,"-","1000m2",null,"-","25m2",null,"-","10m",null,"-","800m2",null,"-","3000m2",null,"-","600m2",null,"-","100m",null,"-","600m2",null,"-","10m"]
[null,"⑬","施工日数",null,null,1.075268817204301,2.5,null,1.075268817204301,40,null,1.6129032258064515,1.6129032258064515,null,1.075268817204301,1.25,null,1.075268817204301,1,null,1.075268817204301,1.6666666666666667,null,1.6129032258064515,1.613,null,1.075268817204301,1.6666666666666667,null,1.6129032258064515,1.1363636363636362]
[null,"⑭","従来技術との比較",null,"経済性",{"$f":"IFERROR(IF(G32=\"-\",\"-\",IF(G32=\"\",\"-\",IF(G32/F32=1,\"△\",IF(G32/F32>1,\"-（\"&ABS(ROUND(100*G32/F32-100,1))&\"％増）\",IF(G32/F32<1,\"○（\"&ABS(ROUND(100*G32/F32-100,1))&\"％減）\",\"\"))))),\"-\")","v":"-（26.3％増）"},{"$f":"IFERROR(IF(F32=\"-\",\"-\",\"（\"&TEXT(G32,\"#,###\")&\"-\"&TEXT(F32,\"#,###\")&\"）/\"&TEXT(F32,\"#,###\")&\"=\"&TEXT((G32-F32)/F32*100,\"0.0\")&\"%\"),\"-\")","v":"（2,844-2,251）/2,251=26.3%"},null,{"$f":"IFERROR(IF(J32=\"-\",\"-\",IF(J32=\"\",\"-\",IF(J32/I32=1,\"△\",IF(J32/I32>1,\"-（\"&ABS(ROUND(100*J32/I32-100,1))&\"％増）\",IF(J32/I32<1,\"○（\"&ABS(ROUND(100*J32/I32-100,1))&\"％減）\",\"\"))))),\"-\")","v":"-（888.8％増）"},{"$f":"IFERROR(IF(I32=\"-\",\"-\",\"（\"&TEXT(J32,\"#,###\")&\"-\"&TEXT(I32,\"#,###\")&\"）/\"&TEXT(I32,\"#,###\")&\"=\"&TEXT((J32-I32)/I32*100,\"0.0\")&\"%\"),\"-\")","v":"（22,257-2,251）/2,251=888.8%"},null,{"$f":"IFERROR(IF(M32=\"-\",\"-\",IF(M32=\"\",\"-\",IF(M32/L32=1,\"△\",IF(M32/L32>1,\"-（\"&ABS(ROUND(100*M32/L32-100,1))&\"％増）\",IF(M32/L32<1,\"○（\"&ABS(ROUND(100*M32/L32-100,1))&\"％減）\",\"\"))))),\"-\")","v":"-（168.3％増）"},{"$f":"IFERROR(IF(L32=\"-\",\"-\",\"（\"&TEXT(M32,\"#,###\")&\"-\"&TEXT(L32,\"#,###\")&\"）/\"&TEXT(L32,\"#,###\")&\"=\"&TEXT((M32-L32)/L32*100,\"0.0\")&\"%\"),\"-\")","v":"（1,038-387）/387=168.3%"},null,{"$f":"IFERROR(IF(P32=\"-\",\"-\",IF(P32=\"\",\"-\",IF(P32/O32=1,\"△\",IF(P32/O32>1,\"-（\"&ABS(ROUND(100*P32/O32-100,1))&\"％増）\",IF(P32/O32<1,\"○（\"&ABS(ROUND(100*P32/O32-100,1))&\"％減）\",\"\"))))),\"-\")","v":"-（21.6％増）"},{"$f":"IFERROR(IF(O32=\"-\",\"-\",\"（\"&TEXT(P32,\"#,###\")&\"-\"&TEXT(O32,\"#,###\")&\"）/\"&TEXT(O32,\"#,###\")&\"=\"&TEXT((P32-O32)/O32*100,\"0.0\")&\"%\"),\"-\")","v":"（2,737-2,251）/2,251=21.6%"},null,{"$f":"IFERROR(IF(S32=\"-\",\"-\",IF(S32=\"\",\"-\",IF(S32/R32=1,\"△\",IF(S32/R32>1,\"-（\"&ABS(ROUND(100*S32/R32-100,1))&\"％増）\",IF(S32/R32<1,\"○（\"&ABS(ROUND(100*S32/R32-100,1))&\"％減）\",\"\"))))),\"-\")","v":"○（3.1％減）"},{"$f":"IFERROR(IF(R32=\"-\",\"-\",\"（\"&TEXT(S32,\"#,###\")&\"-\"&TEXT(R32,\"#,###\")&\"）/\"&TEXT(R32,\"#,###\")&\"=\"&TEXT((S32-R32)/R32*100,\"0.0\")&\"%\"),\"-\")","v":"（2,181-2,251）/2,251=-3.1%"},null,{"$f":"IFERROR(IF(V32=\"-\",\"-\",IF(V32=\"\",\"-\",IF(V32/U32=1,\"△\",IF(V32/U32>1,\"-（\"&ABS(ROUND(100*V32/U32-100,1))&\"％増）\",IF(V32/U32<1,\"○（\"&ABS(ROUND(100*V32/U32-100,1))&\"％減）\",\"\"))))),\"-\")","v":"-（2.7％増）"},{"$f":"IFERROR(IF(U32=\"-\",\"-\",\"（\"&TEXT(V32,\"#,###\")&\"-\"&TEXT(U32,\"#,###\")&\"）/\"&TEXT(U32,\"#,###\")&\"=\"&TEXT((V32-U32)/U32*100,\"0.0\")&\"%\"),\"-\")","v":"（2,311-2,251）/2,251=2.7%"},null,{"$f":"IFERROR(IF(Y32=\"-\",\"-\",IF(Y32=\"\",\"-\",IF(Y32/X32=1,\"△\",IF(Y32/X32>1,\"-（\"&ABS(ROUND(100*Y32/X32-100,1))&\"％増）\",IF(Y32/X32<1,\"○（\"&ABS(ROUND(100*Y32/X32-100,1))&\"％減）\",\"\"))))),\"-\")","v":"-（12.6％増）"},{"$f":"IFERROR(IF(X32=\"-\",\"-\",\"（\"&TEXT(Y32,\"#,###\")&\"-\"&TEXT(X32,\"#,###\")&\"）/\"&TEXT(X32,\"#,###\")&\"=\"&TEXT((Y32-X32)/X32*100,\"0.0\")&\"%\"),\"-\")","v":"（436-387）/387=12.6%"},null,{"$f":"IFERROR(IF(AB32=\"-\",\"-\",IF(AB32=\"\",\"-\",IF(AB32/AA32=1,\"△\",IF(AB32/AA32>1,\"-（\"&ABS(ROUND(100*AB32/AA32-100,1))&\"％増）\",IF(AB32/AA32<1,\"○（\"&ABS(ROUND(100*AB32/AA32-100,1))&\"％減）\",\"\"))))),\"-\")","v":"-（11.7％増）"},{"$f":"IFERROR(IF(AA32=\"-\",\"-\",\"（\"&TEXT(AB32,\"#,###\")&\"-\"&TEXT(AA32,\"#,###\")&\"）/\"&TEXT(AA32,\"#,###\")&\"=\"&TEXT((AB32-AA32)/AA32*100,\"0.0\")&\"%\"),\"-\")","v":"（2,515-2,251）/2,251=11.7%"},null,{"$f":"IFERROR(IF(AE32=\"-\",\"-\",IF(AE32=\"\",\"-\",IF(AE32/AD32=1,\"△\",IF(AE32/AD32>1,\"-（\"&ABS(ROUND(100*AE32/AD32-100,1))&\"％増）\",IF(AE32/AD32<1,\"○（\"&ABS(ROUND(100*AE32/AD32-100,1))&\"％減）\",\"\"))))),\"-\")","v":"-（552.8％増）"},{"$f":"IFERROR(IF(AD32=\"-\",\"-\",\"（\"&TEXT(AE32,\"#,###\")&\"-\"&TEXT(AD32,\"#,###\")&\"）/\"&TEXT(AD32,\"#,###\")&\"=\"&TEXT((AE32-AD32)/AD32*100,\"0.0\")&\"%\"),\"-\")","v":"（2,525-387）/387=552.8%"}]
[null,null,null,null,"工程",{"$f":"IFERROR(IF(G35=\"-\",\"-\",IF(G35=\"\",\"-\",IF(G35/F35=1,\"△\",IF(G35/F35>1,\"-（\"&ABS(ROUND(100*G35/F35-100,1))&\"％増）\",IF(G35/F35<1,\"○（\"&ABS(ROUND(100*G35/F35-100,1))&\"％減）\",\"\"))))),\"-\")","v":"-（132.5％増）"},{"$f":"IFERROR(IF(F35=\"-\",\"-\",\"（\"&TEXT(G35,\"##0.000\")&\"-\"&TEXT(F35,\"##0.000\")&\"）/\"&TEXT(F35,\"##0.000\")&\"=\"&TEXT((G35-F35)/F35*100,\"0.0\")&\"%\"),\"-\")","v":"（2.500-1.075）/1.075=132.5%"},null,{"$f":"IFERROR(IF(J35=\"-\",\"-\",IF(J35=\"\",\"-\",IF(J35/I35=1,\"△\",IF(J35/I35>1,\"-（\"&ABS(ROUND(100*J35/I35-100,1))&\"％増）\",IF(J35/I35<1,\"○（\"&ABS(ROUND(100*J35/I35-100,1))&\"％減）\",\"\"))))),\"-\")","v":"-（3620％増）"},{"$f":"IFERROR(IF(I35=\"-\",\"-\",\"（\"&TEXT(J35,\"##0.000\")&\"-\"&TEXT(I35,\"##0.000\")&\"）/\"&TEXT(I35,\"##0.000\")&\"=\"&TEXT((J35-I35)/I35*100,\"0.0\")&\"%\"),\"-\")","v":"（40.000-1.075）/1.075=3620.0%"},null,{"$f":"IFERROR(IF(M35=\"-\",\"-\",IF(M35=\"\",\"-\",IF(M35/L35=1,\"△\",IF(M35/L35>1,\"-（\"&ABS(ROUND(100*M35/L35-100,1))&\"％増）\",IF(M35/L35<1,\"○（\"&ABS(ROUND(100*M35/L35-100,1))&\"％減）\",\"\"))))),\"-\")","v":"△"},{"$f":"IFERROR(IF(L35=\"-\",\"-\",\"（\"&TEXT(M35,\"##0.000\")&\"-\"&TEXT(L35,\"##0.000\")&\"）/\"&TEXT(L35,\"##0.000\")&\"=\"&TEXT((M35-L35)/L35*100,\"0.0\")&\"%\"),\"-\")","v":"（1.613-1.613）/1.613=0.0%"},null,{"$f":"IFERROR(IF(P35=\"-\",\"-\",IF(P35=\"\",\"-\",IF(P35/O35=1,\"△\",IF(P35/O35>1,\"-（\"&ABS(ROUND(100*P35/O35-100,1))&\"％増）\",IF(P35/O35<1,\"○（\"&ABS(ROUND(100*P35/O35-100,1))&\"％減）\",\"\"))))),\"-\")","v":"-（16.3％増）"},{"$f":"IFERROR(IF(O35=\"-\",\"-\",\"（\"&TEXT(P35,\"##0.000\")&\"-\"&TEXT(O35,\"##0.000\")&\"）/\"&TEXT(O35,\"##0.000\")&\"=\"&TEXT((P35-O35)/O35*100,\"0.0\")&\"%\"),\"-\")","v":"（1.250-1.075）/1.075=16.3%"},null,{"$f":"IFERROR(IF(S35=\"-\",\"-\",IF(S35=\"\",\"-\",IF(S35/R35=1,\"△\",IF(S35/R35>1,\"-（\"&ABS(ROUND(100*S35/R35-100,1))&\"％増）\",IF(S35/R35<1,\"○（\"&ABS(ROUND(100*S35/R35-100,1))&\"％減）\",\"\"))))),\"-\")","v":"○（7％減）"},{"$f":"IFERROR(IF(R35=\"-\",\"-\",\"（\"&TEXT(S35,\"##0.000\")&\"-\"&TEXT(R35,\"##0.000\")&\"）/\"&TEXT(R35,\"##0.000\")&\"=\"&TEXT((S35-R35)/R35*100,\"0.0\")&\"%\"),\"-\")","v":"（1.000-1.075）/1.075=-7.0%"},null,{"$f":"IFERROR(IF(V35=\"-\",\"-\",IF(V35=\"\",\"-\",IF(V35/U35=1,\"△\",IF(V35/U35>1,\"-（\"&ABS(ROUND(100*V35/U35-100,1))&\"％増）\",IF(V35/U35<1,\"○（\"&ABS(ROUND(100*V35/U35-100,1))&\"％減）\",\"\"))))),\"-\")","v":"-（55％増）"},{"$f":"IFERROR(IF(U35=\"-\",\"-\",\"（\"&TEXT(V35,\"##0.000\")&\"-\"&TEXT(U35,\"##0.000\")&\"）/\"&TEXT(U35,\"##0.000\")&\"=\"&TEXT((V35-U35)/U35*100,\"0.0\")&\"%\"),\"-\")","v":"（1.667-1.075）/1.075=55.0%"},null,{"$f":"IFERROR(IF(Y35=\"-\",\"-\",IF(Y35=\"\",\"-\",IF(Y35/X35=1,\"△\",IF(Y35/X35>1,\"-（\"&ABS(ROUND(100*Y35/X35-100,1))&\"％増）\",IF(Y35/X35<1,\"○（\"&ABS(ROUND(100*Y35/X35-100,1))&\"％減）\",\"\"))))),\"-\")","v":"-（0％増）"},{"$f":"IFERROR(IF(X35=\"-\",\"-\",\"（\"&TEXT(Y35,\"##0.000\")&\"-\"&TEXT(X35,\"##0.000\")&\"）/\"&TEXT(X35,\"##0.000\")&\"=\"&TEXT((Y35-X35)/X35*100,\"0.0\")&\"%\"),\"-\")","v":"（1.613-1.613）/1.613=0.0%"},null,{"$f":"IFERROR(IF(AB35=\"-\",\"-\",IF(AB35=\"\",\"-\",IF(AB35/AA35=1,\"△\",IF(AB35/AA35>1,\"-（\"&ABS(ROUND(100*AB35/AA35-100,1))&\"％増）\",IF(AB35/AA35<1,\"○（\"&ABS(ROUND(100*AB35/AA35-100,1))&\"％減）\",\"\"))))),\"-\")","v":"-（55％増）"},{"$f":"IFERROR(IF(AA35=\"-\",\"-\",\"（\"&TEXT(AB35,\"##0.000\")&\"-\"&TEXT(AA35,\"##0.000\")&\"）/\"&TEXT(AA35,\"##0.000\")&\"=\"&TEXT((AB35-AA35)/AA35*100,\"0.0\")&\"%\"),\"-\")","v":"（1.667-1.075）/1.075=55.0%"},null,{"$f":"IFERROR(IF(AE35=\"-\",\"-\",IF(AE35=\"\",\"-\",IF(AE35/AD35=1,\"△\",IF(AE35/AD35>1,\"-（\"&ABS(ROUND(100*AE35/AD35-100,1))&\"％増）\",IF(AE35/AD35<1,\"○（\"&ABS(ROUND(100*AE35/AD35-100,1))&\"％減）\",\"\"))))),\"-\")","v":"○（29.5％減）"},{"$f":"IFERROR(IF(AD35=\"-\",\"-\",\"（\"&TEXT(AE35,\"##0.000\")&\"-\"&TEXT(AD35,\"##0.000\")&\"）/\"&TEXT(AD35,\"##0.000\")&\"=\"&TEXT((AE35-AD35)/AD35*100,\"0.0\")&\"%\"),\"-\")","v":"（1.136-1.613）/1.613=-29.5%"}]
[null,null,"判定の凡例 \n  ○：従来技術より優れる\n  △：従来技術と同程度\n  －：上記以外",null,"品質・出来形","／:⑪並びに、総括：⑳耐久性に記載。",null,null,"／:⑪並びに、総括：⑳耐久性に記載。",null,null,"／:⑪並びに、総括：⑳耐久性に記載。",null,null,"／:⑪並びに、総括：⑳耐久性に記載。",null,null,"／:⑪並びに、総括：⑳耐久性に記載。",null,null,"／:⑪並びに、総括：⑳耐久性に記載。",null,null,"／:⑪並びに、総括：⑳耐久性に記載。",null,null,"／:⑪並びに、総括：⑳耐久性に記載。",null,null,"／:⑪並びに、総括：⑳耐久性に記載。"]
[null,null,null,null,"安全性","△:従来技術（クラック防止シート張）と同程度。",null,null,"△:従来技術（クラック防止シート張）と同程度である。",null,null,"〇:常温硬化型の材料であり、火気を使用しない為、安全性は向上する。",null,null,"△:従来工法と同様の施工方法であり、同程度。",null,null,"△:従来技術（クラック防止シート張）と同程度。",null,null,"△:従来技術（クラック防止シート張）と同程度である。",null,null,"△:従来技術（クラック補修工）と同程度。",null,null,"△:従来技術（クラック防止シート張）と同程度。",null,null,"○:常温硬化型の材料であり、火気を使用しない為、安全性は向上する。"]
[null,null,null,null,"施工性","〇:プライマーの塗布作業、離けい紙をはがす等の作業工程が発生しないため施工性は向上。",null,null,"△:従来技術（クラック防止シート張）と同程度である。",null,null,"〇:溶解釜での溶解が不要であり、施工性は向上する。",null,null,"△:従来工法と同様の施工方法であり、同程度。",null,null,"〇:鋲止めによる施工であり、転圧が不要なため、施工性は向上する。",null,null,"△:従来技術（クラック防止シート張）と同程度である。",null,null,"〇:専用の溶解釜、シーラー(注入機)を使用することにより、施工性は向上する。",null,null,"△:従来技術（クラック防止シート張）と同程度。",null,null,"○:現場での溶融作業が不要であり、施工性の向上が図れる。"]
[null,null,null,null,"環境","△:従来技術（クラック防止シート張）と同程度。",null,null,"△:従来技術（クラック防止シート張）と同程度である。",null,null,"△:従来技術（クラック補修工）と同程度。",null,null,"△:従来工法と同様の施工方法であり、同程度。",null,null,"〇:離けい紙がないため、廃棄材が発生しないことにより環境は向上する。",null,null,"△:従来技術（クラック防止シート張）と同程度である。",null,null,"△:従来技術（クラック補修工）と同程度。",null,null,"○:使用材料は、アスファルト+骨材のみであり、従来製品のような基材を手作業で排除する手間がなく、リサイクルが可能である。",null,null,"△:従来技術（クラック補修工）と同程度。"]
[null,"⑮","舗装材の物性・性能","バインダー物性","使用材料","-","-","-","-","-","-","セミブローンアスファルト（イソシールAC）","イソシールAC","-","-","-","-","-","-","-","-","-","-","クラックシールNX","クラックシールNX","-","-","-","-","-","-","-"]
[null,null,null,null,"試験規格","舗装設計施工指針における標準的性状","新技術の試験結果　","比較","舗装設計施工指針における標準的性状","新技術の試験結果　","比較","舗装設計施工指針における標準的性状（自社基準）","新技術の試験結果　","比較","舗装設計施工指針における標準的性状（自社基準）","新技術の試験結果　","比較","舗装設計施工指針における標準的性状（自社基準）","新技術の試験結果　","比較","舗装設計施工指針における標準的性状（自社基準）","新技術の試験結果　","比較","舗装設計施工指針における標準的性状（自社基準）","新技術の試験結果　","比較","舗装設計施工指針における標準的性状","新技術の試験結果　","比較","-","新技術の試験結果　","比較"]
[null,null,null,null,"針入度（25℃）：mm","-","-","-","-","-","-","4.0mm以下","0.7mm","〇","-","-","-","-","-","-","-","-","-","6mm以下(円すい針）","2.2mm(円すい針）","○","-","-","-","-","-","-"]
[null,null,null,null,"軟化点：℃","-","-","-","-","-","-","80℃以上","130℃以下","〇","-","-","-","-","-","-","-","-","-","100℃以上","116.0℃","○","-","-","-","-","-","-"]
[null,null,null,null,"伸度：cm","-","-","-","-","-","-","-","-","-","-","-","-","-","-","-","-","-","-","-","-","-","-","-","-","-","-","-"]
[null,null,null,null,"タフネス：N・m","-","-","-","-","-","-","-","-","-","-","-","-","-","-","-","-","-","-","-","-","-","-","-","-","-","-","-"]
[null,null,null,null,"テナシティ（25℃）：N・m","-","-","-","-","-","-","-","-","-","-","-","-","-","-","-","-","-","-","-","-","-","-","-","-","-","-","-"]
[null,null,null,null,"粗骨材の剥離面積率：％","-","-","-","-","-","-","-","-","-","-","-","-","-","-","-","-","-","-","-","-","-","-","-","-","-","-","-"]
[null,null,null,null,"フラース脆化点：℃","-","-","-","-","-","-","－12℃以下","－35℃以下","〇","-","-","-","-","-","-","-","-","-","-","-","-","-","-","-","-","-","-"]
[null,null,null,null,"曲げ仕事量：kPa","-","-","-","-","-","-","-","-","-","-","-","-","-","-","-","-","-","-","700kPa以上","2404kPa","○","-","-","-","-","-","-"]
[null,null,null,null,"曲げスティフネス（-20℃）：MPa","-","-","-","-","-","-","-","-","-","-","-","-","-","-","-","-","-","-","30MPa以下（-10℃）","21MPa（-10℃）","○","-","-","-","-","-","-"]
[null,null,null,null,"薄膜加熱質量変化率：％","-","-","-","-","-","-","-","-","-","-","-","-","-","-","-","-","-","-","-","-","-","-","-","-","-","-","-"]
[null,null,null,null,"薄膜加熱後の針入度残留率：％","-","-","-","-","-","-","-","-","-","-","-","-","-","-","-","-","-","-","-","-","-","-","-","-","-","-","-"]
[null,null,null,null,"引火点：℃","-","-","-","-","-","-","-","-","-","-","-","-","-","-","-","-","-","-","-","-","-","-","-","-","-","-","-"]
[null,null,null,"混合物物性","［参考］混合物","-","-","-","-","-","-","-","-","-","-","-","-","-","-","-","-","-","-","-","-","-","-","-","-","-","-","-"]
[null,null,null,null,"試験規格","［比較対象値］従来技術の試験結果","新技術の試験結果　","比較","［比較対象値］従来技術の試験結果","新技術の試験結果　","比較","［比較対象値］従来技術の試験結果","新技術の試験結果　","比較","［比較対象値］従来技術の試験結果","新技術の試験結果　","比較","［比較対象値］従来技術の試験結果","新技術の試験結果　","比較","［比較対象値］従来技術の試験結果","新技術の試験結果　","比較","［比較対象値］従来技術の試験結果","新技術の試験結果　","比較","［比較対象値］従来技術の試験結果","新技術の試験結果　","比較","-","新技術の試験結果　","比較"]
[null,null,null,null,"マーシャル安定度：kN","-","-","-","-","-","-","-","-","-","-","-","-","-","-","-","-","-","-","-","-","-","-","-","-","-","-","-"]
[null,null,null,null,"フロー値：cm","-","-","-","-","-","-","-","-","-","-","-","-","-","-","-","-","-","-","-","-","-","-","-","-","-","-","-"]
[null,null,null,null,"動的安定度：回/mm","-","-","-","-","-","-","-","-","-","-","-","-","-","-","-","-","-","-","-","-","-","-","-","-","-","-","-"]
[null,null,null,null,"残留安定度：％","-","-","-","-","-","-","-","-","-","-","-","-","-","-","-","-","-","-","-","-","-","-","-","-","-","-","-"]
[null,null,null,null,"剥離抵抗性：％","-","-","-","-","-","-","-","-","-","-","-","-","-","-","-","-","-","-","-","-","-","-","-","-","-","-","-"]
[null,null,null,null,"カンタブロ損失率：％","-","-","-","-","-","-","-","-","-","-","-","-","-","-","-","-","-","-","-","-","-","-","-","-","-","-","-"]
[null,null,null,"その他の試験結果",null,"・引張強さ（長手方向）試験を実施し、従来技術の不織布系リフレクションクラック抑制シートの5～20KN/ｍ程度に対して、115±15KN/ｍを確認した。\t\t\t\t\t\t\t\t\t\t\t\t\t\t\t\t\t\t\t\t\t\t\t\t\t\t・引張強さ（幅方向）試験を実施し、従来技術の不織布系リフレクションクラック抑制シートの5～20KN/ｍ程度に対して、115±15KN/ｍを確認した。\t\t\t\t\t\t\t\t\t\t\t\t\t\t\t\t\t\t\t\t\t\t\t\t\t\t・伸長率試験を実施し、従来技術の不織布系リフレクションクラック抑制シートの30％以上に対して、2.5±0.5％を確認した。\t\t\t\t\t\t\t\t\t\t\t\t\t\t\t\t\t\t\t\t\t\t\t\t\t\t\t\t\t-",null,null,"・引張強さ試験を実施し、自社基準の300N/ｃｍ以上に対して、（長手方向）380Ｎ/cm、（幅方向）370Ｎ/ｃｍを確認した。・伸び率試験を実施し、自社基準の70％以上に対して、（長手方向）119%、（幅方向）98%を確認した。・引裂強さ試験を実施し、自社基準の80N以上に対して、（長手方向）120Ｎ、（幅方向）112Ｎを確認した。・防水性試験を実施し、水圧3ｋｇ/ｃｍ³のとき、漏水がないことを確認した。",null,null,"・割れ抵抗性試験を実施し、自社基準の9℃以下に対して、-33℃を確認した。\t\t\t\t\t\t\t\t\t\t\t\t\t\t\t\t\t\t\t\t\t\t\t\t\t\t\t\t\t・伸び率試験を実施し、従来技術のブローンアスファルトによるシール材注入工の67％に対して、338％を確認した。",null,null,"・引張強さ（長手方向）試験を実施し、長手方向引張強さ（10ｍｍ当り）自社基準700N以上に対して、801Nを確認した。・引張強さ（幅方向）試験を実施し、幅方向引張強さ（10ｍｍ当り）自社基準600N以上に対して、685Nを確認した。・施工時のブリスタリングの試験を実施し、従来技術は表層舗設時に既設基層部の水分が蒸発することによりブリスタリングが生じることがあったが、ブリスタリングの発生は確認されなかった。・リフレクションクラック抑制効果の試験を実施し、クラック発生遅延効果は、従来技術5.9倍に対して8.5倍を確認した。・たわみ性（特殊な曲げ試験による曲げ破断強度）試験を実施し、従来技術の曲げ破断強度の11.9N/mm2に対して、14.1N/mm2を確認した。",null,null,"・引張強さ（長手方向）試験を実施し、規格値の110kN/ｍ以上に対して、129KN/ｍを確認した。・引張強さ（幅方向）試験を実施し、規格値の110kN/ｍ以上に対して、145KN/ｍを確認した。・伸び率（長手方向）試験を実施し、従来技術の不織布系クラック抑制シートの50％以上に対して4.2％を確認した。・伸び率（幅方向）試験を実施し、従来技術の不織布系クラック抑制シートの50％以上に対して3.4％を確認した。",null,null,"・引張強さ（長手方向）試験を実施し、自社基準の1,000N以上に対して、1,444Nを確認した。・引張強さ（幅方向）試験を実施し、自社基準の800N以上に対して、1,263Nを確認した。・防水性機能試験を実施し、自社基準の0.2ml以下に対して、0.08mlを確認した。",null,null,"・割れ抵抗性（応力緩和下限温度）試験を実施し、従来技術のブローンアスファルトによるクラックシールの下限温度0℃以下に対して、-15℃を確認した。・剥がれ抵抗性（接着疲労破壊回数）試験を実施し、従来技術のブローンアスファルトによるクラックシールの破壊回数100回以上に対して、1万回以上（5℃水中）を確認した。",null,null,"クラック抑制効果：クラック抑制シートを敷設した試験体について、曲げ走行試験（土研法）を実施し、クラック貫通までの走行回数は、従来20,872回に対して、22,688回を確認（自社試験）。耐流動性：表層と基層の2層構造供試体についてホイールトラッキング試験を実施し、動的安定度（DS）は従来209回/mmに対して、257回/mmを確認（自社試験）。低温可とう性試験と耐薬品性試験：低温時の折損やひび割れはなく、薬品に浸せきしても異常のないことも確認（自社試験）。",null,null,"浸透深さ(mm)（スリット幅1.0mm）：165（社内規格50mm以上）（舗装調査・試験法便覧）引張強度(N/mm2)：1.2（社内規格0.5以上）（JIS A 6021）伸び率(％)：525（社内規格100以上）（JIS A 6021）割れ抵抗性：応力緩和下限温度－35℃以下（首都高速道路 合格値－10℃以下）（首都高速道路(株)　舗装設計施工要領 2019年6月）　剥がれ抵抗性：破壊回数10万回以上（首都高速道路 合格値10万回以上）（首都高速道路(株)　舗装設計施工要領 2019年6月）　粘着性：粘着率0％（首都高速道路 合格値5％以下）（首都高速道路(株)　舗装設計施工要領 2019年6月）"]
[null,"⑯","実施している性能評価試験",null,null,"-",null,null,"-",null,null,"-",null,null,"-",null,null,"-",null,null,"-",null,null,"-",null,null,"ホイールトラッキング試験",null,null,"割れ抵抗性、剥がれ抵抗性、粘着性（首都高速道路(株)　舗装設計施工要領 2019年6月）"]
[null,"⑰","施工実績\n（過去３年）",null,"国土交通省（活用効果調査表数）","2件（九州で0件）",null,null,"3件（九州で2件）",null,null,"2件（九州で0件）",null,null,"53件（九州で13件）",null,null,"57件（九州で17件）",null,null,"22件（九州で9件）",null,null,"22件（九州で9件）",null,null,"0件（九州で0件）",null,null,"0件（九州で0件）"]
[null,null,null,null,"地方自治体（開発者ヒアリング）","242件（九州で21件）",null,null,"154件（九州で67件）",null,null,"9件（九州で3件）",null,null,"552件（九州で55件）",null,null,"1200件（九州で100件）",null,null,"253件（九州で10件）",null,null,"500件以上（九州で85件）",null,null,"258件（九州で20件）",null,null,"2件（九州で2件）"]
[null,null,null,null,"その他（開発者ヒアリング）","53件（九州で2件）",null,null,"637件（九州で95件）",null,null,"191件（九州で11件）",null,null,"3件（九州で1件）",null,null,"50件（九州で5件）",null,null,"0件（九州で0件）",null,null,"-件（九州で5件）",null,null,"-件（九州で5件）",null,null,"-件（九州で5件）"]
[null,"⑱","特許等","特許",null,"-",null,null,"-",null,null,"第6381500号「道路の補修剤及び道路の補修方法」",null,null,"-",null,null,"特許第3411265号「アスファルト舗装道路における補強シートの敷設固定方法」",null,null,"-",null,null,"-",null,null,"第6756766号「アスファルトシート、アスファルトシートを用いた舗装構造およびアスファルトシートを用いた舗装工法」",null,null,"-"]
[null,null,null,"建設技術審査証明",null,"-",null,null,"-",null,null,"-",null,null,"-",null,null,"-",null,null,"-",null,null,"-",null,null,"-",null,null,"-"]
[null,"⑲","生産供給体制（機械保有台数等）",null,null,"全国提供可能。アークノハラ那須工場（栃木県）にて定量在庫してiいる。納期は発注後10日前後の出荷。特殊な機械は使用なし。",null,null,"国内全都道府県への製品発送可能",null,null,"生産箇所は1か所で、全国に配送可能。",null,null,"九州地区：福岡工場、熊本工場、大分工場、鹿児島工場",null,null,"国内全県への製品配達による技術提供が可能。",null,null,"国内全県への製品配達による技術提供が可能。",null,null,"九州地区：福岡工場、熊本工場、大分工場、鹿児島工場",null,null,"九州地区：福岡工場、熊本工場、大分工場、鹿児島工場",null,null,"九州地区：福岡工場、熊本工場、大分工場、鹿児島工場"]
[null,"⑳","備考",null,null,"-",null,null,"-",null,null,"-",null,null,"-",null,null,"-",null,null,"-",null,null,"-",null,null,"-",null,null,"-"]
["総括","㉑","耐久性等",null,null,"・［新技術の特徴］：本技術は、リフレクションクラックによるひび割れ補修時におけるオーバーレイ工法、切削オーバーレイ工法、路盤改修を伴う切削工事に使用可能である。特にリフレクションクラック抑制に効果があり、高い引張強度と低伸張性により敷設下のクラックの成長を抑え込む。製品はアスファルトの間に挟みこむ形での使用が一般的であるが、路盤直上に敷設可能の品種もあり、現場状況によって製品選択も可能である。（補完情報より）。\n・［耐久性］：引張強さ（長手・幅方向）試験を実施し、引張強度が不織布系リフレクションクラック抑制シートの5～20KN/ｍ程度以上に対して、115±15KN/ｍとなることを確認している（NETIS情報より）。\n・［耐久性］：伸長率試験を実施し、伸長率が不織布系リフレクションクラック抑制シートの30％以上に対して、2.5±0.5％となることを確認している（NETIS情報より）。",null,null,"・［新技術の特徴］：本技術は、改質アスファルトシートと合成繊維不織布シートを組み合わせた表面に滑り止め加工を施し、接着面に特殊ゴム化アスファルトを使用した舗装路面貼付け型のマット状クラック補修材である。防水性と下地の追従性を持ち補修箇所の骨材飛散防止、段差解消、鋼材部やコンクリート部の滑り止め等にも使用できる（補完情報より）。\n・引張強さ試験を実施し、自社基準の300N/ｃｍ以上に対して、長手方向380Ｎ/cm、幅方向370Ｎ/ｃｍを確認している（NETIS情報より）。\n・伸び率試験を実施し、自社基準の70％以上に対して、長手方向119%、幅方向98%を確認している（NETIS情報より）。\n・引裂強さ試験を実施し、自社基準の80N以上に対して、長手方向120Ｎ、幅方向112Ｎを確認している（NETIS情報より）。\n・防水性試験を実施し、水圧3ｋｇ/ｃｍ³のとき、漏水がないことを確認している（NETIS情報より）。",null,null,"・［新技術の特徴］：舗装クラック等の補修を行う材料で、手軽で低粘度、注入が容易であり常温で施工時間を短縮できる。付着に優れ、追従性にも優れる（補完情報より）。\n・割れ抵抗性試験等を実施し、自社基準の9℃以下に対して、-33℃を確認している（NETIS情報より）。\n・伸び率試験を実施し、伸び率がブローンアスファルトによるシール材注入工の67％程度に対して、338％を確認している（NETIS情報より）。",null,null,"・［新技術の特徴］：本技術は、靭性に富み、引張強度が高く、リフレクションクラック抑制効果に優れる。G-Mは防水機能を有し、シート自体にタック性能を有するためシート上面にはタックコートが不要である。また、基材がメッシュ構造のため、ブリスタリングの発生を抑制する。切断性に優れ、補修時の切削作業が容易である（補完情報より）。\n・引張強さ（長手・幅方向）試験を実施し、従来技術（基材に不織布、鋼繊維、ガラス繊維シートを用いたリフレクションクラック抑制シート）の68KN/ｍ程度に対して、80KN/ｍであり従来技術の同等以上を確認している（NETIS情報より）。\n・施工時のブリスタリングの試験を実施し、ブリスタリングの発生は確認されなかった為、従来技術と同等以上であることを確認している（NETIS情報より）。\n・たわみ性（特殊な曲げ試験による曲げ破断強度）試験を実施し、従来技術の曲げ破断強度の11.9N/mm2に対して、14.1N/mm2を確認している（NETIS情報より）。",null,null,"・［新技術の特徴］：本技術は、ガラス繊維の織物に特殊アスファルトを含浸コーティングした、高い引張強度を有するクラック抑制シートである。道路舗装において、アスファルトの表層下あるいは中間下に敷設することで、アスファルト舗装のクラック（割れ）を抑制することができる防水機能を有した製品である（補完情報より）。\n・引張強さ試験を実施し、従来技術の不織布系クラック抑制シートの長手方向12KN/ｍ、幅方向8KN/ｍに対して、長手方向129KN/ｍ、幅方向145KN/ｍを確認している（NETIS情報より）。\n・伸び率試験を実施し、従来技術の不織布系クラック抑制シートの長手・幅方向50％以上に対して、長手方向4.2％、幅方向3.4％を確認している（NETIS情報より）。",null,null,"・［新技術の特徴］：本技術は、リフレクションクラックの抑制や舗装補強に効果がある。G・RDマットⅡ型のみ、橋梁等の舗装補強型常温自着式防水シート、仮設覆工板舗装補強・クラック対策としても使用可能である（補完情報より）。\n・長手方向の引張強さ試験を実施し、従来技術のガラス長繊維シート680Ｎに対して、1,444Ｎを確認している（NETIS情報より）。\n・幅方向の引張強さ試験を実施し、従来技術のガラス長繊維シート680Ｎに対して、1,263Ｎを確認している（NETIS情報より）。\n・防水性機能試験を実施し、従来技術のガラス長繊維シート0.15mlに対して、0.08mlを確認している（NETIS情報より）。",null,null,"・［新技術の特徴］：本技術のクラックシールＮＸは、従来のシール材より耐久性を高めたアスファルト系の加熱注入型シール材で、舗装寿命を延命させることができ、補修コストを縮減することのできる材料である。特徴として、低温時に割れず、交通荷重の繰り返し作用で割れや剥がれが生じなく、夏期にべたつかず耐候性に優れる。また、クラックへの浸透性が高い（補完情報より）。\n・[耐久性]：割れ抵抗性（応力緩和下限温度）試験を実施し、従来技術（ブローンアスファルトによるクラックシール）の下限温度0℃以下に対して、応力緩和下限温度-15℃を確認した（NETIS情報より）。\n・［耐久性］：剥がれ抵抗性（接着疲労破壊回数）試験を実施し、従来技術（ブローンアスファルトによるクラックシール）の破壊回数100回以上に対して、接着疲労破壊回数1万回以上（5℃水中）を確認した（NETIS情報より）。",null,null,"[新技術の特徴]：本技術はガラス繊維等の基材を使用せず、アスファルトと骨材のみで構成しているため、産業廃棄物の発生がなく、完全なリサイクルが可能である（補完情報より）。\n・曲げ走行試験を実施し、クラック貫通までの走行回数は非挿入4,567回、従来技術20,872回に対して、新技術は22,688回を確認している（NETIS情報より）。\n・ホイールトラッキング試験を実施し、非挿入の動的安定度（DS）225回/mm、従来技術209回/mmに対して、新技術は257回/mmを確認している（NETIS情報より）。",null,null,"・［新技術の特徴］本技術は、常温で施工可能なポリウレタン系ひび割れ注入材であり、アスファルト舗装やコンクリート舗装の目地部等\nの幅の広い破損個所においても高い止水性が期待できる。また、現場での加熱溶融作業が不要であるため、安全性及び施工性の向上\nが期待できる（補完情報より）。\n・割れ抵抗性、剥がれ抵抗性、粘着性試験、浸透深さ実験を実施し、参考規格値を満足していることを確認しており、高い止水性能を維持するための性能を有している（補完情報より）。"]
[null,"㉒","施工性\n(留意事項含む）",null,null,"・使用しているガラス繊維は耐熱性も高く、また常温施工が可能（NETIS情報より）。\n・GGシリーズは、敷設後タイヤローラーによる転圧が必要である（NETIS情報より）。\n・CGシリーズは、不織布のクッション効果により切削面となじむためレベリング層は不要である（NETIS情報より）。",null,null,"・常温施工が可能であるが、夏季に粘着が強い際は冷やす必要がある（補完情報より）。\n・マットの敷設後は表面を足踏みし、木槌、転圧棒、小型転圧機等で転圧する（NETIS情報より）。\n・クラック発生部分が舗装沈下を伴っている場合は、加熱合材や揮発性溶剤を含まない常温合材等で既設の舗装高まで被覆し、平坦性を確保する（NETIS情報より）。・シート同士の重ね合わせ部分は、接着不足による剥がれのないように確実に接着を行うこと。また、繋ぎ合わせの場合は、隙間からの雨水の侵入が剥がれの原因にもなるため、隙間がないように設置する（補完情報より）。・路面が濡れている時はバーナーで乾燥させる（補完情報より）。\n・表層クラックが動揺しているところや舗装表面の凹凸がひどいところでは、姉妹品であるストロングマットの裏面をバーナーであぶって溶かして貼り付けた上、マットの端をさらにバーナーであぶってすり付ける工法がより優れている（補完情報より）。",null,null,"・2液性でA液(硬化剤)が3タイプあり、作業環境に応じて硬化速度を選択できる（使用可能時間：Sタイプ（24分）、Mタイプ（12分）、Fタイプ（5分）（NETIS情報より）。\n・施工後、沈下した場合は、再度注入が必要となる（NETIS情報より）。",null,null,"・常温施工が可能であり、敷設後はタイヤローラーによる転圧が必要である（NETIS情報より）。\n・被接着面が濡れている場合は、自然乾燥、あるいはガスバーナーで加熱して乾燥を行うこと（NETIS情報より）。\n・外気温10℃以下では、シート裏面をガスバーナーで温めながら貼り付けを行う。ただし加熱しすぎてアスファルトコンパウンドを溶かし基材を露出させないように留意すること（NETIS情報より）。\n・施工時、プライマー(0.3㍑/㎡)の塗布は規定量を守ること（NETIS情報より）。",null,null,"・常温施工が可能であり、敷設は鋲止めによる固定のため、転圧は不要（NETIS情報より）。\n・舗装材舗設時のローラー転圧は、ゆっくり丁寧に行う（NETIS情報より）。",null,null,"・常温施工が可能であり、敷設後はタイヤローラーによる転圧が必要である（NETIS情報より）。\n・雨天時または強風時の施工は不可。また、気温5℃以下の状況下では、施工しないことが望ましい（NETIS情報より）。\n・車両の走行に巻き込まれる可能性があるため、敷設したまま（上層に施工をしない状態）での交通開放は不可（補完情報より）。",null,null,"・極度の盛り上がりがないように施工する（NETIS情報より）。\n・クラックシールNXの溶解は、均一加熱が可能な電気加熱式溶解釜「サーモメルター」の使用が望ましい（補完情報より）。\n・繰り返しの加熱は品質低下の原因になるので避けること（補完情報より）。",null,null,"・常温施工及びカッターナイフでの切断が可能であり、剥離紙を剥がして張り付けるのみであるため施工が容易である（補完情報より）。\n・乳剤散布後の養生は、水分が分解するまで十分に行うこと（NETIS情報より）。",null,null,"・ひび割れが水分で湿潤状態になっている場合は、水分がなくなるまで乾燥させてから施工を行う（補完情報より）。\n・補修を行う時期（外気温）により、可使時間および硬化時間が大きく変わるため、1日当たりの施工量に留意する必要がある（補完情報より）。\n・施工から交通開放までの時間は、気温5℃の場合は60分、気温20℃の場合は30分、気温35℃の場合は25分である（補完情報より）。\n・ひび割れや隙間への注入が可能であるため、橋梁のジョイントにも適用可能である（補完情報より）。"]
[null,"㉓","その他（留意事項含む）",null,null,"・オーバーレイ時の最低舗装厚は4ｃｍ以上が必要（NETIS情報より）。\n・維持工事等の切削で発生するAｓ破片の処分において、本製品が混入する場合は産業廃棄物となる（再資源化は不可）（補完情報より）。\n・基材のガラス繊維がアルカリ成分に弱いためコンクリート舗装には適用不可。また、せん断方向の強度は弱いため段差が生じやすい継ぎ目部・ジョイント部は適用不可となる（補完情報より）。\n・九州地方（国土交通省）での活用実績はない（補完情報より）。",null,null,"・オーバーレイ時の最低舗装厚は5ｃｍ以上が必要（補完情報より）。\n・維持工事等の切削で発生するAｓ破片の処分において、本製品が混入する場合は産業廃棄物となる（再資源化は不可）（補完情報より）。\n・マット上駐車など長時間の静荷重がかかるところは載荷跡が残る（補完情報より）。\n・遠心力が強く働くカーブ外側や同じ箇所でブレーキを踏みやすい料金所等、強い輪荷重がかかるところに発生しているクラック上に貼り付けたマットは、はく離や変形を生じることがある（補完情報より）。\n・小規模な舗装クラック修繕現場に適しており、現場条件等を考慮すること（WGからのコメント）。\n・九州地方（国土交通省）での活用実績はない（補完情報より）。",null,null,"・九州地方（国土交通省）での活用実績はない（補完情報より）。\n・少量の使用量から対応可能であり、小規模施工においても廃棄物の抑制が可能である（補完情報より）。\n・粘性が低く、注入後の盛り上がりがないため、歩道等への適用が可能（WGからのコメント）。",null,null,"・オーバーレイ時の最低舗装厚は5ｃｍ以上が必要（補完情報より）。\n・RCメッシュGおよびRCメッシュG-Mは、再舗装補修時に路面切削機に触れても絡まることなく、細かく切断が可能である。切削廃材に含まれた場合、再生混合物の品質に悪影響を与えないことを確認しているが、再資源化施設によっては受け入れられないことがあるため、事前確認が必要（NETIS情報より）。\n・亀甲状クラックで支持力が著しく低下している舗装は早期にクラックが生じる可能性があるので適用性が低い（補完情報より）。\n・コンクリート舗装版と構造物の境界目地部等の施工において、段差が発生している場合は事前に補修を行い、段差を解消した後にシートを敷設すること（補完情報より）。",null,null,"・オーバーレイ時の最低舗装厚は4ｃｍ以上が必要（NETIS情報より）。\n・維持工事等の切削で発生するAｓ破片の処分において、本製品が混入する場合は産業廃棄物となる（再資源化は不可）（補完情報より）。\n・施工方法は、鋲止め工法を基本とするが、現場条件より適用できない場合は、常温接着施工タイプ（アスパワーシートR)の製品もある（補完情報より）。\n・橋面・床版防水用として、アスパワーシートK（流し張り工法）がある（補完情報より）。",null,null,"・オーバーレイ時の最低舗装厚は4ｃｍ以上が必要（補完情報より）。\n・維持工事等の切削で発生するAｓ破片の処分において、本製品が混入する場合は産業廃棄物となる（再資源化は不可）（補完情報より）。\n・敷設後の養生時間は不要なので、できるだけ早い時期に舗装を行うこと（NETIS情報より）。",null,null,"・舗装のクラック全般に適用可能であるが、舗装が構造的な破損にある状態では(沈下を伴った亀甲状クラック）シール材注入では舗装の延命化は期待できず、別途、打換え等の修繕工法の検討を要する（補完情報より）。\n・注入直後は、タイヤなどへの付着を防止するために、表面に石粉、珪砂などを散布してから交通開放すること（補完情報より）。",null,null,"・九州地方（国土交通省）での活用実績はない（評価情報より）。\n・本技術敷設のみでの交通開放は行わない（必ずオーバーレイ施工を行う）（NETIS情報より）。\n・本技術敷設後の養生時間は不要なため、できるだけ早い時期にオーバーレイ施工を行う（NETIS情報より）。",null,null,"・九州地方（国土交通省）での活用実績はない（評価情報より）。\n・特にひび割れ幅が広い箇所に適しており、伸び率が525％で剥がれ抵抗性・割れ抵抗性に優れているため、注入後にひび割れが広がっても追従し、止水性を維持できる（補完情報より）。\n・ひび割れ幅1mm未満の破損個所では、十分な浸透性を確保することができないため適用不可（補完情報より）。"]
[]
[null,null,"施工費用","機械・労務",null,{"$f":"G30","v":504},null,null,{"$f":"J30","v":7257},null,null,{"$f":"M30","v":391.1},null,null,{"$f":"P30","v":538},null,null,{"$f":"S30","v":431},null,null,{"$f":"V30","v":421},null,null,{"$f":"Y30","v":295.60000000000002},null,null,{"$f":"AB30","v":425},null,null,{"$f":"AE30","v":205}]
[null,null,null,"材料",null,{"$f":"G31","v":2340},null,null,{"$f":"J31","v":15000},null,null,{"$f":"M31","v":646.79999999999995},null,null,{"$f":"P31","v":2199},null,null,{"$f":"S31","v":1750},null,null,{"$f":"V31","v":1890},null,null,{"$f":"Y31","v":140},null,null,{"$f":"AB31","v":2090},null,null,{"$f":"AE31","v":2320}]
[null,null,null,"合計",null,2844,null,null,22257,null,null,1037.9000000000001,null,null,2737,null,null,2181,null,null,2311,null,null,435.6,null,null,2515,null,null,2525]
[null,null,null,"備考",null,{"$f":"G33","v":"シート幅1.5ｍを1000㎡施工"},null,null,"補修マット（50cm角）を1000㎡施工",null,null,"補修幅10mm,補修深さ20mm,延長1000ｍ,歩掛：標準歩掛",null,null,"シート幅：1.0ｍ,歩掛：標準歩掛",null,null,"シート幅1.0ｍを1000㎡施工",null,null,"シート幅：1.0ｍ,歩掛：標準歩掛",null,null,"補修幅10mm,補修深さ20mm,延長1000ｍ",null,null,"シート幅：1.0ｍ,歩掛：標準歩掛",null,null,"補修幅10mm,補修深,さ20mm,延長1000ｍ,歩掛：標準歩掛"]
[null,null,null,"標準施工規模",null,"1000m2",null,null,"25m2",null,null,"10m",null,null,"800m2",null,null,"3000m2",null,null,"600m2",null,null,"100m",null,null,"600m2",null,null,"10m"]
[null,null,"施工日数",null,null,2.5,null,null,40,null,null,1.6129032258064515,null,null,1.25,null,null,1,null,null,1.6666666666666667,null,null,1.613,null,null,1.6666666666666667,null,null,1.1363636363636362]
[null,null,null,null,null,{"$f":"G36","v":"（2,844-2,251）/2,251=26.3%"},null,null,{"$f":"J36","v":"（22,257-2,251）/2,251=888.8%"},null,null,{"$f":"M36","v":"（1,038-387）/387=168.3%"},null,null,{"$f":"P36","v":"（2,737-2,251）/2,251=21.6%"},null,null,{"$f":"S36","v":"（2,181-2,251）/2,251=-3.1%"},null,null,{"$f":"V36","v":"（2,311-2,251）/2,251=2.7%"},null,null,{"$f":"Y36","v":"（436-387）/387=12.6%"},null,null,{"$f":"AB36","v":"（2,515-2,251）/2,251=11.7%"},null,null,{"$f":"AE36","v":"（2,525-387）/387=552.8%"}]
[null,null,null,null,null,{"$f":"G37","v":"（2.500-1.075）/1.075=132.5%"},null,null,{"$f":"J37","v":"（40.000-1.075）/1.075=3620.0%"},null,null,{"$f":"M37","v":"（1.613-1.613）/1.613=0.0%"},null,null,{"$f":"P37","v":"（1.250-1.075）/1.075=16.3%"},null,null,{"$f":"S37","v":"（1.000-1.075）/1.075=-7.0%"},null,null,{"$f":"V37","v":"（1.667-1.075）/1.075=55.0%"},null,null,{"$f":"Y37","v":"（1.613-1.613）/1.613=0.0%"},null,null,{"$f":"AB37","v":"（1.667-1.075）/1.075=55.0%"},null,null,{"$f":"AE37","v":"（1.136-1.613）/1.613=-29.5%"}]
[null,null,null,null,"使用材料",{"$f":"G42","v":"-"},null,null,{"$f":"J42","v":"-"},null,null,{"$f":"M42","v":"イソシールAC"},null,null,{"$f":"P42","v":"-"},null,null,{"$f":"S42","v":"-"},null,null,{"$f":"V42","v":"-"},null,null,{"$f":"Y42","v":"クラックシールNX"},null,null,{"$f":"AB42","v":"-"},null,null,{"$f":"AE42","v":"-"}]
[null,null,null,null,"試験規格",{"$f":"G43","v":"新技術の試験結果　"},null,null,{"$f":"J43","v":"新技術の試験結果　"},null,null,{"$f":"M43","v":"新技術の試験結果　"},null,null,{"$f":"P43","v":"新技術の試験結果　"},null,null,{"$f":"S43","v":"新技術の試験結果　"},null,null,{"$f":"V43","v":"新技術の試験結果　"},null,null,{"$f":"Y43","v":"新技術の試験結果　"},null,null,{"$f":"AB43","v":"新技術の試験結果　"},null,null,{"$f":"AE43","v":"新技術の試験結果　"}]
[null,null,null,null,"針入度（25℃）：mm",{"$f":"G44","v":"-"},null,null,{"$f":"J44","v":"-"},null,null,{"$f":"M44","v":"0.7mm"},null,null,{"$f":"P44","v":"-"},null,null,{"$f":"S44","v":"-"},null,null,{"$f":"V44","v":"-"},null,null,{"$f":"Y44","v":"2.2mm(円すい針）"},null,null,{"$f":"AB44","v":"-"},null,null,{"$f":"AE44","v":"-"}]
[null,null,null,null,"軟化点：℃","-",null,null,"-",null,null,"130℃以下",null,null,"-",null,null,"-",null,null,"-",null,null,"116.0℃",null,null,"-",null,null,"-"]
[null,null,null,null,"伸度：cm","-",null,null,"-",null,null,"-",null,null,"-",null,null,"-",null,null,"-",null,null,"-",null,null,"-",null,null,"-"]
[null,null,null,null,"タフネス：N・m","-",null,null,"-",null,null,"-",null,null,"-",null,null,"-",null,null,"-",null,null,"-",null,null,"-",null,null,"-"]
[null,null,null,null,"テナシティ（25℃）：N・m","-",null,null,"-",null,null,"-",null,null,"-",null,null,"-",null,null,"-",null,null,"-",null,null,"-",null,null,"-"]
[null,null,null,null,"粗骨材の剥離面積率：％","-",null,null,"-",null,null,"-",null,null,"-",null,null,"-",null,null,"-",null,null,"-",null,null,"-",null,null,"-"]
[null,null,null,null,"フラース脆化点：℃","-",null,null,"-",null,null,"－35℃以下",null,null,"-",null,null,"-",null,null,"-",null,null,"-",null,null,"-",null,null,"-"]
[null,null,null,null,"曲げ仕事量：kPa","-",null,null,"-",null,null,"-",null,null,"-",null,null,"-",null,null,"-",null,null,"2404kPa",null,null,"-",null,null,"-"]
[null,null,null,null,"曲げスティフネス（-20℃）：MPa","-",null,null,"-",null,null,"-",null,null,"-",null,null,"-",null,null,"-",null,null,"21MPa（-10℃）",null,null,"-",null,null,"-"]
[null,null,null,null,"薄膜加熱質量変化率：％","-",null,null,"-",null,null,"-",null,null,"-",null,null,"-",null,null,"-",null,null,"-",null,null,"-",null,null,"-"]
[null,null,null,null,"薄膜加熱後の針入度残留率：％","-",null,null,"-",null,null,"-",null,null,"-",null,null,"-",null,null,"-",null,null,"-",null,null,"-",null,null,"-"]
[null,null,null,null,"引火点：℃",{"$f":"G55","v":"-"},null,null,{"$f":"J55","v":"-"},null,null,{"$f":"M55","v":"-"},null,null,{"$f":"P55","v":"-"},null,null,{"$f":"S55","v":"-"},null,null,{"$f":"V55","v":"-"},null,null,{"$f":"Y55","v":"-"},null,null,{"$f":"AB55","v":"-"},null,null,{"$f":"AE55","v":"-"}]
[null,null,null,null,"［参考］混合物",{"$f":"G56","v":"-"},null,null,{"$f":"J56","v":"-"},null,null,{"$f":"M56","v":"-"},null,null,{"$f":"P56","v":"-"},null,null,{"$f":"S56","v":"-"},null,null,{"$f":"V56","v":"-"},null,null,{"$f":"Y56","v":"-"},null,null,{"$f":"AB56","v":"-"},null,null,{"$f":"AE56","v":"-"}]
[null,null,null,null,"試験規格","新技術の試験結果　",null,null,"新技術の試験結果　",null,null,"新技術の試験結果　",null,null,"新技術の試験結果　",null,null,"新技術の試験結果　",null,null,"新技術の試験結果　",null,null,"新技術の試験結果　",null,null,"新技術の試験結果　",null,null,"新技術の試験結果　"]
[null,null,null,null,"マーシャル安定度：kN","-",null,null,"-",null,null,"-",null,null,"-",null,null,"-",null,null,"-",null,null,"-",null,null,"-",null,null,"-"]
[null,null,null,null,"フロー値：cm","-",null,null,"-",null,null,"-",null,null,"-",null,null,"-",null,null,"-",null,null,"-",null,null,"-",null,null,"-"]
[null,null,null,null,"動的安定度：回/mm","-",null,null,"-",null,null,"-",null,null,"-",null,null,"-",null,null,"-",null,null,"-",null,null,"-",null,null,"-"]
[null,null,null,null,"残留安定度：％","-",null,null,"-",null,null,"-",null,null,"-",null,null,"-",null,null,"-",null,null,"-",null,null,"-",null,null,"-"]
[null,null,null,null,"剥離抵抗性：％","-",null,null,"-",null,null,"-",null,null,"-",null,null,"-",null,null,"-",null,null,"-",null,null,"-",null,null,"-"]
[null,null,null,null,"カンタブロ損失率：％","-",null,null,"-",null,null,"-",null,null,"-",null,null,"-",null,null,"-",null,null,"-",null,null,"-",null,null,"-"]
[null,null,null,null,"使用材料",{"$f":"H42","v":"-"},null,null,{"$f":"K42","v":"-"},null,null,{"$f":"N42","v":"-"},null,null,{"$f":"Q42","v":"-"},null,null,{"$f":"T42","v":"-"},null,null,{"$f":"W42","v":"-"},null,null,{"$f":"Z42","v":"-"},null,null,{"$f":"AC42","v":"-"},null,null,{"$f":"AF42","v":"-"}]
[null,null,null,null,"試験規格",{"$f":"H43","v":"比較"},null,null,{"$f":"K43","v":"比較"},null,null,{"$f":"N43","v":"比較"},null,null,{"$f":"Q43","v":"比較"},null,null,{"$f":"T43","v":"比較"},null,null,{"$f":"W43","v":"比較"},null,null,{"$f":"Z43","v":"比較"},null,null,{"$f":"AC43","v":"比較"},null,null,{"$f":"AF43","v":"比較"}]
[null,null,null,null,"針入度（25℃）：mm","-",null,null,"-",null,null,"〇",null,null,"-",null,null,"-",null,null,"-",null,null,"○",null,null,"-",null,null,"-"]
[null,null,null,null,"軟化点：℃","-",null,null,"-",null,null,"〇",null,null,"-",null,null,"-",null,null,"-",null,null,"○",null,null,"-",null,null,"-"]
[null,null,null,null,"伸度：cm","-",null,null,"-",null,null,"-",null,null,"-",null,null,"-",null,null,"-",null,null,"-",null,null,"-",null,null,"-"]
[null,null,null,null,"タフネス：N・m","-",null,null,"-",null,null,"-",null,null,"-",null,null,"-",null,null,"-",null,null,"-",null,null,"-",null,null,"-"]
[null,null,null,null,"テナシティ（25℃）：N・m","-",null,null,"-",null,null,"-",null,null,"-",null,null,"-",null,null,"-",null,null,"-",null,null,"-",null,null,"-"]
[null,null,null,null,"粗骨材の剥離面積率：％",{"$f":"H49","v":"-"},null,null,"-",null,null,"-",null,null,"-",null,null,"-",null,null,"-",null,null,"-",null,null,"-",null,null,"-"]
[null,null,null,null,"フラース脆化点：℃","-",null,null,"-",null,null,"〇",null,null,"-",null,null,"-",null,null,"-",null,null,"-",null,null,"-",null,null,"-"]
[null,null,null,null,"曲げ仕事量：kPa","-",null,null,"-",null,null,"-",null,null,"-",null,null,"-",null,null,"-",null,null,"○",null,null,"-",null,null,"-"]
[null,null,null,null,"曲げスティフネス（-20℃）：MPa","-",null,null,"-",null,null,"-",null,null,"-",null,null,"-",null,null,"-",null,null,"○",null,null,"-",null,null,"-"]
[null,null,null,null,"薄膜加熱質量変化率：％","-",null,null,"-",null,null,"-",null,null,"-",null,null,"-",null,null,"-",null,null,"-",null,null,"-",null,null,"-"]
[null,null,null,null,"薄膜加熱後の針入度残留率：％","-",null,null,"-",null,null,"-",null,null,"-",null,null,"-",null,null,"-",null,null,"-",null,null,"-",null,null,"-"]
[null,null,null,null,"引火点：℃","-",null,null,"-",null,null,"-",null,null,"-",null,null,"-",null,null,"-",null,null,"-",null,null,"-",null,null,"-"]
[null,null,null,null,"［参考］混合物","-",null,null,"-",null,null,"-",null,null,"-",null,null,"-",null,null,"-",null,null,"-",null,null,"-",null,null,"-"]
[null,null,null,null,"試験規格","比較",null,null,"比較",null,null,"比較",null,null,"比較",null,null,"比較",null,null,"比較",null,null,"比較",null,null,"比較",null,null,"比較"]
[null,null,null,null,"マーシャル安定度：kN","-",null,null,"-",null,null,"-",null,null,"-",null,null,"-",null,null,"-",null,null,"-",null,null,"-",null,null,"-"]
[null,null,null,null,"フロー値：cm","-",null,null,"-",null,null,"-",null,null,"-",null,null,"-",null,null,"-",null,null,"-",null,null,"-",null,null,"-"]
[null,null,null,null,"動的安定度：回/mm","-",null,null,"-",null,null,"-",null,null,"-",null,null,"-",null,null,"-",null,null,"-",null,null,"-",null,null,"-"]
[null,null,null,null,"残留安定度：％","-",null,null,"-",null,null,"-",null,null,"-",null,null,"-",null,null,"-",null,null,"-",null,null,"-",null,null,"-"]
[null,null,null,null,"剥離抵抗性：％","-",null,null,"-",null,null,"-",null,null,"-",null,null,"-",null,null,"-",null,null,"-",null,null,"-",null,null,"-"]
[null,null,null,null,"カンタブロ損失率：％",{"$f":"H63","v":"-"},null,null,{"$f":"K63","v":"-"},null,null,{"$f":"N63","v":"-"},null,null,{"$f":"Q63","v":"-"},null,null,{"$f":"T63","v":"-"},null,null,{"$f":"W63","v":"-"},null,null,{"$f":"Z63","v":"-"},null,null,{"$f":"AC63","v":"-"},null,null,{"$f":"AF63","v":"-"}]

{"sheet":"仕様の整理","index":5,"n_rows":12,"n_cols":23,"rows_kept":12,"cut":false,"hidden":false,"merged":[[1,9,2,9]]}
[null," 対象工種の仕様の整理［舗装版ひび割れ補修工］",null,null,"登録技術：",{"$f":"SUMPRODUCT((E4:E980<>\"\")/COUNTIF(E4:E980,E4:E980&\"\"))&\"技術\"&MAX(B:B)&\"仕様\"","v":"9技術9仕様"},"検索結果：",{"$f":"\"\"&SUM(IF((A4:A980<>\"\")*(A4:A980<>\"-\")*(E4:E980<>\"\"),1/COUNTIFS(A4:A980,\"<>\",A4:A980,\"<>-\",E4:E980,E4:E980)))&\"技術\"&COUNT(A:A)&\"仕様\"","v":"9技術9仕様"},null,"→検索結果",null,null,"→絶対順位"]
[null,"基本情報",null,null,null,null,null,null,null,"条件一致","リフレクションクラック防止シート","シール材注入工法"]
["検索順位","番号","技術\n番号","技術名","NETIS登録番号","技術の種類","審議終了技術","更新日","種類",null,{"$f":"IF(検索!Q7=TRUE,\"○\",\"\")","v":"○"},{"$f":"IF(検索!Q8=TRUE,\"○\",\"\")","v":"○"},"九州本社","Aの技術","九州でA","記号","登録年度","登録番号","審議終了","仕様","地整","重み付け","絶対順位"]
[{"$f":"IF(検索!$U$1=\"条件検索\", IF(J4=\"○\", COUNTIFS(J:J,\"○\",W:W,\"<\"&W4)+1, \"-\"), IF(検索!$U$1=\"技術名検索\", IF(検索!$B$21=仕様の整理!E4,W4, \"-\"), \"-\"))","v":1},1,"1-1","グラスグリッド","KT-160100-VE","事後評価済技術","○","令和7年9月","リフレクションクラック防止シート",{"$f":"IF(COUNTIF($K$3:$L$3,\"○\")=0,\"○\",(IF(COUNTIF(K4:L4,\"○\")>0,\"○\",\"\")))","v":"○"},{"$f":"IF(AND($K$3=\"○\", I4=$K$2), \"○\", \"×\")","v":"○"},{"$f":"IF(AND($L$3=\"○\", I4=$L$2), \"○\", \"×\")","v":"×"},{"$f":"HLOOKUP($C4,DB!$1:$1048576,9,0)","v":"-"},{"$f":"RIGHT(E4,LEN(E4)-FIND(\"-\",E4,FIND(\"-\",E4)+1))","v":"VE"},{"$f":"IF(AND(M4=\"◎\",N4=\"A\"),1,2)","v":2},{"$f":"VLOOKUP(N4,条件!D:E,2,0)","v":1},{"$f":"IFERROR(IF(VALUE(LEFT(MID(E4,FIND(\"-\",E4)+1,FIND(\"-\",E4,FIND(\"-\",E4)+1)-FIND(\"-\",E4)-1),2))>=90,\"19\"&LEFT(MID(E4,FIND(\"-\",E4)+1,FIND(\"-\",E4,FIND(\"-\",E4)+1)-FIND(\"-\",E4)-1),2),\"20\"&LEFT(MID(E4,FIND(\"-\",E4)+1,FIND(\"-\",E4,FIND(\"-\",E4)+1)-FIND(\"-\",E4)-1),2)),\"\")","v":"2016"},{"$f":"MID(E4, FIND(\"-\", E4) + 3, FIND(\"-\", E4, FIND(\"-\", E4) + 1) - FIND(\"-\", E4) - 3)","v":"0100"},{"$f":"IF(G4=\"\",2,1)","v":1},{"$f":"MID(C4,FIND(\"-\",C4)+1,LEN(C4))","v":"1"},{"$f":"VLOOKUP(LEFT(E4,2),条件!A:B,2,0)","v":"07"},{"$f":"(O4&P4&Q4&R4&S4&TEXT(T4,\"00\")&U4)*1","v":212016010010107},{"$f":"_xlfn.RANK.EQ(V4,V:V,1)","v":1}]
[{"$f":"IF(検索!$U$1=\"条件検索\", IF(J5=\"○\", COUNTIFS(J:J,\"○\",W:W,\"<\"&W5)+1, \"-\"), IF(検索!$U$1=\"技術名検索\", IF(検索!$B$21=仕様の整理!E5,W5, \"-\"), \"-\"))","v":2},2,"2-1","UKロードマット","KK-190032-VE","事後評価済技術","○","令和7年9月","リフレクションクラック防止シート",{"$f":"IF(COUNTIF($K$3:$L$3,\"○\")=0,\"○\",(IF(COUNTIF(K5:L5,\"○\")>0,\"○\",\"\")))","v":"○"},"○","×",{"$f":"HLOOKUP($C5,DB!$1:$1048576,9,0)","v":"-"},"VE",{"$f":"IF(AND(M5=\"◎\",N5=\"A\"),1,2)","v":2},{"$f":"VLOOKUP(N5,条件!D:E,2,0)","v":1},"2019","0032",1,"1",{"$f":"VLOOKUP(LEFT(E5,2),条件!A:B,2,0)","v":"04"},{"$f":"(O5&P5&Q5&R5&S5&TEXT(T5,\"00\")&U5)*1","v":212019003210104},{"$f":"_xlfn.RANK.EQ(V5,V:V,1)","v":2}]
[{"$f":"IF(検索!$U$1=\"条件検索\", IF(J6=\"○\", COUNTIFS(J:J,\"○\",W:W,\"<\"&W6)+1, \"-\"), IF(検索!$U$1=\"技術名検索\", IF(検索!$B$21=仕様の整理!E6,W6, \"-\"), \"-\"))","v":3},3,"3-1","イソシールAC 速硬化性常温クラックシール","QS-190045-VE","事後評価済技術","○","令和7年9月","シール材注入工法","○","×","○",{"$f":"HLOOKUP($C6,DB!$1:$1048576,9,0)","v":"-"},"VE",2,{"$f":"VLOOKUP(N6,条件!D:E,2,0)","v":1},"2019","0045",1,"1",{"$f":"VLOOKUP(LEFT(E6,2),条件!A:B,2,0)","v":"01"},212019004510101,3]
[{"$f":"IF(検索!$U$1=\"条件検索\", IF(J7=\"○\", COUNTIFS(J:J,\"○\",W:W,\"<\"&W7)+1, \"-\"), IF(検索!$U$1=\"技術名検索\", IF(検索!$B$21=仕様の整理!E7,W7, \"-\"), \"-\"))","v":6},4,"4-1","RCメッシュG","KT-010233-VG","NETIS掲載期間終了技術","○","令和7年9月","リフレクションクラック防止シート","○","○","×",{"$f":"HLOOKUP($C7,DB!$1:$1048576,9,0)","v":"-"},"VG",2,{"$f":"VLOOKUP(N7,条件!D:E,2,0)","v":2},"2001","0233",1,"1",{"$f":"VLOOKUP(LEFT(E7,2),条件!A:B,2,0)","v":"07"},222001023310107,6]
[{"$f":"IF(検索!$U$1=\"条件検索\", IF(J8=\"○\", COUNTIFS(J:J,\"○\",W:W,\"<\"&W8)+1, \"-\"), IF(検索!$U$1=\"技術名検索\", IF(検索!$B$21=仕様の整理!E8,W8, \"-\"), \"-\"))","v":7},5,"5-1","アスパワーシート","KK-030026-VG","NETIS掲載期間終了技術","○","令和7年9月","リフレクションクラック防止シート","○","○","×",{"$f":"HLOOKUP($C8,DB!$1:$1048576,9,0)","v":"-"},"VG",2,{"$f":"VLOOKUP(N8,条件!D:E,2,0)","v":2},"2003","0026",1,"1",{"$f":"VLOOKUP(LEFT(E8,2),条件!A:B,2,0)","v":"04"},222003002610104,7]
[{"$f":"IF(検索!$U$1=\"条件検索\", IF(J9=\"○\", COUNTIFS(J:J,\"○\",W:W,\"<\"&W9)+1, \"-\"), IF(検索!$U$1=\"技術名検索\", IF(検索!$B$21=仕様の整理!E9,W9, \"-\"), \"-\"))","v":8},6,"6-1","G・RDマット","KT-040013-VG","NETIS掲載期間終了技術","○","令和7年9月","リフレクションクラック防止シート","○","○","×",{"$f":"HLOOKUP($C9,DB!$1:$1048576,9,0)","v":"-"},"VG",2,{"$f":"VLOOKUP(N9,条件!D:E,2,0)","v":2},"2004","0013",1,"1",{"$f":"VLOOKUP(LEFT(E9,2),条件!A:B,2,0)","v":"07"},222004001310107,8]
[{"$f":"IF(検索!$U$1=\"条件検索\", IF(J10=\"○\", COUNTIFS(J:J,\"○\",W:W,\"<\"&W10)+1, \"-\"), IF(検索!$U$1=\"技術名検索\", IF(検索!$B$21=仕様の整理!E10,W10, \"-\"), \"-\"))","v":9},7,"7-1","クラックシールNX","KT-070102-VG","NETIS掲載期間終了技術","○","令和7年9月","シール材注入工法","○","×","○",{"$f":"HLOOKUP($C10,DB!$1:$1048576,9,0)","v":"-"},"VG",2,{"$f":"VLOOKUP(N10,条件!D:E,2,0)","v":2},"2007","0102",1,"1",{"$f":"VLOOKUP(LEFT(E10,2),条件!A:B,2,0)","v":"07"},222007010210107,9]
[{"$f":"IF(検索!$U$1=\"条件検索\", IF(J11=\"○\", COUNTIFS(J:J,\"○\",W:W,\"<\"&W11)+1, \"-\"), IF(検索!$U$1=\"技術名検索\", IF(検索!$B$21=仕様の整理!E11,W11, \"-\"), \"-\"))","v":4},8,"8-1","G･Asシート","CB-220031-VE","事後評価済技術","○","令和7年9月","リフレクションクラック防止シート","○","○","×",{"$f":"HLOOKUP($C11,DB!$1:$1048576,9,0)","v":"-"},"VE",2,{"$f":"VLOOKUP(N11,条件!D:E,2,0)","v":1},"2022","0031",1,"1",{"$f":"VLOOKUP(LEFT(E11,2),条件!A:B,2,0)","v":"05"},212022003110105,4]
[{"$f":"IF(検索!$U$1=\"条件検索\", IF(J12=\"○\", COUNTIFS(J:J,\"○\",W:W,\"<\"&W12)+1, \"-\"), IF(検索!$U$1=\"技術名検索\", IF(検索!$B$21=仕様の整理!E12,W12, \"-\"), \"-\"))","v":5},9,"9-1","常温硬化型舗装ひび割れ補修材「スーパーMDシール」","KT-230031-A","事後評価未実施技術","○","令和7年9月","シール材注入工法","○","×","○",{"$f":"HLOOKUP($C12,DB!$1:$1048576,9,0)","v":"-"},"A",2,{"$f":"VLOOKUP(N12,条件!D:E,2,0)","v":1},"2023","0031",1,"1",{"$f":"VLOOKUP(LEFT(E12,2),条件!A:B,2,0)","v":"07"},212023003110107,5]

{"sheet":"条件","index":6,"n_rows":20,"n_cols":10,"rows_kept":20,"cut":false,"hidden":false,"merged":[]}
[null,null,null,null,null,"検索用",null,null,null,"※技術名に仕様が追記されているので、調整すること"]
["QS","01",null,"VR",1,null,"KT-160100-VE","グラスグリッド",{"$f":"IF(LEN(G2)-LEN(SUBSTITUTE(G2,\"-\",\"\"))>=2,LEFT(G2,FIND(\"-\",G2,FIND(\"-\",G2)+1)-1),G2)","v":"KT-160100"}]
["QSK","01",null,"VE",1,null,"KK-190032-VE","UKロードマット",{"$f":"IF(LEN(G3)-LEN(SUBSTITUTE(G3,\"-\",\"\"))>=2,LEFT(G3,FIND(\"-\",G3,FIND(\"-\",G3)+1)-1),G3)","v":"KK-190032"}]
["SK","02",null,"AE",1,null,"QS-190045-VE","イソシールAC 速硬化性常温クラックシール","QS-190045"]
["SKK","02",null,"A",1,null,"KT-010233-VG","RCメッシュG","KT-010233"]
["CG","03",null,"VG",2,null,"KK-030026-VG","アスパワーシート","KK-030026"]
["CGK","03",null,null,null,null,"KT-040013-VG","G・RDマット","KT-040013"]
["KK","04",null,null,null,null,"KT-070102-VG","クラックシールNX","KT-070102"]
["KKK","04",null,null,null,null,"CB-220031-VE","G･Asシート","CB-220031"]
["CB","05",null,null,null,null,"KT-230031-A","常温硬化型舗装ひび割れ補修材「スーパーMDシール」","KT-230031"]
["CBK","05"]
["HR","06"]
["HRK","06"]
["KT","07"]
["KTK","07"]
["TH","08"]
["THK","08"]
["HK","09"]
["HKK","09"]
["TS",10]

{"sheet":"同意書","index":7,"n_rows":22,"n_cols":3,"rows_kept":22,"cut":false,"hidden":false,"merged":[[3,2,3,18],[4,2,4,18],[5,2,5,18]]}
[]
[null,"工法比較表データベース借用同意書"]
[]
[null,"業務名・工事名"]
[null,"会社名"]
[null,"氏名"]
[]
[]
[]
[null,"借用者は、工法比較法データベース（以下「DB」と称する）を九州技術事務所から借用する場合に際し、以下の事項を遵守することを同意いたします。 "]
[null,"（使用目的）","1).借用者は、DBを借用申請書に記載された業務・工事にのみ使用します。なお、DBのリバースエンジニアリング、配布及び公衆送信等はいかなる目的においても行いません。"]
[null,"（使用範囲)","2).DBの使用は、九州地方整備局管内の業務・工事における関係者に限定します。"]
[null,"（データの複製）","3).借用者は、九州技術事務所から借用したデータの複製は行いません。"]
[null,"（権利関係）","4).DB及びDBを利用したものに係わる権利は、いずれも借用者に帰属しないことを確認します。"]
[null,"（守秘義務）","5).借用者は、DBによって知り得た情報を他に漏らしません。"]
[null,"（免責事項）","6).借用者は、DBの使用によって損害及び紛争等が生じても、九州技術事務所が一切責任を負わないことに同意します。 "]
[null,"（同意内容の変更）","7).借用者は、この同意書の内容に変更が生じた場合、その変更が生じた日から２週間以内に九州技術事務所（qsr-kyugi-netis@ki.mlit.go.jp）へ報告します。"]
[null,"（利用実態調査の記入）","8).借用者は、利用実態調査を正確かつ誠実に記入し、利用期限内に提出することを同意します。"]
[null,"（協議事項）","9).借用者は、本同意書に定めのない事項及び本同意書に関して疑義が生じた事項に関しては、九州技術事務所（qsr-kyugi-netis@ki.mlit.go.jp）と協議します。  "]
[]
[]
[null,"同意"]