{"text_format":"1","workbook":"xlsx","n_sheets":8,"sheets":["検索","更新履歴","詳細版","簡易版","DB","仕様の整理","条件","同意書"],"not_rendered":{"charts":0,"images":22,"macros":1,"external_links":0,"defined_names":12,"comments":0,"pivot_tables":0},"unopened":[],"bounds":{"document_bytes":16777216,"sheet_cells":100000,"rows_first":2000,"rows_last":500,"rows_between":2000,"halvings":0,"cell_chars":16384,"cell_head_chars":4096},"cells_cut":0,"cells_raw":0,"read":"whole","date_system":"1900"}

{"sheet":"検索","index":0,"n_rows":32,"n_cols":21,"rows_kept":32,"cut":false,"hidden":false,"merged":[[34,1,34,3],[34,6,34,12],[3,13,3,14]]}
[null,null,null,null,null,null,null,null,null,null,null,null,"Ver.",1.1459999999999999,null,"借用同意書：",null,"問い合わせ先："," kouhouhikakuhyou-db@kyugikyo.or.jp",null,"条件検索"]
[null,null,null,null,null,null,null,null,null,null,null,null,null,null,null,"ご利用期間：","2026-02-10","～",{"$f":"IF(Q2=\"\",\"\",EOMONTH(Q2, 0))","v":"2026-02-28"}]
[null,null,null,null,null,null,null,null,null,null,null,null,null,null,null,{"$f":"仕様の整理!F1","v":"13技術20仕様"},{"$f":"仕様の整理!H1","v":"10技術10仕様"},{"$f":"\"検索結果：全\"&$P$3&\"仕様の内、\"&$Q$3&\"が検索されました。\"","v":"検索結果：全13技術20仕様仕様の内、10技術10仕様が検索されました。"},{"$f":"\"【検索の仕様】\"&P8&R8&\"／\"&P9&R9&\"／\"&P10&R10&\"／\"&P11&_xlfn.TEXTJOIN(\",\",,R12,R13,R14,R15)","v":"【検索の仕様】工事種別：道路改良／最大壁高：5m以下／設計条件：道路上側・護岸等／発注者ニーズへの適応性："}]
["本システムは、毎月NETIS情報を確認し、追加があれば更新していきますので、最新版を入手してお使いください。",null,null,null,null,null,null,null,null,null,null,null,null,"令和8年1月現在",null,null,null,null,{"$f":"\"工法比較表検索結果[\"&$P$3&\"の内、\"&$Q$3&\"]\"","v":"工法比較表検索結果[13技術20仕様の内、10技術10仕様]"}]
[]
[]
[]
[null,null,null,null,null,null,null,null,null,null,null,null,null,null,null,"工事種別：",1,{"$f":"IF(Q8=1,\"道路改良\",IF(Q8=2,\"河川改修\",\"\"))","v":"道路改良"}]
[null,null,null,null,null,null,null,null,null,null,null,null,null,null,null,"最大壁高：",1,{"$f":"IF(Q9=1,\"5m以下\",IF(Q9=2,\"5mを超え8m未満\",IF(Q9=3,\"8mを超える\",\"\")))","v":"5m以下"}]
[null,null,null,null,null,null,null,null,null,null,null,null,null,null,null,"設計条件：",2,{"$f":"IF(Q10=1,\"道路下側（T-25対応）\",IF(Q10=2,\"道路上側・護岸等\",\"\"))","v":"道路上側・護岸等"}]
[null,null,null,null,null,null,null,null,null,null,null,null,null,null,null,"発注者ニーズへの適応性：",1,{"$f":"IF(Q11=1,\"優れている\",IF(Q11=2,\"同等以上\",\"\"))","v":"優れている"}]
[null,null,null,null,null,null,null,null,null,null,null,null,null,null,null,null,false,{"$f":"IF(Q12=TRUE,\"✓\",\"\")","v":""}]
[null,null,null,null,null,null,null,null,null,null,null,null,null,null,null,null,false,{"$f":"IF(Q13=TRUE,\"✓\",\"\")","v":""}]
[null,null,null,null,null,null,null,null,null,null,null,null,null,null,null,null,false,""]
[null,null,null,null,null,null,null,null,null,null,null,null,null,null,null,null,false,""]
[]
[]
[]
[]
[]
[]
[]
[]
[]
[]
[]
[]
[]
[]
[]
[]
["新技術の検索"]

{"sheet":"更新履歴","index":1,"n_rows":143,"n_cols":2,"rows_kept":143,"cut":false,"hidden":false,"merged":[]}
[null,"■更新履歴"]
[null,"2022/3/1\n＜Ver1.00＞"]
[null,"・初版アップロード"]
[]
[null,"2022/4/30\n＜Ver1.101＞"]
[null,"・新規登録は無し。"]
[]
[null,"2022/5/31\n＜Ver1.102＞"]
[null,"・新規登録は無し。"]
[]
[null,"2022/6/30\n＜Ver1.103＞"]
[null,"・新規登録は無し。"]
[]
[null,"2022/7/31\n＜Ver1.104＞"]
[null,"・新規登録は無し。"]
[]
[null,"2022/8/31\n＜Ver1.105＞"]
[null,"・新規登録は無し。"]
[]
[null,"2022/9/30\n＜Ver1.106＞"]
[null,"・新規登録は無し。"]
[]
[null,"2022/10/31\n＜Ver1.107＞"]
[null,"・新規登録は無し。"]
[]
[null,"2022/11/30\n＜Ver1.108＞"]
[null,"・新規登録は無し。"]
[]
[null,"2022/12/31\n＜Ver1.109＞"]
[null,"・新規登録は無し。"]
[]
[null,"2023/1/31\n＜Ver1.110＞"]
[null,"・新規登録は無し。"]
[]
[null,"2023/2/28\n＜Ver1.111＞"]
[null,"・新規登録は無し。"]
[]
[null,"2023/3/31\n＜Ver1.112＞"]
[null,"・新規登録は無し。"]
[]
[null,"2023/4/30\n＜Ver1.113＞"]
[null,"・新規登録は無し。"]
[]
[null,"2023/5/31\n＜Ver1.114＞"]
[null,"・新規登録は無し。"]
[]
[null,"2023/6/30\n＜Ver1.115＞"]
[null,"・新規登録は無し。"]
[]
[null,"2023/7/31\n＜Ver1.116＞"]
[null,"・新規登録は無し。"]
[]
[null,"2023/8/31\n＜Ver1.117＞"]
[null,"・新規登録は無し。"]
[]
[null,"2023/9/30\n＜Ver1.118＞"]
[null,"・新規登録は無し。"]
[]
[null,"2023/10/31\n＜Ver1.119＞"]
[null,"・新規登録は無し。"]
[]
[null,"2023/11/30\n＜Ver1.120＞"]
[null,"・新規登録は無し。"]
[]
[null,"2023/12/31\n＜Ver1.121＞"]
[null,"・新規登録は無し。"]
[]
[null,"2024/1/31\n＜Ver1.122＞"]
[null,"・新規登録は無し。"]
[]
[null,"2024/2/29\n＜Ver1.123＞"]
[null,"・新規登録は無し。"]
[]
[null,"2024/3/31\n＜Ver1.124＞"]
[null,"・新規登録は無し。"]
[]
[null,"2024/4/30\n＜Ver1.125＞"]
[null,"・新規登録は無し。"]
[]
[null,"2024/5/31\n＜Ver1.126＞"]
[null,"・新規登録は無し。"]
[]
[null,"2024/6/30\n＜Ver1.127＞"]
[null,"・新規登録は無し。"]
[]
[null,"2024/7/31\n＜Ver1.128＞"]
[null,"・新規登録は無し。"]
[]
[null,"2024/8/31\n＜Ver1.129＞"]
[null,"・新規登録は無し。"]
[]
[null,"2024/9/30\n＜Ver1.130＞"]
[null,"・新規登録は無し。"]
[]
[null,"2024/10/31\n＜Ver1.131＞"]
[null,"・新規登録は無し。"]
[]
[null,"2024/11/30\n＜Ver1.132＞"]
[null,"・新規登録は無し。"]
[null,"・施工費用および施工日数等を令和6年度の情報に更新"]
[]
[null,"2024/12/31\n＜Ver1.133＞"]
[null,"・新規登録は無し。"]
[]
[null,"2025/1/31\n＜Ver1.134＞"]
[null,"・新規登録は無し。"]
[]
[null,"2025/2/28\n＜Ver1.135＞"]
[null,"・新規登録は無し。"]
[]
[null,"2025/3/31\n＜Ver1.136＞"]
[null,"・新規登録は無し。"]
[]
[null,"2025/4/30\n＜Ver1.137＞"]
[null,"・新規登録は無し。"]
[]
[null,"2025/5/31\n＜Ver1.138＞"]
[null,"・新規登録は無し。"]
[]
[null,"2025/6/30\n＜Ver1.139＞"]
[null,"・新規登録は無し。"]
[]
[null,"2025/7/31\n＜Ver1.140＞"]
[null,"・新規登録は無し。"]
[]
[null,"2025/8/31\n＜Ver1.141＞"]
[null,"・新規登録は無し。"]
[]
[null,"2025/9/30\n＜Ver1.142＞"]
[null,"・新規登録は無し。"]
[]
[null,"2025/10/31\n＜Ver1.143＞"]
[null,"・新規登録は無し。"]
[]
[null,"2025/11/30\n＜Ver1.144＞"]
[null,"・新規登録は無し。"]
[null,"・施工費用および施工日数等を令和7年度の情報に更新"]
[]
[null,"2025/12/31\n＜Ver1.145＞"]
[null,"・新規登録は無し。"]
[]
[null,"2026/1/31＜Ver1.146＞"]
[null,"・新規登録は無し。"]

{"sheet":"詳細版","index":2,"n_rows":73,"n_cols":5,"rows_kept":73,"cut":false,"hidden":false,"merged":[[2,39,2,40],[2,41,2,42],[2,43,2,44],[2,5,2,6],[2,7,2,8],[2,9,2,10],[2,11,2,12],[2,13,2,14],[2,15,2,16],[2,17,2,18],[2,19,2,20],[2,21,2,22],[2,23,2,24],[2,25,2,26],[2,27,2,28],[2,29,2,30],[2,31,2,32],[2,33,2,34],[2,35,2,36],[2,37,2,38],[4,21,4,22],[4,23,4,24],[4,1,4,4],[4,5,4,6],[4,7,4,8],[4,9,4,10],[4,11,4,12],[5,39,5,40],[5,41,5,42],[5,43,5,44],[5,27,5,28],[5,29,5,30],[5,31,5,32],[5,33,5,34],[5,35,5,36],[5,37,5,38],[5,15,5,16],[5,17,5,18],[5,19,5,20],[5,21,5,22],[5,23,5,24],[5,25,5,26],[4,37,4,38],[4,39,4,40],[4,41,4,42],[4,43,4,44],[5,2,5,4],[5,5,5,6],[5,7,5,8],[5,9,5,10],[5,11,5,12],[5,13,5,14],[4,25,4,26],[4,27,4,28],[4,29,4,30],[4,31,4,32],[4,33,4,34],[4,35,4,36],[4,13,4,14],[4,15,4,16],[4,17,4,18],[4,19,4,20],[7,27,7,28],[7,29,7,30],[6,41,6,42],[6,43,6,44],[7,2,7,4],[7,5,7,6],[7,7,7,8],[7,9,7,10],[7,11,7,12],[7,13,7,14],[7,15,7,16],[7,17,7,18],[6,29,6,30],[6,31,6,32],[6,33,6,34],[6,35,6,36],[6,37,6,38],[6,39,6,40],[6,17,6,18],[6,19,6,20],[6,21,6,22],[6,23,6,24],[6,25,6,26],[6,27,6,28],[6,2,6,4],[6,5,6,6],[6,7,6,8],[6,9,6,10],[6,11,6,12],[6,13,6,14],[6,15,6,16],[8,33,8,34],[8,35,8,36],[8,37,8,38],[8,39,8,40],[8,41,8,42],[8,43,8,44],[8,21,8,22],[8,23,8,24],[8,25,8,26],[8,27,8,28],[8,29,8,30],[8,31,8,32],[7,43,7,44],[8,2,8,4],[8,5,8,6],[8,7,8,8],[8,9,8,10],[8,11,8,12],[8,13,8,14],[8,15,8,16],[8,17,8,18],[8,19,8,20],[7,31,7,32],[7,33,7,34],[7,35,7,36],[7,37,7,38],[7,39,7,40],[7,41,7,42],[7,19,7,20],[7,21,7,22],[7,23,7,24],[7,25,7,26],[9,35,9,36],[9,37,9,38],[9,39,9,40],[9,41,9,42],[9,43,9,44],[10,2,10,4],[10,5,10,6],[10,7,10,8],[10,9,10,10],[10,11,10,12],[9,23,9,24],[9,25,9,26],[9,27,9,28],[9,29,9,30],[9,31,9,32],[9,33,9,34],[9,11,9,12],[9,13,9,14],[9,15,9,16],[9,17,9,18],[9,19,9,20],[9,21,9,22],[9,2,9,4],[9,5,9,6],[9,7,9,8],[9,9,9,10],[10,37,10,38],[10,39,10,40],[10,41,10,42],[10,43,10,44],[11,2,11,4],[11,5,11,6],[11,7,11,8],[11,9,11,10],[11,11,11,12],[11,13,11,14],[10,25,10,26],[10,27,10,28],[10,29,10,30],[10,31,10,32],[10,33,10,34],[10,35,10,36],[10,13,10,14],[10,15,10,16],[10,17,10,18],[10,19,10,20],[10,21,10,22],[10,23,10,24],[11,39,11,40],[11,41,11,42],[11,43,11,44],[12,1,20,1],[12,2,20,2],[12,3,12,4],[12,5,12,6],[12,7,12,8],[12,9,12,10],[12,11,12,12],[11,27,11,28],[11,29,11,30],[11,31,11,32],[11,33,11,34],[11,35,11,36],[11,37,11,38],[11,15,11,16],[11,17,11,18],[11,19,11,20],[11,21,11,22],[11,23,11,24],[11,25,11,26],[12,37,12,38],[14,3,14,4],[14,5,14,6],[14,7,14,8],[14,9,14,10],[14,11,14,12],[14,13,14,14],[14,15,14,16],[13,19,13,20],[13,21,13,22],[13,23,13,24],[13,25,13,26],[15,27,15,28],[12,39,12,40],[12,41,12,42],[12,43,12,44],[13,3,13,4],[13,5,13,6],[13,7,13,8],[13,9,13,10],[13,11,13,12],[13,13,13,14],[12,25,12,26],[12,27,12,28],[12,29,12,30],[12,31,12,32],[12,33,12,34],[12,35,12,36],[12,13,12,14],[12,15,12,16],[12,17,12,18],[12,19,12,20],[12,21,12,22],[12,23,12,24],[13,39,13,40],[13,41,13,42],[13,43,13,44],[13,27,13,28],[13,29,13,30],[13,31,13,32],[13,33,13,34],[13,35,13,36],[13,37,13,38],[13,15,13,16],[13,17,13,18],[15,29,15,30],[14,41,14,42],[14,43,14,44],[15,3,15,4],[15,5,15,6],[15,7,15,8],[15,9,15,10],[15,11,15,12],[15,13,15,14],[15,15,15,16],[15,17,15,18],[14,29,14,30],[14,31,14,32],[14,33,14,34],[14,35,14,36],[14,37,14,38],[14,39,14,40],[14,17,14,18],[14,19,14,20],[14,21,14,22],[14,23,14,24],[14,25,14,26],[14,27,14,28],[16,33,16,34],[16,35,16,36],[16,37,16,38],[16,39,16,40],[16,41,16,42],[16,43,16,44],[16,21,16,22],[16,23,16,24],[16,25,16,26],[16,27,16,28],[16,29,16,30],[16,31,16,32],[15,43,15,44],[16,3,16,4],[16,5,16,6],[16,7,16,8],[16,9,16,10],[16,11,16,12],[16,13,16,14],[16,15,16,16],[16,17,16,18],[16,19,16,20],[15,31,15,32],[15,33,15,34],[15,35,15,36],[15,37,15,38],[15,39,15,40],[15,41,15,42],[15,19,15,20],[15,21,15,22],[15,23,15,24],[15,25,15,26],[17,39,17,40],[17,41,17,42],[17,43,17,44],[18,3,18,4],[18,5,18,6],[18,7,18,8],[18,9,18,10],[18,11,18,12],[18,13,18,14],[18,15,18,16],[17,27,17,28],[17,29,17,30],[17,31,17,32],[17,33,17,34],[17,35,17,36],[17,37,17,38],[17,15,17,16],[17,17,17,18],[17,19,17,20],[17,21,17,22],[17,23,17,24],[17,25,17,26],[17,3,17,4],[17,5,17,6],[17,7,17,8],[17,9,17,10],[17,11,17,12],[17,13,17,14],[19,27,19,28],[19,29,19,30],[18,41,18,42],[18,43,18,44],[19,3,19,4],[19,5,19,6],[19,7,19,8],[19,9,19,10],[19,11,19,12],[19,13,19,14],[19,15,19,16],[19,17,19,18],[18,29,18,30],[18,31,18,32],[18,33,18,34],[18,35,18,36],[18,37,18,38],[18,39,18,40],[18,17,18,18],[18,19,18,20],[18,21,18,22],[18,23,18,24],[18,25,18,26],[18,27,18,28],[20,33,20,34],[20,35,20,36],[20,37,20,38],[20,39,20,40],[20,41,20,42],[20,43,20,44],[20,21,20,22],[20,23,20,24],[20,25,20,26],[20,27,20,28],[20,29,20,30],[20,31,20,32],[19,43,19,44],[20,3,20,4],[20,5,20,6],[20,7,20,8],[20,9,20,10],[20,11,20,12],[20,13,20,14],[20,15,20,16],[20,17,20,18],[20,19,20,20],[19,31,19,32],[19,33,19,34],[19,35,19,36],[19,37,19,38],[19,39,19,40],[19,41,19,42],[19,19,19,20],[19,21,19,22],[19,23,19,24],[19,25,19,26],[21,39,21,40],[21,41,21,42],[21,43,21,44],[22,0,29,0],[22,1,29,1],[22,3,22,4],[22,5,22,6],[22,7,22,8],[22,9,22,10],[22,11,22,12],[21,27,21,28],[21,29,21,30],[21,31,21,32],[21,33,21,34],[21,35,21,36],[21,37,21,38],[21,15,21,16],[21,17,21,18],[21,19,21,20],[21,21,21,22],[21,23,21,24],[21,25,21,26],[21,2,21,4],[21,5,21,6],[21,7,21,8],[21,9,21,10],[21,11,21,12],[21,13,21,14],[4,0,21,0],[22,37,22,38],[22,39,22,40],[22,41,22,42],[22,43,22,44],[23,2,29,2],[23,3,23,4],[23,5,23,6],[23,7,23,8],[23,9,23,10],[23,11,23,12],[22,25,22,26],[22,27,22,28],[22,29,22,30],[22,31,22,32],[22,33,22,34],[22,35,22,36],[22,13,22,14],[22,15,22,16],[22,17,22,18],[22,19,22,20],[22,21,22,22],[22,23,22,24],[23,37,23,38],[23,39,23,40],[23,41,23,42],[23,43,23,44],[24,3,24,4],[24,5,24,6],[24,7,24,8],[24,9,24,10],[24,11,24,12],[24,13,24,14],[23,25,23,26],[23,27,23,28],[23,29,23,30],[23,31,23,32],[23,33,23,34],[23,35,23,36],[23,13,23,14],[23,15,23,16],[23,17,23,18],[23,19,23,20],[23,21,23,22],[23,23,23,24],[24,39,24,40],[24,41,24,42],[24,43,24,44],[25,3,25,4],[25,5,25,6],[25,7,25,8],[25,9,25,10],[25,11,25,12],[25,13,25,14],[25,15,25,16],[24,27,24,28],[24,29,24,30],[24,31,24,32],[24,33,24,34],[24,35,24,36],[24,37,24,38],[24,15,24,16],[24,17,24,18],[24,19,24,20],[24,21,24,22],[24,23,24,24],[24,25,24,26],[25,41,25,42],[26,39,26,40],[26,41,26,42],[26,19,26,20],[26,21,26,22],[26,23,26,24],[26,25,26,26],[26,27,26,28],[26,29,26,30],[25,43,25,44],[26,3,26,4],[26,5,26,6],[26,7,26,8],[26,9,26,10],[26,11,26,12],[26,13,26,14],[26,15,26,16],[26,17,26,18],[25,29,25,30],[25,31,25,32],[25,33,25,34],[25,35,25,36],[25,37,25,38],[25,39,25,40],[25,17,25,18],[25,19,25,20],[25,21,25,22],[25,23,25,24],[25,25,25,26],[25,27,25,28],[26,43,26,44],[29,17,29,18],[29,19,29,20],[29,21,29,22],[29,23,29,24],[27,3,27,4],[27,5,27,6],[27,7,27,8],[27,9,27,10],[27,11,27,12],[27,13,27,14],[27,15,27,16],[27,17,27,18],[27,19,27,20],[26,31,26,32],[26,33,26,34],[26,35,26,36],[26,37,26,38],[27,33,27,34],[27,35,27,36],[27,37,27,38],[29,3,29,4],[29,5,29,6],[29,7,29,8],[29,9,29,10],[29,11,29,12],[29,13,29,14],[29,15,29,16],[28,15,28,16],[28,17,28,18],[28,19,28,20],[28,3,28,4],[28,5,28,6],[27,39,27,40],[27,41,27,42],[27,43,27,44],[27,21,27,22],[27,23,27,24],[27,25,27,26],[27,27,27,28],[27,29,27,30],[27,31,27,32],[29,29,29,30],[29,31,29,32],[29,33,29,34],[29,35,29,36],[29,37,29,38],[29,39,29,40],[29,25,29,26],[29,27,29,28],[28,39,28,40],[28,41,28,42],[28,43,28,44],[28,27,28,28],[28,29,28,30],[28,31,28,32],[28,33,28,34],[28,35,28,36],[28,37,28,38],[28,21,28,22],[28,23,28,24],[28,25,28,26],[28,7,28,8],[28,9,28,10],[28,11,28,12],[28,13,28,14],[29,41,29,42],[29,43,29,44],[31,0,64,0],[31,2,31,4],[32,1,35,1],[32,2,45,2],[32,3,32,4],[33,3,35,3],[36,3,36,4],[37,1,38,1],[37,3,37,4],[30,31,30,32],[30,33,30,34],[30,35,30,36],[30,37,30,38],[30,39,30,40],[30,41,30,42],[30,19,30,20],[30,21,30,22],[30,23,30,24],[30,25,30,26],[30,27,30,28],[30,29,30,30],[46,35,46,36],[46,37,46,38],[30,0,30,4],[30,5,30,6],[30,7,30,8],[30,9,30,10],[30,11,30,12],[30,13,30,14],[30,15,30,16],[30,17,30,18],[46,3,46,4],[47,41,47,42],[47,43,47,44],[38,3,38,4],[39,1,42,1],[39,3,39,4],[40,3,42,3],[43,3,43,4],[44,1,45,1],[44,3,44,4],[45,3,45,4],[30,43,30,44],[47,25,47,26],[47,27,47,28],[47,29,47,30],[47,31,47,32],[47,33,47,34],[47,35,47,36],[47,13,47,14],[47,15,47,16],[47,17,47,18],[47,19,47,20],[47,21,47,22],[47,23,47,24],[46,39,46,40],[46,41,46,42],[46,43,46,44],[47,3,47,4],[47,5,47,6],[47,7,47,8],[47,9,47,10],[47,11,47,12],[46,23,46,24],[46,25,46,26],[46,27,46,28],[46,29,46,30],[46,31,46,32],[46,33,46,34],[46,11,46,12],[46,13,46,14],[46,15,46,16],[46,17,46,18],[46,19,46,20],[46,21,46,22],[48,39,48,40],[46,5,46,6],[46,7,46,8],[46,9,46,10],[47,37,47,38],[47,39,47,40],[48,41,48,42],[48,43,48,44],[49,3,49,4],[49,5,49,6],[49,7,49,8],[49,9,49,10],[49,11,49,12],[49,13,49,14],[49,15,49,16],[48,27,48,28],[48,29,48,30],[48,31,48,32],[48,33,48,34],[48,35,48,36],[48,37,48,38],[48,15,48,16],[48,17,48,18],[48,19,48,20],[48,21,48,22],[48,23,48,24],[48,25,48,26],[49,41,49,42],[49,43,49,44],[48,3,48,4],[48,5,48,6],[48,7,48,8],[48,9,48,10],[48,11,48,12],[48,13,48,14],[50,1,56,1],[50,2,56,2],[50,3,52,3],[50,5,50,6],[50,7,50,8],[50,9,50,10],[50,11,50,12],[50,13,50,14],[49,29,49,30],[49,31,49,32],[49,33,49,34],[49,35,49,36],[49,37,49,38],[49,39,49,40],[49,17,49,18],[49,19,49,20],[49,21,49,22],[49,23,49,24],[49,25,49,26],[49,27,49,28],[46,1,49,1],[46,2,49,2],[51,19,51,20],[51,21,51,22],[51,23,51,24],[51,25,51,26],[51,27,51,28],[51,29,51,30],[50,39,50,40],[52,35,52,36],[52,37,52,38],[52,39,52,40],[50,41,50,42],[50,43,50,44],[51,5,51,6],[51,7,51,8],[51,9,51,10],[51,11,51,12],[51,13,51,14],[51,15,51,16],[51,17,51,18],[50,27,50,28],[50,29,50,30],[50,31,50,32],[50,33,50,34],[50,35,50,36],[50,37,50,38],[50,15,50,16],[50,17,50,18],[50,19,50,20],[50,21,50,22],[50,23,50,24],[50,25,50,26],[52,41,52,42],[52,43,52,44],[53,3,55,3],[53,5,53,6],[53,7,53,8],[53,9,53,10],[53,11,53,12],[52,23,52,24],[52,25,52,26],[52,27,52,28],[52,29,52,30],[52,31,52,32],[52,33,52,34],[51,43,51,44],[52,5,52,6],[52,7,52,8],[52,9,52,10],[52,11,52,12],[52,13,52,14],[52,15,52,16],[52,17,52,18],[52,19,52,20],[52,21,52,22],[51,31,51,32],[51,33,51,34],[51,35,51,36],[51,37,51,38],[51,39,51,40],[51,41,51,42],[54,25,54,26],[54,27,54,28],[53,37,53,38],[53,39,53,40],[53,41,53,42],[53,43,53,44],[54,5,54,6],[54,7,54,8],[54,9,54,10],[54,11,54,12],[54,13,54,14],[54,15,54,16],[53,25,53,26],[53,27,53,28],[53,29,53,30],[53,31,53,32],[53,33,53,34],[53,35,53,36],[53,13,53,14],[53,15,53,16],[53,17,53,18],[53,19,53,20],[53,21,53,22],[53,23,53,24],[54,41,54,42],[54,43,54,44],[55,5,55,6],[55,7,55,8],[55,9,55,10],[55,11,55,12],[55,13,55,14],[55,15,55,16],[55,17,55,18],[55,19,55,20],[54,29,54,30],[54,31,54,32],[54,33,54,34],[54,35,54,36],[54,37,54,38],[54,39,54,40],[54,17,54,18],[54,19,54,20],[54,21,54,22],[54,23,54,24],[56,23,56,24],[56,25,56,26],[56,3,56,4],[56,5,56,6],[56,7,56,8],[56,9,56,10],[56,11,56,12],[56,13,56,14],[57,37,57,38],[57,39,57,40],[57,41,57,42],[57,43,57,44],[55,33,55,34],[55,35,55,36],[55,37,55,38],[55,39,55,40],[55,41,55,42],[55,43,55,44],[55,21,55,22],[55,23,55,24],[55,25,55,26],[55,27,55,28],[55,29,55,30],[55,31,55,32],[57,25,57,26],[57,27,57,28],[57,29,57,30],[57,31,57,32],[57,33,57,34],[57,35,57,36],[57,13,57,14],[57,15,57,16],[57,17,57,18],[57,19,57,20],[57,21,57,22],[57,23,57,24],[56,39,56,40],[56,41,56,42],[56,43,56,44],[57,1,59,1],[57,2,59,2],[57,3,57,4],[57,5,57,6],[57,7,57,8],[57,9,57,10],[57,11,57,12],[56,27,56,28],[56,29,56,30],[56,31,56,32],[56,33,56,34],[56,35,56,36],[56,37,56,38],[56,15,56,16],[56,17,56,18],[56,19,56,20],[56,21,56,22],[58,39,58,40],[58,41,58,42],[58,43,58,44],[59,3,59,4],[59,5,59,6],[59,7,59,8],[59,9,59,10],[59,11,59,12],[58,27,58,28],[58,29,58,30],[58,31,58,32],[58,33,58,34],[58,35,58,36],[58,37,58,38],[58,15,58,16],[58,17,58,18],[58,19,58,20],[58,21,58,22],[58,23,58,24],[58,25,58,26],[59,41,59,42],[59,43,59,44],[58,3,58,4],[58,5,58,6],[58,7,58,8],[58,9,58,10],[58,11,58,12],[58,13,58,14],[60,1,61,1],[60,2,61,2],[60,3,60,4],[60,5,60,6],[60,7,60,8],[60,9,60,10],[60,11,60,12],[60,13,60,14],[59,29,59,30],[59,31,59,32],[59,33,59,34],[59,35,59,36],[59,37,59,38],[59,39,59,40],[59,17,59,18],[59,19,59,20],[59,21,59,22],[59,23,59,24],[59,25,59,26],[59,27,59,28],[60,39,60,40],[59,13,59,14],[59,15,59,16],[61,29,61,30],[61,31,61,32],[61,33,61,34],[61,35,61,36],[61,37,61,38],[61,39,61,40],[61,17,61,18],[61,19,61,20],[61,21,61,22],[61,23,61,24],[61,25,61,26],[61,27,61,28],[60,41,60,42],[60,43,60,44],[61,3,61,4],[61,5,61,6],[61,7,61,8],[61,9,61,10],[61,11,61,12],[61,13,61,14],[61,15,61,16],[60,27,60,28],[60,29,60,30],[60,31,60,32],[60,33,60,34],[60,35,60,36],[60,37,60,38],[60,15,60,16],[60,17,60,18],[60,19,60,20],[60,21,60,22],[60,23,60,24],[60,25,60,26],[61,41,61,42],[61,43,61,44],[62,43,62,44],[63,2,63,4],[63,5,63,6],[63,7,63,8],[63,9,63,10],[63,11,63,12],[63,13,63,14],[63,15,63,16],[63,17,63,18],[63,19,63,20],[62,31,62,32],[62,33,62,34],[62,35,62,36],[62,37,62,38],[62,39,62,40],[62,41,62,42],[62,19,62,20],[62,21,62,22],[62,23,62,24],[62,25,62,26],[62,27,62,28],[62,29,62,30],[62,2,62,4],[62,5,62,6],[62,7,62,8],[62,9,62,10],[62,11,62,12],[62,13,62,14],[62,15,62,16],[62,17,62,18],[64,13,64,14],[65,39,65,40],[65,41,65,42],[65,43,65,44],[66,2,68,2],[63,33,63,34],[63,35,63,36],[63,37,63,38],[63,39,63,40],[63,41,63,42],[63,43,63,44],[63,21,63,22],[63,23,63,24],[63,25,63,26],[63,27,63,28],[63,29,63,30],[63,31,63,32],[67,39,67,40],[67,17,67,18],[67,19,67,20]],"merged_total":1165,"flags":["merged_cut"]}
[]
["大型ブロック積擁壁工法"]
[{"$f":"検索!S4","v":"工法比較表検索結果[13技術20仕様の内、10技術10仕様]"}]
[]
["ＮＥＴＩＳ情報","技術名"]
[null,"①","ＮＥＴＩＳ登録番号"]
[null,"②","技術の位置付け（有用な新技術）"]
[null,"③","開発者（本社が存在する都道府県）"]
[null,"④","開発者における九州地方との関連性（九州登録九州本社：◎、九州外登録九州本社：○、九州に共同開発者有り：△、その他：－）"]
[null,"⑤","九州地方への機能性（九州地方に支店等を有する場合：○、その他：－）"]
[null,"⑥","技術概要"]
[null,"⑦","概要図"]
[null,"⑧","施工条件・適用条件等\n※1.ブロック1個当りの形状、重量は参考として標準部材を記載している。","種類"]
[null,null,null,"ブロック1個当りの形状（寸法：幅×法長×控長（ｍｍ））（※1）"]
[null,null,null,"ブロック1個当りの重量（※1）"]
[null,null,null,"表面模様"]
[null,null,null,"適用可能な範囲"]
[null,null,null,"ブロック間の結合形式"]
[null,null,null,"基礎工の形式"]
[null,null,null,"設計方法"]
[null,null,null,"護岸に用いる場合の適応性"]
[null,"⑨","比較する従来技術"]
["評価情報","⑩","評価基準","項目"]
[null,null,"・A：従来技術より極めて優れる\n・B：従来技術より優れる\n・C：従来技術と同等\n・D：従来技術より劣る","経済性"]
[null,null,null,"工程"]
[null,null,null,"品質・出来形"]
[null,null,null,"安全性"]
[null,null,null,"施工性"]
[null,null,null,"環境"]
[null,null,null,"総合評価"]
["統一した従来技術"]
["補完資料等からの情報"]
[null,"⑪","統一した従来技術との比較（経済性、工程）\n判定の凡例 \n○：従来技術より優れる\n△：従来技術と同程度\n－：上記以外","施工条件CASE1"]
[null,null,null,"概算施工費用","機械・労務"]
[null,null,null,null,"材料"]
[null,null,null,null,"合計"]
[null,"⑫",null,"概算施工日数"]
[null,"⑬",null,"経済性"]
[null,null,null,"工程"]
[null,"⑭",null,"施工条件CASE2"]
[null,null,null,"概算施工費用","機械・労務"]
[null,null,null,null,"材料"]
[null,null,null,null,"合計"]
[null,"⑮",null,"概算施工日数"]
[null,"⑯",null,"経済性"]
[null,null,null,"工程"]
[null,"⑰","統一した従来技術との比較\n判定の凡例 \n○：従来技術より優れる\n△：従来技術と同程度\n－：上記以外","品質・出来形"]
[null,null,null,"安全性"]
[null,null,null,"施工性"]
[null,null,null,"環境"]
[null,"⑱","大型積みブロックの材料・品質規格","コンクリートブロック製品のコンクリート強度","規格・構造"]
[null,null,null,null,"基準・比較対象"]
[null,null,null,null,"試験結果"]
[null,null,null,"ブロック間の結合部強度","規格・構造"]
[null,null,null,null,"基準・比較対象"]
[null,null,null,null,"試験結果"]
[null,null,null,"その他の試験結果"]
[null,"⑲","施工実績\n(過去3年)","国土交通省：活用効果調査表数"]
[null,null,null,"地方自治体：開発者ヒアリング"]
[null,null,null,"その他：開発者ヒアリング"]
[null,"⑳","特許等","特許"]
[null,null,null,"建設技術審査証明"]
[null,"㉑","作業空間"]
[null,"㉒","生産供給体制（販売拠点、製造工場、納期等）"]
[null,"㉓","備考"]
["発注者ニーズへの適応性","㉔","統一した従来技術との比較","省人化・省力化"]
[null,null,"判定の凡例\n○：従来技術より優れる\n△：従来技術と同程度\n-：上記以外","湧水への適応性"]
[null,null,null,"景観性への影響\n（表面の模様）"]
[null,null,null,"自然環境への影響\n（生態系、植生等）"]
["総括","㉕","耐久性等"]
[null,"㉖","施工性\n(留意事項含む）"]
[null,"㉗","その他\n（留意事項含む）"]
["注1）施工費用：2025年4月福岡県久留米市　注2）／：補完調査未実施"]

{"sheet":"簡易版","index":3,"n_rows":6,"n_cols":26,"rows_kept":6,"cut":false,"hidden":false,"merged":[[4,3,5,3],[4,25,5,25],[4,4,5,4],[4,5,5,5],[4,6,5,6],[4,7,5,7],[4,8,5,8],[4,9,5,9],[4,10,5,10],[4,11,5,11],[4,12,5,12],[4,21,4,24],[4,17,4,20],[4,15,4,16],[4,13,4,14]]}
[null,null,null,"大型ブロック積擁壁工法"]
[null,null,null,{"$f":"検索!S4","v":"工法比較表検索結果[13技術20仕様の内、10技術10仕様]"}]
[]
[]
[null,null,null,"番号","技術名","NETIS番号","開発者","種類","ブロック1個当りの形状\n（寸法：幅×法長×控長（ｍｍ））\n（※1）","ブロック1個当りの重量\n（※1）","表面模様","適用可能な範囲","護岸に用いる場合の適応性","ケース1",null,"ケース2",null,"統一した従来技術との比較",null,null,null,"発注者ニーズへの適応性",null,null,null,"概要"]
[null,null,null,null,null,null,null,null,null,null,null,null,null,"概算施工費用","概算施工日数","概算施工費用","概算施工日数","品質・出来形","安全性","施工性","環境","省人化・省力化","湧水への適応性","景観性への影響\n（表面の模様）","自然環境への影響\n（生態系、植生等）"]

{"sheet":"DB","index":4,"n_rows":96,"n_cols":45,"rows_kept":96,"cut":false,"hidden":false,"merged":[[69,0,71,0],[71,5,71,6],[67,3,67,4],[68,3,68,4],[60,2,61,2],[60,1,61,1],[67,5,67,6],[68,5,68,6],[62,2,62,4],[64,2,64,4],[63,5,63,6],[60,3,60,4],[61,3,61,4],[69,5,69,6],[70,5,70,6],[66,2,68,2],[69,2,69,4],[70,2,70,4],[71,2,71,4],[31,0,64,0],[37,1,38,1],[50,5,50,6],[51,5,51,6],[53,5,53,6],[54,5,54,6],[65,3,65,4],[66,3,66,4],[66,5,66,6],[60,5,60,6],[61,5,61,6],[62,5,62,6],[64,5,64,6],[65,5,65,6],[32,2,45,2],[57,3,57,4],[58,3,58,4],[59,3,59,4],[4,5,4,6],[5,5,5,6],[6,5,6,6],[7,5,7,6],[8,5,8,6],[9,5,9,6],[10,5,10,6],[11,5,11,6],[12,5,12,6],[30,0,30,4],[57,2,59,2],[57,1,59,1],[57,5,57,6],[58,5,58,6],[59,5,59,6],[65,0,68,0],[50,2,56,2],[50,1,56,1],[56,3,56,4],[56,5,56,6],[63,2,63,4],[37,3,37,4],[48,3,48,4],[48,5,48,6],[44,1,45,1],[46,1,49,1],[46,2,49,2],[49,3,49,4],[49,5,49,6],[47,3,47,4],[47,5,47,6],[32,1,35,1],[26,3,26,4],[27,3,27,4],[28,3,28,4],[29,3,29,4],[13,3,13,4],[14,3,14,4],[15,3,15,4],[16,3,16,4],[17,5,17,6],[20,5,20,6],[21,5,21,6],[24,5,24,6],[25,5,25,6],[17,3,17,4],[20,3,20,4],[21,2,21,4],[23,3,23,4],[22,3,22,4],[18,5,18,6],[19,5,19,6],[22,5,22,6],[43,3,43,4],[44,3,44,4],[45,3,45,4],[46,3,46,4],[46,5,46,6],[38,3,38,4],[4,0,21,0],[12,1,20,1],[50,3,52,3],[53,3,55,3],[52,5,52,6],[55,5,55,6],[31,2,31,4],[9,2,9,4],[10,2,10,4],[11,2,11,4],[12,2,20,2],[12,3,12,4],[18,3,18,4],[19,3,19,4],[4,1,4,4],[5,2,5,4],[6,2,6,4],[7,2,7,4],[8,2,8,4],[13,5,13,6],[14,5,14,6],[15,5,15,6],[16,5,16,6],[28,5,28,6],[22,0,29,0],[22,1,29,1],[39,1,42,1],[36,3,36,4],[33,3,35,3],[32,3,32,4],[39,3,39,4],[40,3,42,3],[2,5,2,6],[3,5,3,6],[2,7,2,8],[3,7,3,8],[4,7,4,8],[5,7,5,8],[6,7,6,8],[7,7,7,8],[8,7,8,8],[9,7,9,8],[10,7,10,8],[11,7,11,8],[12,7,12,8],[13,7,13,8],[14,7,14,8],[15,7,15,8],[16,7,16,8],[17,7,17,8],[29,5,29,6],[23,5,23,6],[26,5,26,6],[27,5,27,6],[30,5,30,6],[23,2,29,2],[24,3,24,4],[25,3,25,4],[2,27,2,28],[2,29,2,30],[2,31,2,32],[2,33,2,34],[2,35,2,36],[2,37,2,38],[2,39,2,40],[2,41,2,42],[4,27,4,28],[4,29,4,30],[4,31,4,32],[4,33,4,34],[4,35,4,36],[4,37,4,38],[4,39,4,40],[4,41,4,42],[6,27,6,28],[6,29,6,30],[6,31,6,32],[6,33,6,34],[6,35,6,36],[6,37,6,38],[6,39,6,40],[2,43,2,44],[2,9,2,10],[2,11,2,12],[2,13,2,14],[2,15,2,16],[2,17,2,18],[2,19,2,20],[2,21,2,22],[2,23,2,24],[2,25,2,26],[3,27,3,28],[3,29,3,30],[3,31,3,32],[3,33,3,34],[3,35,3,36],[3,37,3,38],[3,39,3,40],[3,41,3,42],[3,43,3,44],[3,9,3,10],[3,11,3,12],[3,13,3,14],[3,15,3,16],[3,17,3,18],[3,19,3,20],[3,21,3,22],[3,23,3,24],[3,25,3,26],[4,43,4,44],[4,9,4,10],[4,11,4,12],[4,13,4,14],[4,15,4,16],[4,17,4,18],[4,19,4,20],[4,21,4,22],[4,23,4,24],[4,25,4,26],[5,27,5,28],[5,29,5,30],[5,31,5,32],[5,33,5,34],[5,35,5,36],[5,37,5,38],[5,39,5,40],[5,41,5,42],[5,43,5,44],[5,9,5,10],[5,11,5,12],[5,13,5,14],[5,15,5,16],[5,17,5,18],[5,19,5,20],[5,21,5,22],[5,23,5,24],[5,25,5,26],[6,41,6,42],[6,43,6,44],[6,9,6,10],[6,11,6,12],[6,13,6,14],[6,15,6,16],[6,17,6,18],[6,19,6,20],[6,21,6,22],[6,23,6,24],[6,25,6,26],[7,27,7,28],[7,29,7,30],[7,31,7,32],[7,33,7,34],[7,35,7,36],[7,37,7,38],[7,39,7,40],[7,41,7,42],[7,43,7,44],[7,9,7,10],[7,11,7,12],[7,13,7,14],[7,15,7,16],[7,17,7,18],[7,19,7,20],[7,21,7,22],[7,23,7,24],[7,25,7,26],[8,27,8,28],[8,29,8,30],[8,31,8,32],[8,33,8,34],[8,35,8,36],[8,37,8,38],[8,39,8,40],[8,41,8,42],[8,43,8,44],[8,9,8,10],[8,11,8,12],[8,13,8,14],[8,15,8,16],[8,17,8,18],[8,19,8,20],[8,21,8,22],[8,23,8,24],[8,25,8,26],[9,27,9,28],[9,29,9,30],[9,31,9,32],[9,33,9,34],[9,35,9,36],[9,37,9,38],[9,39,9,40],[9,41,9,42],[9,43,9,44],[9,9,9,10],[9,11,9,12],[9,13,9,14],[9,15,9,16],[9,17,9,18],[9,19,9,20],[9,21,9,22],[9,23,9,24],[9,25,9,26],[10,27,10,28],[10,29,10,30],[10,31,10,32],[10,33,10,34],[10,35,10,36],[10,37,10,38],[10,39,10,40],[10,41,10,42],[10,43,10,44],[10,9,10,10],[10,11,10,12],[10,13,10,14],[10,15,10,16],[10,17,10,18],[10,19,10,20],[10,21,10,22],[10,23,10,24],[10,25,10,26],[11,27,11,28],[11,29,11,30],[11,31,11,32],[11,33,11,34],[11,35,11,36],[11,37,11,38],[11,39,11,40],[11,41,11,42],[11,43,11,44],[11,9,11,10],[11,11,11,12],[11,13,11,14],[11,15,11,16],[11,17,11,18],[11,19,11,20],[11,21,11,22],[11,23,11,24],[11,25,11,26],[12,27,12,28],[12,29,12,30],[12,31,12,32],[12,33,12,34],[12,35,12,36],[12,37,12,38],[12,39,12,40],[12,41,12,42],[12,43,12,44],[12,9,12,10],[12,11,12,12],[12,13,12,14],[12,15,12,16],[12,17,12,18],[12,19,12,20],[12,21,12,22],[12,23,12,24],[12,25,12,26],[13,27,13,28],[13,29,13,30],[13,31,13,32],[13,33,13,34],[13,35,13,36],[13,37,13,38],[13,39,13,40],[13,41,13,42],[13,43,13,44],[13,9,13,10],[13,11,13,12],[13,13,13,14],[13,15,13,16],[13,17,13,18],[13,19,13,20],[13,21,13,22],[13,23,13,24],[13,25,13,26],[14,27,14,28],[14,29,14,30],[14,31,14,32],[14,33,14,34],[14,35,14,36],[14,37,14,38],[14,39,14,40],[14,41,14,42],[14,43,14,44],[14,9,14,10],[14,11,14,12],[14,13,14,14],[14,15,14,16],[14,17,14,18],[14,19,14,20],[14,21,14,22],[14,23,14,24],[14,25,14,26],[15,27,15,28],[15,29,15,30],[15,31,15,32],[15,33,15,34],[15,35,15,36],[15,37,15,38],[15,39,15,40],[15,41,15,42],[15,43,15,44],[15,9,15,10],[15,11,15,12],[15,13,15,14],[15,15,15,16],[15,17,15,18],[15,19,15,20],[15,21,15,22],[15,23,15,24],[15,25,15,26],[16,27,16,28],[16,29,16,30],[16,31,16,32],[16,33,16,34],[16,35,16,36],[16,37,16,38],[16,39,16,40],[16,41,16,42],[16,43,16,44],[16,9,16,10],[16,11,16,12],[16,13,16,14],[16,15,16,16],[16,17,16,18],[16,19,16,20],[16,21,16,22],[16,23,16,24],[16,25,16,26],[18,13,18,14],[18,15,18,16],[18,17,18,18],[18,19,18,20],[18,21,18,22],[18,23,18,24],[17,27,17,28],[17,29,17,30],[17,31,17,32],[17,33,17,34],[17,35,17,36],[17,37,17,38],[17,39,17,40],[17,41,17,42],[17,43,17,44],[17,9,17,10],[17,11,17,12],[17,13,17,14],[17,15,17,16],[17,17,17,18],[17,19,17,20],[17,21,17,22],[17,23,17,24],[17,25,17,26],[18,43,18,44],[19,7,19,8],[19,9,19,10],[19,11,19,12],[19,13,19,14],[19,15,19,16],[19,17,19,18],[19,19,19,20],[19,21,19,22],[19,23,19,24],[19,25,19,26],[19,27,19,28],[19,29,19,30],[19,31,19,32],[19,33,19,34],[19,35,19,36],[19,37,19,38],[19,39,19,40],[19,41,19,42],[19,43,19,44],[18,25,18,26],[18,27,18,28],[18,29,18,30],[18,31,18,32],[18,33,18,34],[18,35,18,36],[18,37,18,38],[18,39,18,40],[18,41,18,42],[18,7,18,8],[18,9,18,10],[18,11,18,12],[20,25,20,26],[20,27,20,28],[20,29,20,30],[20,31,20,32],[20,33,20,34],[20,35,20,36],[20,37,20,38],[20,39,20,40],[20,41,20,42],[20,7,20,8],[20,9,20,10],[20,11,20,12],[20,13,20,14],[20,15,20,16],[20,17,20,18],[20,19,20,20],[20,21,20,22],[20,23,20,24],[22,37,22,38],[22,39,22,40],[22,41,22,42],[22,7,22,8],[22,9,22,10],[22,11,22,12],[22,13,22,14],[22,15,22,16],[22,17,22,18],[22,19,22,20],[22,21,22,22],[22,23,22,24],[20,43,20,44],[21,7,21,8],[21,9,21,10],[21,11,21,12],[21,13,21,14],[21,15,21,16],[21,17,21,18],[21,19,21,20],[21,21,21,22],[21,23,21,24],[21,25,21,26],[21,27,21,28],[21,29,21,30],[21,31,21,32],[21,33,21,34],[21,35,21,36],[21,37,21,38],[21,39,21,40],[21,41,21,42],[21,43,21,44],[24,13,24,14],[24,15,24,16],[24,17,24,18],[24,19,24,20],[24,21,24,22],[24,23,24,24],[22,43,22,44],[23,7,23,8],[23,9,23,10],[23,11,23,12],[23,13,23,14],[23,15,23,16],[23,17,23,18],[23,19,23,20],[23,21,23,22],[23,23,23,24],[23,25,23,26],[23,27,23,28],[23,29,23,30],[23,31,23,32],[23,33,23,34],[23,35,23,36],[23,37,23,38],[23,39,23,40],[23,41,23,42],[23,43,23,44],[22,25,22,26],[22,27,22,28],[22,29,22,30],[22,31,22,32],[22,33,22,34],[22,35,22,36],[24,43,24,44],[25,7,25,8],[25,9,25,10],[25,11,25,12],[25,13,25,14],[25,15,25,16],[25,17,25,18],[25,19,25,20],[25,21,25,22],[25,23,25,24],[25,25,25,26],[25,27,25,28],[25,29,25,30],[25,31,25,32],[25,33,25,34],[25,35,25,36],[25,37,25,38],[25,39,25,40],[25,41,25,42],[25,43,25,44],[24,25,24,26],[24,27,24,28],[24,29,24,30],[24,31,24,32],[24,33,24,34],[24,35,24,36],[24,37,24,38],[24,39,24,40],[24,41,24,42],[24,7,24,8],[24,9,24,10],[24,11,24,12],[26,25,26,26],[26,27,26,28],[26,29,26,30],[26,31,26,32],[26,33,26,34],[26,35,26,36],[26,37,26,38],[26,39,26,40],[26,41,26,42],[26,7,26,8],[26,9,26,10],[26,11,26,12],[26,13,26,14],[26,15,26,16],[26,17,26,18],[26,19,26,20],[26,21,26,22],[26,23,26,24],[28,37,28,38],[28,39,28,40],[28,41,28,42],[28,7,28,8],[28,9,28,10],[28,11,28,12],[28,13,28,14],[28,15,28,16],[28,17,28,18],[28,19,28,20],[28,21,28,22],[28,23,28,24],[26,43,26,44],[27,7,27,8],[27,9,27,10],[27,11,27,12],[27,13,27,14],[27,15,27,16],[27,17,27,18],[27,19,27,20],[27,21,27,22],[27,23,27,24],[27,25,27,26],[27,27,27,28],[27,29,27,30],[27,31,27,32],[27,33,27,34],[27,35,27,36],[27,37,27,38],[27,39,27,40],[27,41,27,42],[27,43,27,44],[30,13,30,14],[30,15,30,16],[30,17,30,18],[30,19,30,20],[30,21,30,22],[30,23,30,24],[28,43,28,44],[29,7,29,8],[29,9,29,10],[29,11,29,12],[29,13,29,14],[29,15,29,16],[29,17,29,18],[29,19,29,20],[29,21,29,22],[29,23,29,24],[29,25,29,26],[29,27,29,28],[29,29,29,30],[29,31,29,32],[29,33,29,34],[29,35,29,36],[29,37,29,38],[29,39,29,40],[29,41,29,42],[29,43,29,44],[28,25,28,26],[28,27,28,28],[28,29,28,30],[28,31,28,32],[28,33,28,34],[28,35,28,36],[30,43,30,44],[46,7,46,8],[46,9,46,10],[46,11,46,12],[46,13,46,14],[46,15,46,16],[46,17,46,18],[46,19,46,20],[46,21,46,22],[46,23,46,24],[46,25,46,26],[46,27,46,28],[46,29,46,30],[46,31,46,32],[46,33,46,34],[46,35,46,36],[46,37,46,38],[46,39,46,40],[46,41,46,42],[46,43,46,44],[30,25,30,26],[30,27,30,28],[30,29,30,30],[30,31,30,32],[30,33,30,34],[30,35,30,36],[30,37,30,38],[30,39,30,40],[30,41,30,42],[30,7,30,8],[30,9,30,10],[30,11,30,12],[47,25,47,26],[47,27,47,28],[47,29,47,30],[47,31,47,32],[47,33,47,34],[47,35,47,36],[47,37,47,38],[47,39,47,40],[47,41,47,42],[47,7,47,8],[47,9,47,10],[47,11,47,12],[47,13,47,14],[47,15,47,16],[47,17,47,18],[47,19,47,20],[47,21,47,22],[47,23,47,24],[49,37,49,38],[49,39,49,40],[49,41,49,42],[49,7,49,8],[49,9,49,10],[49,11,49,12],[49,13,49,14],[49,15,49,16],[49,17,49,18],[49,19,49,20],[49,21,49,22],[49,23,49,24],[47,43,47,44],[48,7,48,8],[48,9,48,10],[48,11,48,12],[48,13,48,14],[48,15,48,16],[48,17,48,18],[48,19,48,20],[48,21,48,22],[48,23,48,24],[48,25,48,26],[48,27,48,28],[48,29,48,30],[48,31,48,32],[48,33,48,34],[48,35,48,36],[48,37,48,38],[48,39,48,40],[48,41,48,42],[48,43,48,44],[51,13,51,14],[51,15,51,16],[51,17,51,18],[51,19,51,20],[51,21,51,22],[51,23,51,24],[49,43,49,44],[50,7,50,8],[50,9,50,10],[50,11,50,12],[50,13,50,14],[50,15,50,16],[50,17,50,18],[50,19,50,20],[50,21,50,22],[50,23,50,24],[50,25,50,26],[50,27,50,28],[50,29,50,30],[50,31,50,32],[50,33,50,34],[50,35,50,36],[50,37,50,38],[50,39,50,40],[50,41,50,42],[50,43,50,44],[49,25,49,26],[49,27,49,28],[49,29,49,30],[49,31,49,32],[49,33,49,34],[49,35,49,36],[51,43,51,44],[52,7,52,8],[52,9,52,10],[52,11,52,12],[52,13,52,14],[52,15,52,16],[52,17,52,18],[52,19,52,20],[52,21,52,22],[52,23,52,24],[52,25,52,26],[52,27,52,28],[52,29,52,30],[52,31,52,32],[52,33,52,34],[52,35,52,36],[52,37,52,38],[52,39,52,40],[52,41,52,42],[52,43,52,44],[51,25,51,26],[51,27,51,28],[51,29,51,30],[51,31,51,32],[51,33,51,34],[51,35,51,36],[51,37,51,38],[51,39,51,40],[51,41,51,42],[51,7,51,8],[51,9,51,10],[51,11,51,12],[53,25,53,26],[53,27,53,28],[53,29,53,30],[53,31,53,32],[53,33,53,34],[53,35,53,36],[53,37,53,38],[53,39,53,40],[53,41,53,42],[53,7,53,8],[53,9,53,10],[53,11,53,12],[53,13,53,14],[53,15,53,16],[53,17,53,18],[53,19,53,20],[53,21,53,22],[53,23,53,24],[55,37,55,38],[55,39,55,40],[55,41,55,42],[55,7,55,8],[55,9,55,10],[55,11,55,12],[55,13,55,14],[55,15,55,16],[55,17,55,18],[55,19,55,20],[55,21,55,22],[55,23,55,24],[53,43,53,44],[54,7,54,8],[54,9,54,10],[54,11,54,12],[54,13,54,14],[54,15,54,16],[54,17,54,18],[54,19,54,20],[54,21,54,22],[54,23,54,24],[54,25,54,26],[54,27,54,28],[54,29,54,30],[54,31,54,32],[54,33,54,34],[54,35,54,36],[54,37,54,38],[54,39,54,40],[54,41,54,42],[54,43,54,44],[57,13,57,14],[57,15,57,16],[57,17,57,18],[57,19,57,20],[57,21,57,22],[57,23,57,24],[55,43,55,44],[56,7,56,8],[56,9,56,10],[56,11,56,12],[56,13,56,14],[56,15,56,16],[56,17,56,18],[56,19,56,20],[56,21,56,22],[56,23,56,24],[56,25,56,26],[56,27,56,28],[56,29,56,30],[56,31,56,32],[56,33,56,34],[56,35,56,36],[56,37,56,38],[56,39,56,40],[56,41,56,42],[56,43,56,44],[55,25,55,26],[55,27,55,28],[55,29,55,30],[55,31,55,32],[55,33,55,34],[55,35,55,36],[57,43,57,44],[58,7,58,8],[58,9,58,10],[58,11,58,12],[58,13,58,14],[58,15,58,16],[58,17,58,18],[58,19,58,20],[58,21,58,22],[58,23,58,24],[58,25,58,26],[58,27,58,28],[58,29,58,30],[58,31,58,32],[58,33,58,34],[58,35,58,36],[58,37,58,38],[58,39,58,40],[58,41,58,42],[58,43,58,44],[57,25,57,26],[57,27,57,28],[57,29,57,30],[57,31,57,32],[57,33,57,34],[57,35,57,36],[57,37,57,38],[57,39,57,40],[57,41,57,42],[57,7,57,8],[57,9,57,10],[57,11,57,12],[59,25,59,26],[59,27,59,28],[59,29,59,30],[59,31,59,32],[59,33,59,34],[59,35,59,36],[59,37,59,38],[59,39,59,40],[59,41,59,42],[59,7,59,8],[59,9,59,10],[59,11,59,12],[59,13,59,14],[59,15,59,16],[59,17,59,18],[59,19,59,20],[59,21,59,22],[59,23,59,24],[61,37,61,38],[61,39,61,40],[61,41,61,42],[61,7,61,8],[61,9,61,10],[61,11,61,12],[61,13,61,14],[61,15,61,16],[61,17,61,18],[61,19,61,20],[61,21,61,22],[61,23,61,24],[59,43,59,44],[60,7,60,8],[60,9,60,10],[60,11,60,12],[60,13,60,14],[60,15,60,16],[60,17,60,18],[60,19,60,20],[60,21,60,22],[60,23,60,24],[60,25,60,26],[60,27,60,28],[60,29,60,30],[60,31,60,32],[60,33,60,34],[60,35,60,36],[60,37,60,38],[60,39,60,40],[60,41,60,42],[60,43,60,44],[63,13,63,14],[63,15,63,16],[63,17,63,18],[63,19,63,20],[63,21,63,22],[63,23,63,24],[61,43,61,44],[62,7,62,8],[62,9,62,10],[62,11,62,12],[62,13,62,14],[62,15,62,16],[62,17,62,18],[62,19,62,20]],"merged_total":1641,"flags":["merged_cut"]}
[null,null,null,null,null,"3-1",null,"4-1",null,"5-1",null,"6-1",null,"7-1",null,"8-1",null,"8-2",null,"9-1",null,"9-2",null,"10-1",null,"10-2",null,"11-1",null,"11-2",null,"12-2",null,"13-1",null,"13-2",null,"14-1",null,"14-2",null,"15-1",null,"15-2"]
["大型ブロック積擁壁",null,null,null,null,{"$f":"IF(LEN(VLOOKUP(F1,仕様の整理!$C:$E,3,0))-LEN(SUBSTITUTE(VLOOKUP(F1,仕様の整理!$C:$E,3,0),\"-\",\"\"))>=2,LEFT(VLOOKUP(F1,仕様の整理!$C:$E,3,0),FIND(\"-\",VLOOKUP(F1,仕様の整理!$C:$E,3,0),FIND(\"-\",VLOOKUP(F1,仕様の整理!$C:$E,3,0))+1)-1),VLOOKUP(F1,仕様の整理!$C:$E,3,0))","v":"QS-180011"},null,{"$f":"IF(LEN(VLOOKUP(H1,仕様の整理!$C:$E,3,0))-LEN(SUBSTITUTE(VLOOKUP(H1,仕様の整理!$C:$E,3,0),\"-\",\"\"))>=2,LEFT(VLOOKUP(H1,仕様の整理!$C:$E,3,0),FIND(\"-\",VLOOKUP(H1,仕様の整理!$C:$E,3,0),FIND(\"-\",VLOOKUP(H1,仕様の整理!$C:$E,3,0))+1)-1),VLOOKUP(H1,仕様の整理!$C:$E,3,0))","v":"SK-180013"},null,{"$f":"IF(LEN(VLOOKUP(J1,仕様の整理!$C:$E,3,0))-LEN(SUBSTITUTE(VLOOKUP(J1,仕様の整理!$C:$E,3,0),\"-\",\"\"))>=2,LEFT(VLOOKUP(J1,仕様の整理!$C:$E,3,0),FIND(\"-\",VLOOKUP(J1,仕様の整理!$C:$E,3,0),FIND(\"-\",VLOOKUP(J1,仕様の整理!$C:$E,3,0))+1)-1),VLOOKUP(J1,仕様の整理!$C:$E,3,0))","v":"QS-180033"},null,{"$f":"IF(LEN(VLOOKUP(L1,仕様の整理!$C:$E,3,0))-LEN(SUBSTITUTE(VLOOKUP(L1,仕様の整理!$C:$E,3,0),\"-\",\"\"))>=2,LEFT(VLOOKUP(L1,仕様の整理!$C:$E,3,0),FIND(\"-\",VLOOKUP(L1,仕様の整理!$C:$E,3,0),FIND(\"-\",VLOOKUP(L1,仕様の整理!$C:$E,3,0))+1)-1),VLOOKUP(L1,仕様の整理!$C:$E,3,0))","v":"QS-180048"},null,{"$f":"IF(LEN(VLOOKUP(N1,仕様の整理!$C:$E,3,0))-LEN(SUBSTITUTE(VLOOKUP(N1,仕様の整理!$C:$E,3,0),\"-\",\"\"))>=2,LEFT(VLOOKUP(N1,仕様の整理!$C:$E,3,0),FIND(\"-\",VLOOKUP(N1,仕様の整理!$C:$E,3,0),FIND(\"-\",VLOOKUP(N1,仕様の整理!$C:$E,3,0))+1)-1),VLOOKUP(N1,仕様の整理!$C:$E,3,0))","v":"KK-200032"},null,{"$f":"IF(LEN(VLOOKUP(P1,仕様の整理!$C:$E,3,0))-LEN(SUBSTITUTE(VLOOKUP(P1,仕様の整理!$C:$E,3,0),\"-\",\"\"))>=2,LEFT(VLOOKUP(P1,仕様の整理!$C:$E,3,0),FIND(\"-\",VLOOKUP(P1,仕様の整理!$C:$E,3,0),FIND(\"-\",VLOOKUP(P1,仕様の整理!$C:$E,3,0))+1)-1),VLOOKUP(P1,仕様の整理!$C:$E,3,0))","v":"TH-990073"},null,{"$f":"IF(LEN(VLOOKUP(R1,仕様の整理!$C:$E,3,0))-LEN(SUBSTITUTE(VLOOKUP(R1,仕様の整理!$C:$E,3,0),\"-\",\"\"))>=2,LEFT(VLOOKUP(R1,仕様の整理!$C:$E,3,0),FIND(\"-\",VLOOKUP(R1,仕様の整理!$C:$E,3,0),FIND(\"-\",VLOOKUP(R1,仕様の整理!$C:$E,3,0))+1)-1),VLOOKUP(R1,仕様の整理!$C:$E,3,0))","v":"TH-990073"},null,{"$f":"IF(LEN(VLOOKUP(T1,仕様の整理!$C:$E,3,0))-LEN(SUBSTITUTE(VLOOKUP(T1,仕様の整理!$C:$E,3,0),\"-\",\"\"))>=2,LEFT(VLOOKUP(T1,仕様の整理!$C:$E,3,0),FIND(\"-\",VLOOKUP(T1,仕様の整理!$C:$E,3,0),FIND(\"-\",VLOOKUP(T1,仕様の整理!$C:$E,3,0))+1)-1),VLOOKUP(T1,仕様の整理!$C:$E,3,0))","v":"KK-010046"},null,{"$f":"IF(LEN(VLOOKUP(V1,仕様の整理!$C:$E,3,0))-LEN(SUBSTITUTE(VLOOKUP(V1,仕様の整理!$C:$E,3,0),\"-\",\"\"))>=2,LEFT(VLOOKUP(V1,仕様の整理!$C:$E,3,0),FIND(\"-\",VLOOKUP(V1,仕様の整理!$C:$E,3,0),FIND(\"-\",VLOOKUP(V1,仕様の整理!$C:$E,3,0))+1)-1),VLOOKUP(V1,仕様の整理!$C:$E,3,0))","v":"KK-010046"},null,{"$f":"IF(LEN(VLOOKUP(X1,仕様の整理!$C:$E,3,0))-LEN(SUBSTITUTE(VLOOKUP(X1,仕様の整理!$C:$E,3,0),\"-\",\"\"))>=2,LEFT(VLOOKUP(X1,仕様の整理!$C:$E,3,0),FIND(\"-\",VLOOKUP(X1,仕様の整理!$C:$E,3,0),FIND(\"-\",VLOOKUP(X1,仕様の整理!$C:$E,3,0))+1)-1),VLOOKUP(X1,仕様の整理!$C:$E,3,0))","v":"KK-020063"},null,{"$f":"IF(LEN(VLOOKUP(Z1,仕様の整理!$C:$E,3,0))-LEN(SUBSTITUTE(VLOOKUP(Z1,仕様の整理!$C:$E,3,0),\"-\",\"\"))>=2,LEFT(VLOOKUP(Z1,仕様の整理!$C:$E,3,0),FIND(\"-\",VLOOKUP(Z1,仕様の整理!$C:$E,3,0),FIND(\"-\",VLOOKUP(Z1,仕様の整理!$C:$E,3,0))+1)-1),VLOOKUP(Z1,仕様の整理!$C:$E,3,0))","v":"KK-020063"},null,{"$f":"IF(LEN(VLOOKUP(AB1,仕様の整理!$C:$E,3,0))-LEN(SUBSTITUTE(VLOOKUP(AB1,仕様の整理!$C:$E,3,0),\"-\",\"\"))>=2,LEFT(VLOOKUP(AB1,仕様の整理!$C:$E,3,0),FIND(\"-\",VLOOKUP(AB1,仕様の整理!$C:$E,3,0),FIND(\"-\",VLOOKUP(AB1,仕様の整理!$C:$E,3,0))+1)-1),VLOOKUP(AB1,仕様の整理!$C:$E,3,0))","v":"SK-030002"},null,{"$f":"IF(LEN(VLOOKUP(AD1,仕様の整理!$C:$E,3,0))-LEN(SUBSTITUTE(VLOOKUP(AD1,仕様の整理!$C:$E,3,0),\"-\",\"\"))>=2,LEFT(VLOOKUP(AD1,仕様の整理!$C:$E,3,0),FIND(\"-\",VLOOKUP(AD1,仕様の整理!$C:$E,3,0),FIND(\"-\",VLOOKUP(AD1,仕様の整理!$C:$E,3,0))+1)-1),VLOOKUP(AD1,仕様の整理!$C:$E,3,0))","v":"SK-030002"},null,{"$f":"IF(LEN(VLOOKUP(AF1,仕様の整理!$C:$E,3,0))-LEN(SUBSTITUTE(VLOOKUP(AF1,仕様の整理!$C:$E,3,0),\"-\",\"\"))>=2,LEFT(VLOOKUP(AF1,仕様の整理!$C:$E,3,0),FIND(\"-\",VLOOKUP(AF1,仕様の整理!$C:$E,3,0),FIND(\"-\",VLOOKUP(AF1,仕様の整理!$C:$E,3,0))+1)-1),VLOOKUP(AF1,仕様の整理!$C:$E,3,0))","v":"CG-040013"},null,{"$f":"IF(LEN(VLOOKUP(AH1,仕様の整理!$C:$E,3,0))-LEN(SUBSTITUTE(VLOOKUP(AH1,仕様の整理!$C:$E,3,0),\"-\",\"\"))>=2,LEFT(VLOOKUP(AH1,仕様の整理!$C:$E,3,0),FIND(\"-\",VLOOKUP(AH1,仕様の整理!$C:$E,3,0),FIND(\"-\",VLOOKUP(AH1,仕様の整理!$C:$E,3,0))+1)-1),VLOOKUP(AH1,仕様の整理!$C:$E,3,0))","v":"CB-040038"},null,{"$f":"IF(LEN(VLOOKUP(AJ1,仕様の整理!$C:$E,3,0))-LEN(SUBSTITUTE(VLOOKUP(AJ1,仕様の整理!$C:$E,3,0),\"-\",\"\"))>=2,LEFT(VLOOKUP(AJ1,仕様の整理!$C:$E,3,0),FIND(\"-\",VLOOKUP(AJ1,仕様の整理!$C:$E,3,0),FIND(\"-\",VLOOKUP(AJ1,仕様の整理!$C:$E,3,0))+1)-1),VLOOKUP(AJ1,仕様の整理!$C:$E,3,0))","v":"CB-040038"},null,{"$f":"IF(LEN(VLOOKUP(AL1,仕様の整理!$C:$E,3,0))-LEN(SUBSTITUTE(VLOOKUP(AL1,仕様の整理!$C:$E,3,0),\"-\",\"\"))>=2,LEFT(VLOOKUP(AL1,仕様の整理!$C:$E,3,0),FIND(\"-\",VLOOKUP(AL1,仕様の整理!$C:$E,3,0),FIND(\"-\",VLOOKUP(AL1,仕様の整理!$C:$E,3,0))+1)-1),VLOOKUP(AL1,仕様の整理!$C:$E,3,0))","v":"CB-070024"},null,{"$f":"IF(LEN(VLOOKUP(AN1,仕様の整理!$C:$E,3,0))-LEN(SUBSTITUTE(VLOOKUP(AN1,仕様の整理!$C:$E,3,0),\"-\",\"\"))>=2,LEFT(VLOOKUP(AN1,仕様の整理!$C:$E,3,0),FIND(\"-\",VLOOKUP(AN1,仕様の整理!$C:$E,3,0),FIND(\"-\",VLOOKUP(AN1,仕様の整理!$C:$E,3,0))+1)-1),VLOOKUP(AN1,仕様の整理!$C:$E,3,0))","v":"CB-070024"},null,{"$f":"IF(LEN(VLOOKUP(AP1,仕様の整理!$C:$E,3,0))-LEN(SUBSTITUTE(VLOOKUP(AP1,仕様の整理!$C:$E,3,0),\"-\",\"\"))>=2,LEFT(VLOOKUP(AP1,仕様の整理!$C:$E,3,0),FIND(\"-\",VLOOKUP(AP1,仕様の整理!$C:$E,3,0),FIND(\"-\",VLOOKUP(AP1,仕様の整理!$C:$E,3,0))+1)-1),VLOOKUP(AP1,仕様の整理!$C:$E,3,0))","v":"SK-210001"},null,{"$f":"IF(LEN(VLOOKUP(AR1,仕様の整理!$C:$E,3,0))-LEN(SUBSTITUTE(VLOOKUP(AR1,仕様の整理!$C:$E,3,0),\"-\",\"\"))>=2,LEFT(VLOOKUP(AR1,仕様の整理!$C:$E,3,0),FIND(\"-\",VLOOKUP(AR1,仕様の整理!$C:$E,3,0),FIND(\"-\",VLOOKUP(AR1,仕様の整理!$C:$E,3,0))+1)-1),VLOOKUP(AR1,仕様の整理!$C:$E,3,0))","v":"SK-210001"}]
[null,null,null,null,null,{"$f":"IFERROR(\"作成日：\"&VLOOKUP(F$1,仕様の整理!$C:$O,6,0),\"-\")","v":"作成日：令和7年10月"},null,{"$f":"IFERROR(\"作成日：\"&VLOOKUP(H$1,仕様の整理!$C:$O,6,0),\"-\")","v":"作成日：令和7年10月"},null,{"$f":"IFERROR(\"作成日：\"&VLOOKUP(J$1,仕様の整理!$C:$O,6,0),\"-\")","v":"作成日：令和7年10月"},null,{"$f":"IFERROR(\"作成日：\"&VLOOKUP(L$1,仕様の整理!$C:$O,6,0),\"-\")","v":"作成日：令和7年10月"},null,{"$f":"IFERROR(\"作成日：\"&VLOOKUP(N$1,仕様の整理!$C:$O,6,0),\"-\")","v":"作成日：令和7年10月"},null,{"$f":"IFERROR(\"作成日：\"&VLOOKUP(P$1,仕様の整理!$C:$O,6,0),\"-\")","v":"作成日：令和7年10月"},null,{"$f":"IFERROR(\"作成日：\"&VLOOKUP(R$1,仕様の整理!$C:$O,6,0),\"-\")","v":"作成日：令和7年10月"},null,{"$f":"IFERROR(\"作成日：\"&VLOOKUP(T$1,仕様の整理!$C:$O,6,0),\"-\")","v":"作成日：令和7年10月"},null,{"$f":"IFERROR(\"作成日：\"&VLOOKUP(V$1,仕様の整理!$C:$O,6,0),\"-\")","v":"作成日：令和7年10月"},null,{"$f":"IFERROR(\"作成日：\"&VLOOKUP(X$1,仕様の整理!$C:$O,6,0),\"-\")","v":"作成日：令和7年10月"},null,{"$f":"IFERROR(\"作成日：\"&VLOOKUP(Z$1,仕様の整理!$C:$O,6,0),\"-\")","v":"作成日：令和7年10月"},null,{"$f":"IFERROR(\"作成日：\"&VLOOKUP(AB$1,仕様の整理!$C:$O,6,0),\"-\")","v":"作成日：令和7年10月"},null,{"$f":"IFERROR(\"作成日：\"&VLOOKUP(AD$1,仕様の整理!$C:$O,6,0),\"-\")","v":"作成日：令和7年10月"},null,{"$f":"IFERROR(\"作成日：\"&VLOOKUP(AF$1,仕様の整理!$C:$O,6,0),\"-\")","v":"作成日：令和7年10月"},null,{"$f":"IFERROR(\"作成日：\"&VLOOKUP(AH$1,仕様の整理!$C:$O,6,0),\"-\")","v":"作成日：令和7年10月"},null,{"$f":"IFERROR(\"作成日：\"&VLOOKUP(AJ$1,仕様の整理!$C:$O,6,0),\"-\")","v":"作成日：令和7年10月"},null,{"$f":"IFERROR(\"作成日：\"&VLOOKUP(AL$1,仕様の整理!$C:$O,6,0),\"-\")","v":"作成日：令和7年10月"},null,{"$f":"IFERROR(\"作成日：\"&VLOOKUP(AN$1,仕様の整理!$C:$O,6,0),\"-\")","v":"作成日：令和7年10月"},null,{"$f":"IFERROR(\"作成日：\"&VLOOKUP(AP$1,仕様の整理!$C:$O,6,0),\"-\")","v":"作成日：令和7年10月"},null,{"$f":"IFERROR(\"作成日：\"&VLOOKUP(AR$1,仕様の整理!$C:$O,6,0),\"-\")","v":"作成日：令和7年10月"}]
[null,null,null,null,null,{"$f":"\"種類：\"&VLOOKUP(F1,仕様の整理!$C:$AD,7,0)","v":"種類：練積ブロック"},null,{"$f":"\"種類：\"&VLOOKUP(H1,仕様の整理!$C:$AD,7,0)","v":"種類：空積ブロック、練積ブロック"},null,{"$f":"\"種類：\"&VLOOKUP(J1,仕様の整理!$C:$AD,7,0)","v":"種類：空積ブロック"},null,{"$f":"\"種類：\"&VLOOKUP(L1,仕様の整理!$C:$AD,7,0)","v":"種類：練積ブロック"},null,{"$f":"\"種類：\"&VLOOKUP(N1,仕様の整理!$C:$AD,7,0)","v":"種類：練積ブロック"},null,{"$f":"\"種類：\"&VLOOKUP(P1,仕様の整理!$C:$AD,7,0)","v":"種類：練積ブロック"},null,{"$f":"\"種類：\"&VLOOKUP(R1,仕様の整理!$C:$AD,7,0)","v":"種類：練積ブロック"},null,{"$f":"\"種類：\"&VLOOKUP(T1,仕様の整理!$C:$AD,7,0)","v":"種類：空積ブロック、練積ブロック"},null,{"$f":"\"種類：\"&VLOOKUP(V1,仕様の整理!$C:$AD,7,0)","v":"種類：空積ブロック、練積ブロック"},null,{"$f":"\"種類：\"&VLOOKUP(X1,仕様の整理!$C:$AD,7,0)","v":"種類：練積ブロック"},null,{"$f":"\"種類：\"&VLOOKUP(Z1,仕様の整理!$C:$AD,7,0)","v":"種類：練積ブロック"},null,{"$f":"\"種類：\"&VLOOKUP(AB1,仕様の整理!$C:$AD,7,0)","v":"種類：練積ブロック"},null,{"$f":"\"種類：\"&VLOOKUP(AD1,仕様の整理!$C:$AD,7,0)","v":"種類：練積ブロック"},null,{"$f":"\"種類：\"&VLOOKUP(AF1,仕様の整理!$C:$AD,7,0)","v":"種類：練積ブロック"},null,{"$f":"\"種類：\"&VLOOKUP(AH1,仕様の整理!$C:$AD,7,0)","v":"種類：空積ブロック"},null,{"$f":"\"種類：\"&VLOOKUP(AJ1,仕様の整理!$C:$AD,7,0)","v":"種類：空積ブロック"},null,{"$f":"\"種類：\"&VLOOKUP(AL1,仕様の整理!$C:$AD,7,0)","v":"種類：練積ブロック"},null,{"$f":"\"種類：\"&VLOOKUP(AN1,仕様の整理!$C:$AD,7,0)","v":"種類：練積ブロック"},null,{"$f":"\"種類：\"&VLOOKUP(AP1,仕様の整理!$C:$AD,7,0)","v":"種類：練積ブロック"},null,{"$f":"\"種類：\"&VLOOKUP(AR1,仕様の整理!$C:$AD,7,0)","v":"種類：練積ブロック"}]
["ＮＥＴＩＳ情報","技術名",null,null,null,{"$f":"IF(VLOOKUP(F$1,仕様の整理!$C:$O,4,0)=\"NETIS掲載期間終了技術\",VLOOKUP(F$1,仕様の整理!$C:$O,2,0),VLOOKUP(F$1,仕様の整理!$C:$O,2,0)&\"（\"&VLOOKUP(F$1,仕様の整理!$C:$O,4,0)&\"）\")&IF(VLOOKUP(F$1,仕様の整理!$C:$O,5,0)=\"○\",\"\",\"《新規登録技術》\")","v":"自立安定型ブロック「スリムブロック」（有用な新技術）"},null,{"$f":"IF(VLOOKUP(H$1,仕様の整理!$C:$O,4,0)=\"NETIS掲載期間終了技術\",VLOOKUP(H$1,仕様の整理!$C:$O,2,0),VLOOKUP(H$1,仕様の整理!$C:$O,2,0)&\"（\"&VLOOKUP(H$1,仕様の整理!$C:$O,4,0)&\"）\")&IF(VLOOKUP(H$1,仕様の整理!$C:$O,5,0)=\"○\",\"\",\"《新規登録技術》\")","v":"ヘキサゴン（事後評価未実施技術）"},null,{"$f":"IF(VLOOKUP(J$1,仕様の整理!$C:$O,4,0)=\"NETIS掲載期間終了技術\",VLOOKUP(J$1,仕様の整理!$C:$O,2,0),VLOOKUP(J$1,仕様の整理!$C:$O,2,0)&\"（\"&VLOOKUP(J$1,仕様の整理!$C:$O,4,0)&\"）\")&IF(VLOOKUP(J$1,仕様の整理!$C:$O,5,0)=\"○\",\"\",\"《新規登録技術》\")","v":"マザーズロックⅢ型(環境型ブロック)（事後評価済技術）"},null,{"$f":"IF(VLOOKUP(L$1,仕様の整理!$C:$O,4,0)=\"NETIS掲載期間終了技術\",VLOOKUP(L$1,仕様の整理!$C:$O,2,0),VLOOKUP(L$1,仕様の整理!$C:$O,2,0)&\"（\"&VLOOKUP(L$1,仕様の整理!$C:$O,4,0)&\"）\")&IF(VLOOKUP(L$1,仕様の整理!$C:$O,5,0)=\"○\",\"\",\"《新規登録技術》\")","v":"BIブロック（九州の技術）"},null,{"$f":"IF(VLOOKUP(N$1,仕様の整理!$C:$O,4,0)=\"NETIS掲載期間終了技術\",VLOOKUP(N$1,仕様の整理!$C:$O,2,0),VLOOKUP(N$1,仕様の整理!$C:$O,2,0)&\"（\"&VLOOKUP(N$1,仕様の整理!$C:$O,4,0)&\"）\")&IF(VLOOKUP(N$1,仕様の整理!$C:$O,5,0)=\"○\",\"\",\"《新規登録技術》\")","v":"ヌノピタ（事後評価未実施技術）"},null,{"$f":"IF(VLOOKUP(P$1,仕様の整理!$C:$O,4,0)=\"NETIS掲載期間終了技術\",VLOOKUP(P$1,仕様の整理!$C:$O,2,0),VLOOKUP(P$1,仕様の整理!$C:$O,2,0)&\"（\"&VLOOKUP(P$1,仕様の整理!$C:$O,4,0)&\"）\")&IF(VLOOKUP(P$1,仕様の整理!$C:$O,5,0)=\"○\",\"\",\"《新規登録技術》\")","v":"エコボックス"},null,{"$f":"IF(VLOOKUP(R$1,仕様の整理!$C:$O,4,0)=\"NETIS掲載期間終了技術\",VLOOKUP(R$1,仕様の整理!$C:$O,2,0),VLOOKUP(R$1,仕様の整理!$C:$O,2,0)&\"（\"&VLOOKUP(R$1,仕様の整理!$C:$O,4,0)&\"）\")&IF(VLOOKUP(R$1,仕様の整理!$C:$O,5,0)=\"○\",\"\",\"《新規登録技術》\")","v":"エコボックス"},null,{"$f":"IF(VLOOKUP(T$1,仕様の整理!$C:$O,4,0)=\"NETIS掲載期間終了技術\",VLOOKUP(T$1,仕様の整理!$C:$O,2,0),VLOOKUP(T$1,仕様の整理!$C:$O,2,0)&\"（\"&VLOOKUP(T$1,仕様の整理!$C:$O,4,0)&\"）\")&IF(VLOOKUP(T$1,仕様の整理!$C:$O,5,0)=\"○\",\"\",\"《新規登録技術》\")","v":"SPブロック、SPグリーン、ウエストン"},null,{"$f":"IF(VLOOKUP(V$1,仕様の整理!$C:$O,4,0)=\"NETIS掲載期間終了技術\",VLOOKUP(V$1,仕様の整理!$C:$O,2,0),VLOOKUP(V$1,仕様の整理!$C:$O,2,0)&\"（\"&VLOOKUP(V$1,仕様の整理!$C:$O,4,0)&\"）\")&IF(VLOOKUP(V$1,仕様の整理!$C:$O,5,0)=\"○\",\"\",\"《新規登録技術》\")","v":"SPブロック、SPグリーン、ウエストン"},null,{"$f":"IF(VLOOKUP(X$1,仕様の整理!$C:$O,4,0)=\"NETIS掲載期間終了技術\",VLOOKUP(X$1,仕様の整理!$C:$O,2,0),VLOOKUP(X$1,仕様の整理!$C:$O,2,0)&\"（\"&VLOOKUP(X$1,仕様の整理!$C:$O,4,0)&\"）\")&IF(VLOOKUP(X$1,仕様の整理!$C:$O,5,0)=\"○\",\"\",\"《新規登録技術》\")","v":"うらかたくん〔HPB=ハーフプレキャストブロック〕"},null,{"$f":"IF(VLOOKUP(Z$1,仕様の整理!$C:$O,4,0)=\"NETIS掲載期間終了技術\",VLOOKUP(Z$1,仕様の整理!$C:$O,2,0),VLOOKUP(Z$1,仕様の整理!$C:$O,2,0)&\"（\"&VLOOKUP(Z$1,仕様の整理!$C:$O,4,0)&\"）\")&IF(VLOOKUP(Z$1,仕様の整理!$C:$O,5,0)=\"○\",\"\",\"《新規登録技術》\")","v":"うらかたくん〔HPB=ハーフプレキャストブロック〕"},null,{"$f":"IF(VLOOKUP(AB$1,仕様の整理!$C:$O,4,0)=\"NETIS掲載期間終了技術\",VLOOKUP(AB$1,仕様の整理!$C:$O,2,0),VLOOKUP(AB$1,仕様の整理!$C:$O,2,0)&\"（\"&VLOOKUP(AB$1,仕様の整理!$C:$O,4,0)&\"）\")&IF(VLOOKUP(AB$1,仕様の整理!$C:$O,5,0)=\"○\",\"\",\"《新規登録技術》\")","v":"Ｅウォール"},null,{"$f":"IF(VLOOKUP(AD$1,仕様の整理!$C:$O,4,0)=\"NETIS掲載期間終了技術\",VLOOKUP(AD$1,仕様の整理!$C:$O,2,0),VLOOKUP(AD$1,仕様の整理!$C:$O,2,0)&\"（\"&VLOOKUP(AD$1,仕様の整理!$C:$O,4,0)&\"）\")&IF(VLOOKUP(AD$1,仕様の整理!$C:$O,5,0)=\"○\",\"\",\"《新規登録技術》\")","v":"Ｅウォール"},null,{"$f":"IF(VLOOKUP(AF$1,仕様の整理!$C:$O,4,0)=\"NETIS掲載期間終了技術\",VLOOKUP(AF$1,仕様の整理!$C:$O,2,0),VLOOKUP(AF$1,仕様の整理!$C:$O,2,0)&\"（\"&VLOOKUP(AF$1,仕様の整理!$C:$O,4,0)&\"）\")&IF(VLOOKUP(AF$1,仕様の整理!$C:$O,5,0)=\"○\",\"\",\"《新規登録技術》\")","v":"NSSブロック"},null,{"$f":"IF(VLOOKUP(AH$1,仕様の整理!$C:$O,4,0)=\"NETIS掲載期間終了技術\",VLOOKUP(AH$1,仕様の整理!$C:$O,2,0),VLOOKUP(AH$1,仕様の整理!$C:$O,2,0)&\"（\"&VLOOKUP(AH$1,仕様の整理!$C:$O,4,0)&\"）\")&IF(VLOOKUP(AH$1,仕様の整理!$C:$O,5,0)=\"○\",\"\",\"《新規登録技術》\")","v":"箱型擁壁「フリーウォール・キャッスルウォール」"},null,{"$f":"IF(VLOOKUP(AJ$1,仕様の整理!$C:$O,4,0)=\"NETIS掲載期間終了技術\",VLOOKUP(AJ$1,仕様の整理!$C:$O,2,0),VLOOKUP(AJ$1,仕様の整理!$C:$O,2,0)&\"（\"&VLOOKUP(AJ$1,仕様の整理!$C:$O,4,0)&\"）\")&IF(VLOOKUP(AJ$1,仕様の整理!$C:$O,5,0)=\"○\",\"\",\"《新規登録技術》\")","v":"箱型擁壁「フリーウォール・キャッスルウォール」"},null,{"$f":"IF(VLOOKUP(AL$1,仕様の整理!$C:$O,4,0)=\"NETIS掲載期間終了技術\",VLOOKUP(AL$1,仕様の整理!$C:$O,2,0),VLOOKUP(AL$1,仕様の整理!$C:$O,2,0)&\"（\"&VLOOKUP(AL$1,仕様の整理!$C:$O,4,0)&\"）\")&IF(VLOOKUP(AL$1,仕様の整理!$C:$O,5,0)=\"○\",\"\",\"《新規登録技術》\")","v":"共和式大型積ブロック"},null,{"$f":"IF(VLOOKUP(AN$1,仕様の整理!$C:$O,4,0)=\"NETIS掲載期間終了技術\",VLOOKUP(AN$1,仕様の整理!$C:$O,2,0),VLOOKUP(AN$1,仕様の整理!$C:$O,2,0)&\"（\"&VLOOKUP(AN$1,仕様の整理!$C:$O,4,0)&\"）\")&IF(VLOOKUP(AN$1,仕様の整理!$C:$O,5,0)=\"○\",\"\",\"《新規登録技術》\")","v":"共和式大型積ブロック"},null,{"$f":"IF(VLOOKUP(AP$1,仕様の整理!$C:$O,4,0)=\"NETIS掲載期間終了技術\",VLOOKUP(AP$1,仕様の整理!$C:$O,2,0),VLOOKUP(AP$1,仕様の整理!$C:$O,2,0)&\"（\"&VLOOKUP(AP$1,仕様の整理!$C:$O,4,0)&\"）\")&IF(VLOOKUP(AP$1,仕様の整理!$C:$O,5,0)=\"○\",\"\",\"《新規登録技術》\")","v":"不等厚組立式ブロック（事後評価未実施技術）"},null,{"$f":"IF(VLOOKUP(AR$1,仕様の整理!$C:$O,4,0)=\"NETIS掲載期間終了技術\",VLOOKUP(AR$1,仕様の整理!$C:$O,2,0),VLOOKUP(AR$1,仕様の整理!$C:$O,2,0)&\"（\"&VLOOKUP(AR$1,仕様の整理!$C:$O,4,0)&\"）\")&IF(VLOOKUP(AR$1,仕様の整理!$C:$O,5,0)=\"○\",\"\",\"《新規登録技術》\")","v":"不等厚組立式ブロック（事後評価未実施技術）"}]
[null,"①","ＮＥＴＩＳ登録番号",null,null,{"$f":"IF(VLOOKUP(F$1,仕様の整理!$C:$K,4,0)=\"NETIS掲載期間終了技術\",\"NETIS掲載期間終了技術\",VLOOKUP(F$1,仕様の整理!$C:$K,3,0))","v":"QS-180011-VE"},null,{"$f":"IF(VLOOKUP(H$1,仕様の整理!$C:$K,4,0)=\"NETIS掲載期間終了技術\",\"NETIS掲載期間終了技術\",VLOOKUP(H$1,仕様の整理!$C:$K,3,0))","v":"SK-180013-A"},null,{"$f":"IF(VLOOKUP(J$1,仕様の整理!$C:$K,4,0)=\"NETIS掲載期間終了技術\",\"NETIS掲載期間終了技術\",VLOOKUP(J$1,仕様の整理!$C:$K,3,0))","v":"QS-180033-VR"},null,{"$f":"IF(VLOOKUP(L$1,仕様の整理!$C:$K,4,0)=\"NETIS掲載期間終了技術\",\"NETIS掲載期間終了技術\",VLOOKUP(L$1,仕様の整理!$C:$K,3,0))","v":"QS-180048-A"},null,{"$f":"IF(VLOOKUP(N$1,仕様の整理!$C:$K,4,0)=\"NETIS掲載期間終了技術\",\"NETIS掲載期間終了技術\",VLOOKUP(N$1,仕様の整理!$C:$K,3,0))","v":"KK-200032-A"},null,{"$f":"IF(VLOOKUP(P$1,仕様の整理!$C:$K,4,0)=\"NETIS掲載期間終了技術\",\"NETIS掲載期間終了技術\",VLOOKUP(P$1,仕様の整理!$C:$K,3,0))","v":"NETIS掲載期間終了技術"},null,{"$f":"IF(VLOOKUP(R$1,仕様の整理!$C:$K,4,0)=\"NETIS掲載期間終了技術\",\"NETIS掲載期間終了技術\",VLOOKUP(R$1,仕様の整理!$C:$K,3,0))","v":"NETIS掲載期間終了技術"},null,{"$f":"IF(VLOOKUP(T$1,仕様の整理!$C:$K,4,0)=\"NETIS掲載期間終了技術\",\"NETIS掲載期間終了技術\",VLOOKUP(T$1,仕様の整理!$C:$K,3,0))","v":"NETIS掲載期間終了技術"},null,{"$f":"IF(VLOOKUP(V$1,仕様の整理!$C:$K,4,0)=\"NETIS掲載期間終了技術\",\"NETIS掲載期間終了技術\",VLOOKUP(V$1,仕様の整理!$C:$K,3,0))","v":"NETIS掲載期間終了技術"},null,{"$f":"IF(VLOOKUP(X$1,仕様の整理!$C:$K,4,0)=\"NETIS掲載期間終了技術\",\"NETIS掲載期間終了技術\",VLOOKUP(X$1,仕様の整理!$C:$K,3,0))","v":"NETIS掲載期間終了技術"},null,{"$f":"IF(VLOOKUP(Z$1,仕様の整理!$C:$K,4,0)=\"NETIS掲載期間終了技術\",\"NETIS掲載期間終了技術\",VLOOKUP(Z$1,仕様の整理!$C:$K,3,0))","v":"NETIS掲載期間終了技術"},null,{"$f":"IF(VLOOKUP(AB$1,仕様の整理!$C:$K,4,0)=\"NETIS掲載期間終了技術\",\"NETIS掲載期間終了技術\",VLOOKUP(AB$1,仕様の整理!$C:$K,3,0))","v":"NETIS掲載期間終了技術"},null,{"$f":"IF(VLOOKUP(AD$1,仕様の整理!$C:$K,4,0)=\"NETIS掲載期間終了技術\",\"NETIS掲載期間終了技術\",VLOOKUP(AD$1,仕様の整理!$C:$K,3,0))","v":"NETIS掲載期間終了技術"},null,{"$f":"IF(VLOOKUP(AF$1,仕様の整理!$C:$K,4,0)=\"NETIS掲載期間終了技術\",\"NETIS掲載期間終了技術\",VLOOKUP(AF$1,仕様の整理!$C:$K,3,0))","v":"NETIS掲載期間終了技術"},null,{"$f":"IF(VLOOKUP(AH$1,仕様の整理!$C:$K,4,0)=\"NETIS掲載期間終了技術\",\"NETIS掲載期間終了技術\",VLOOKUP(AH$1,仕様の整理!$C:$K,3,0))","v":"NETIS掲載期間終了技術"},null,{"$f":"IF(VLOOKUP(AJ$1,仕様の整理!$C:$K,4,0)=\"NETIS掲載期間終了技術\",\"NETIS掲載期間終了技術\",VLOOKUP(AJ$1,仕様の整理!$C:$K,3,0))","v":"NETIS掲載期間終了技術"},null,{"$f":"IF(VLOOKUP(AL$1,仕様の整理!$C:$K,4,0)=\"NETIS掲載期間終了技術\",\"NETIS掲載期間終了技術\",VLOOKUP(AL$1,仕様の整理!$C:$K,3,0))","v":"NETIS掲載期間終了技術"},null,{"$f":"IF(VLOOKUP(AN$1,仕様の整理!$C:$K,4,0)=\"NETIS掲載期間終了技術\",\"NETIS掲載期間終了技術\",VLOOKUP(AN$1,仕様の整理!$C:$K,3,0))","v":"NETIS掲載期間終了技術"},null,{"$f":"IF(VLOOKUP(AP$1,仕様の整理!$C:$K,4,0)=\"NETIS掲載期間終了技術\",\"NETIS掲載期間終了技術\",VLOOKUP(AP$1,仕様の整理!$C:$K,3,0))","v":"SK-210001-A"},null,{"$f":"IF(VLOOKUP(AR$1,仕様の整理!$C:$K,4,0)=\"NETIS掲載期間終了技術\",\"NETIS掲載期間終了技術\",VLOOKUP(AR$1,仕様の整理!$C:$K,3,0))","v":"SK-210001-A"}]
[null,"②","技術の位置付け（有用な新技術）",null,null,"活用促進",null,"-",null,"-",null,"-",null,"-",null,"評価済み",null,"評価済み",null,"評価済み",null,"評価済み",null,"評価済み",null,"評価済み",null,"評価済み",null,"評価済み",null,"評価済み",null,"評価済み",null,"評価済み",null,"評価済み",null,"評価済み",null,"-",null,"-"]
[null,"③","開発者（本社が存在する都道府県）",null,null,"中里産業株式会社(福岡県）",null,"株式会社総合開発（香川県）",null,"東栄商興株式会社（福岡県）、九州大学島谷幸宏研究室（福岡県）、九州大学安福規之研究室（福岡県）",null,"株式会社三州コンクリート工業（大分県）",null,"草竹コンクリート工業株式会社（奈良県）",null,"【エコボックス(標準)】ランデス株式会社（岡山県）・キョクトウ高宮株式会社 （広島県）",null,"【エコボックス(標準)】ランデス株式会社（岡山県）・キョクトウ高宮株式会社 （広島県）",null,"ケイコン株式会社（京都府）",null,"ケイコン株式会社（京都府）",null,"ケイコン株式会社（京都府）",null,"ケイコン株式会社（京都府）",null,"日本興業株式会社（香川県）",null,"日本興業株式会社（香川県）",null,"協立コンクリート工業株式会社（北海道、東京都）、ヒロセ補強土株式会社（東京都）、株式会社長大（東京都）",null,"昭和コンクリート工業株式会社（岐阜県）",null,"昭和コンクリート工業株式会社（岐阜県）",null,"共和コンクリート工業株式会社（東京都、北海道）",null,"共和コンクリート工業株式会社（東京都、北海道）",null,"四万十コンクリート株式会社（高知県）",null,"四万十コンクリート株式会社（高知県）"]
[null,"④","開発者における九州地方との関連性（九州登録九州本社：◎、\n九州外登録九州本社：○、九州に共同開発者有り：△、その他：－）",null,null,"◎",null,"-",null,"◎",null,"◎",null,"-",null,"-",null,"-",null,"-",null,"-",null,"-",null,"-",null,"-",null,"-",null,"-",null,"-",null,"-",null,"-",null,"-",null,"-",null,"-"]
[null,"⑤","九州地方への機能性（九州地方に支店等を有する場合：○、その他：－）",null,null,"-",null,"〇（九州地方に支店等を有する）",null,"-",null,"-",null,"○（九州地方に支店等を有する）",null,"-",null,"-",null,"○（九州地方に支店を有する）",null,"○（九州地方に支店を有する）",null,"○（九州地方に支店を有する）",null,"○（九州地方に支店を有する）",null,"-",null,"-",null,"○（九州地方に支店を有する）",null,"○（九州地方に支店を有する）",null,"○（九州地方に支店を有する）",null,"○（九州地方に支店等を有する）",null,"○（九州地方に支店等を有する）",null,"-",null,"-"]
[null,"⑥","技術概要",null,null,"　本技術は、盛土及び切土の土留において0.5㎡/個のブロックを使用し、基礎ブロックもプレキャスト化することにより、所定勾配の擁壁を構築する際の作業効率の向上及び、省力化を目的とした製品である。",null,"　本技術は、中詰も胴込めもない金具連結のみ超省力化ブロックで、従来はコンクリートブロック練積で対応していた。本技術の活用により、施工の省力化や景観性の向上,周辺環境への影響抑制などといった効果が期待できる。",null,"　多自然型護岸ブロック工において、河川の生き物に棲み処を提供でき滑動抵抗性等に優れた水平空積ブロックで、従来は、環境保全型ブロックで対応していた。栗石や抵抗板による噛み合わせ抵抗が確保できるため、滑動抵抗性に優れた大型空積ブロックが施工可能となる。",null,"　胴込コンクリートの打設が不要な大型ブロックである。控長が35～50cmまで可能で、従来の間知ブロック積に対応でき、省人化が期待できる製品である。施工時は差筋で製品が自立するので安定し、作業効率の向上、工期短縮に繋がる。",null,"　本技術は、擁壁工においてプレキャスト製で自立構造式の大型の積みブロック(0.5m2/個)と基礎ブロックの製品技術であり、従来はコンクリートブロック積工であった。本技術の活用により、経済性・施工性の向上、社会環境への影響抑制および工程短縮が期待できる。",null,"　本技術は、中空型の箱を階段状、もたれ状及び直積み状に積み上げ擁壁を構築する技術である。従来は現場打ち重力式やもたれ式擁壁等で対応していた。ブロック内部に砕石や残土、コンクリート瓦礫を充填して壁体重量を増加させ5.0m以上の大型ブロック積み擁壁が構築できる。 ",null,"　本技術は、中空型の箱を階段状、もたれ状及び直積み状に積み上げ擁壁を構築する技術である。従来は現場打ち重力式やもたれ式擁壁等で対応していた。ブロック内部に砕石や残土、コンクリート瓦礫を充填して壁体重量を増加させ5.0m以上の大型ブロック積み擁壁が構築できる。 ",null,"　前壁に専用の勾配(1:0.3,0.4,0.5)を付けており、水平に据付けるだけで所定の勾配を確保する事が可能な(自立性が高い)大型ブロック。安定計算により、控長さや空積・練積といった胴込材の種類を決定するので、より経済的な擁壁を構築できる。 ",null,"　前壁に専用の勾配(1:0.3,0.4,0.5)を付けており、水平に据付けるだけで所定の勾配を確保する事が可能な(自立性が高い)大型ブロック。安定計算により、控長さや空積・練積といった胴込材の種類を決定するので、より経済的な擁壁を構築できる。 ",null,"　プレキャストブロック(ハーフプレキャスト)と専用裏型枠を擁壁断面の控長さに応じたセパレータで連結、それを段積みして練積にすることで擁壁の構築をする技術である。裏型枠は残存が可能なので、型枠の組みばらし工程が省略され、工期の短縮につながる。",null,"　プレキャストブロック(ハーフプレキャスト)と専用裏型枠を擁壁断面の控長さに応じたセパレータで連結、それを段積みして練積にすることで擁壁の構築をする技術である。裏型枠は残存が可能なので、型枠の組みばらし工程が省略され、工期の短縮につながる。",null,"　本技術は大型ブロック積み擁壁で、従来は現場打ちのもたれ式擁壁で対応していた。本技術の活用により、災害復旧等対応が急を要する場合に活用が期待できる。 ",null,"　本技術は大型ブロック積み擁壁で、従来は現場打ちのもたれ式擁壁で対応していた。本技術の活用により、災害復旧等対応が急を要する場合に活用が期待できる。 ",null,"　本技術は、鉄筋コンクリートでブロック間を結合した大型ブロック積み擁壁で、従来は、現場打ちもたれ式擁壁か大型ブロックの練積み構造で対応していました。本技術の活用により、経済性および安定性の向上が期待できます。",null,"　「箱型擁壁」は、箱型形状をした底版の無いプレキャスト枠材(以下箱体と言う)と単粒度砕石を用いた中詰め材および裏込め材からなり、箱体に中詰め材および裏込め材を締め固めながら階段状に積上げる擁壁です。地盤の変形に対しフレキシブルに追随することが可能です。 ",null,"　「箱型擁壁」は、箱型形状をした底版の無いプレキャスト枠材(以下箱体と言う)と単粒度砕石を用いた中詰め材および裏込め材からなり、箱体に中詰め材および裏込め材を締め固めながら階段状に積上げる擁壁です。地盤の変形に対しフレキシブルに追随することが可能です。 ",null,"　本技術は、水平積(水平設置で5分勾配となる)の大型積ブロックにより、擁壁を構築する技術で、従来の大型積ブロックは所定勾配に傾けて施工するタイプであった。本技術の活用により、作業効率が上がり、経済性の向上が可能。また、製品原材料にリサイク材も使用可能。 ",null,"　本技術は、水平積(水平設置で5分勾配となる)の大型積ブロックにより、擁壁を構築する技術で、従来の大型積ブロックは所定勾配に傾けて施工するタイプであった。本技術の活用により、作業効率が上がり、経済性の向上が可能。また、製品原材料にリサイク材も使用可能。 ",null,"本技術は、様々な形状を持つコンクリート擁壁に対応するため、法勾配や水平幅を自在に確保できるプレキャストコンクリート製品である。従来の型枠組立・撤去の反復作業での擁壁構築と違い、設置積上げ構築となり、工期短縮や、省力化が図れる。",null,"本技術は、様々な形状を持つコンクリート擁壁に対応するため、法勾配や水平幅を自在に確保できるプレキャストコンクリート製品である。従来の型枠組立・撤去の反復作業での擁壁構築と違い、設置積上げ構築となり、工期短縮や、省力化が図れる。"]
[null,"⑦","概要図"]
[null,"⑧","施工条件・適用条件等\n※1.ブロック1個当りの形状、重量は参考として標準部材を記載している。","種類",null,"練積みブロック",null,"空積ブロック、【練積ブロック】",null,"空積ブロック",null,"練積ブロック",null,"【練積ブロック】",null,"【練積ブロック】",null,"【練積ブロック】",null,"練積ブロック",null,"練積ブロック",null,"練積ブロック",null,"練積ブロック",null,"【練積ブロック】",null,"【練積ブロック】",null,"【練積ブロック】",null,"【空積ブロック】",null,"【空積ブロック】",null,"【練積ブロック】",null,"【練積ブロック】",null,"【練積タイプ】",null,"【練積タイプ】"]
[null,null,null,"ブロック1個当りの形状（寸法：幅×法長×控長（ｍｍ））（※1）",null,"AB-Ⅰ：1250×400×350mm",null,"空積タイプ：1248×400×570mm、練積タイプ：1248×400×480mm",null,"【本体ブロック：2000×500×700mm、ベースブロック：2000×250×450mm】",null,"350A：1500×750×350mm、350B：1500×750×350mm、500A：1500×750×500mm、500B：1500×750×500mm",null,"A：1000×500×350mm、B：500×500×350mm、A根：1000×250×350mm",null,"750型～4000型：1500×1000×750ｍｍ～1500×1000×4000mm",null,"750型～4000型：1500×1000×750ｍｍ～1500×1000×4000mm",null,"SPブロックⅢ-1～3型A型：2000×1000×835～900mm、SPブロックⅢ-1～3型B型：1000×1000×835～900mm、SPブロックⅢ-1～3型C型：2000×500×835～900mm、SPブロックⅢ-1～3型D型：1000×500×835～900mm",null,"SPブロックⅢ-1～3型A型：2000×1000×835～900mm、SPブロックⅢ-1～3型B型：1000×1000×835～900mm、SPブロックⅢ-1～3型C型：2000×500×835～900mm、SPブロックⅢ-1～3型D型：1000×500×835～900mm",null,"A型：2000×1000×700mm、B型：1000×1000×700mm、C型：2000×500×700mm、D型：1000×500×700mm",null,"A型：2000×1000×700mm、B型：1000×1000×700mm、C型：2000×500×700mm、D型：1000×500×700mm",null,"750タイプ：2000×1118×750mm、1000タイプ：2000×1118×1000mm、1250タイプ：2000×1118×1250mm、1500タイプ：2000×1118×1500mm、2000タイプ：2000×1118×2000mm",null,"750タイプ：2000×1118×750mm、1000タイプ：2000×1118×1000mm、1250タイプ：2000×1118×1250mm、1500タイプ：2000×1118×1500mm、2000タイプ：2000×1118×2000mm",null,"【1s型-A～3型-AH：1995×1077～1616×878～1435mm、1s型-B～4型-BH：995×1077～1616×878～1714mm】",null,"A型：2000×1000×1250mm、Ah型：2000×500×1250mm、B型：1500×1000×1250mm、Bh型：1500×500×1250mm",null,"A型：2000×1000×1250mm、Ah型：2000×500×1250mm、B型：1500×1000×1250mm、Bh型：1500×500×1250mm",null,"【ホライズンⅡ：1500×1118×750～2500mm、ホライズンF：1500×1044×500mm、ホライズンF(洗出)：1000×1044×500mm、サンエスⅠ型：998×500×350mm、ポーラスサンエス：998×500×350mm、石涼：1000×1600×350mm】",null,"【ホライズンⅡ：1500×1118×750～2500mm、ホライズンF：1500×1044×500mm、ホライズンF(洗出)：1000×1044×500mm、サンエスⅠ型：998×500×350mm、ポーラスサンエス：998×500×350mm、石涼：1000×1600×350mm】",null,"【650型A～6000型A：2000×1118×650～6000】",null,"【650型A～6000型A：2000×1118×650～6000】"]
[null,null,null,"ブロック1個当りの重量（※1）",null,"AB-Ⅰ：130kg",null,"空積ブロック：469kg・練積ブロック：332kg",null,"【本体ブロック：403kg、ベースブロック：185kg】",null,"350A：906kg、350B：453kg、500A：1294kg、500B：647kg",null,"A：188㎏、B：94㎏、A根：106㎏",null,"750型～4000型：標準タイプ980～2585㎏、擬石タイプ1070～2675kg、環境保全タイプ1050～2655kg、魚巣はんざきタイプ1040～2645kg",null,"750型～4000型：標準タイプ980～2585㎏、擬石タイプ1070～2675kg、環境保全タイプ1050～2655kg、魚巣はんざきタイプ1040～2645kg",null,"SPⅢ-1～3型A型：1102～1182kg、SPⅢ-1～3型B型：679～710kg、SPⅢ-1～3型C型：710～740kg、SPⅢ-1～3型D型：428～439kg",null,"SPⅢ-1～3型A型：1102～1182kg、SPⅢ-1～3型B型：679～710kg、SPⅢ-1～3型C型：710～740kg、SPⅢ-1～3型D型：428～439kg",null,"A型：674kg、B型：362kg、C型：402kg、D型：216kg",null,"A型：674kg、B型：362kg、C型：402kg、D型：216kg",null,"750タイプ：1350kg、1000タイプ：1635kg、1250タイプ：1965kg、1500タイプ：1677kg、2000タイプ：2236kg",null,"750タイプ：1350kg、1000タイプ：1635kg、1250タイプ：1965kg、1500タイプ：1677kg、2000タイプ：2236kg",null,"【1s型-A～3型-AH：1890～2740kg、1s型-B～4型-BH：940～1560kg】",null,"・石積み模様：A型：1304Kg、B型：1028Kg、Ah型：784Kg、Bh型：612Kg　・陰影模様：A型：1236Kg、B型：976Kg、Ah型：750Kg、Bh型：587Kg",null,"・石積み模様：A型：1304Kg、B型：1028Kg、Ah型：784Kg、Bh型：612Kg　・陰影模様：A型：1236Kg、B型：976Kg、Ah型：750Kg、Bh型：587Kg",null,"【ホライズンⅡ：1,336～2,041kg、ホライズンF：548kg、ホライズンF(洗出)：548kg、サンエスⅠ型：201kg、ポーラスサンエス：177kg、石涼：343kg】",null,"【ホライズンⅡ：1,336～2,041kg、ホライズンF：548kg、ホライズンF(洗出)：548kg、サンエスⅠ型：201kg、ポーラスサンエス：177kg、石涼：343kg】",null,"【650型A～6000型A：1183～1400kg】",null,"【650型A～6000型A：1183～1400kg】"]
[null,null,null,"表面模様",null,"【擬石模様】",null,"ポーラス【水棲生物による植生】",null,"はつり模様【本体ブロック：擬石模様、ベースブロック：滑面模様】",null,"擬石模様",null,"擬石模様",null,"【山割り模様、擬石模様】",null,"【山割り模様、擬石模様】",null,"滑面模様、【擬石模様、粗面模様】",null,"滑面模様、【擬石模様、粗面模様】",null,"額縁（滑面）、額縁はつり（粗面）、石乱積み、ストーン",null,"額縁（滑面）、額縁はつり（粗面）、石乱積み、ストーン",null,"擬石模様",null,"擬石模様",null,"【擬石模様】",null,"石積み模様、陰影模様",null,"石積み模様、陰影模様",null,"擬石模様、【ポーラスサンエス：ポーラス】",null,"擬石模様、【ポーラスサンエス：ポーラス】",null,"【擬石模様】",null,"【擬石模様】"]
[null,null,null,"適用可能な範囲",null,"　・壁面勾配：（切土部、盛土部）1:0.5以下、最大壁高：(切土部）7.0m以下、（盛土部）5.0m以下、【最小曲線半径16m以上】",null,"壁面勾配：レベル積み1:0.3～1:0.5、勾配積み1:0.3～1:0.6、最大壁高：5ｍ以下、最小曲線半径5.0mまで",null,"壁面勾配：1:0.3～1：0.5、最大壁高：6.0m以下、最小曲線半径:40m以上",null,"壁面勾配：1:0.3～1:0.5、最大壁高：5.0m以下、最小曲線半径15ｍ以上",null,"壁面勾配：1:0.3～1:0.5、最大壁高：7m以下",null,"壁面勾配：直壁～1：0.3、1：0.4、1:0.5、最大壁高： 10.0m以下、最小曲線半径30m以上",null,"壁面勾配：直壁～1：0.3、1：0.4、1:0.5、最大壁高： 10.0m以下、最小曲線半径30m以上",null,"【壁面勾配：1:0.3～1:0.5、最大壁高：15m以下、最小曲線半径5～10m程度】",null,"【壁面勾配：1:0.3～1:0.5、最大壁高：15m以下、最小曲線半径5～10m程度】",null,"壁面勾配：1:0.5、最大壁高：15m以下、【最小曲線半径5～10m程度】",null,"壁面勾配：1:0.5、最大壁高：15m以下、【最小曲線半径5～10m程度】",null,"壁面勾配：1:0.5、最大壁高：15m以下、【最小曲線半径50m以上】",null,"壁面勾配：1:0.5、最大壁高：15m以下、【最小曲線半径50m以上】",null,"壁面勾配： 1:0.4～1:0.5、最大壁高：12m以下",null,"壁面勾配： 1:0.3～1:1.0、最大壁高：21m以下",null,"壁面勾配： 1:0.3～1:1.0、最大壁高：21m以下",null,"壁面勾配： 1:0.3～1:0.5、最大壁高：15.0m以下、【最小曲線半径30m以上】",null,"壁面勾配： 1:0.3～1:0.5、最大壁高：15.0m以下、【最小曲線半径30m以上】",null,"・壁面勾配：直壁～1:1.0、最大壁高：10ｍ以下、【最小曲線半径20m程度】",null,"・壁面勾配：直壁～1:1.0、最大壁高：10ｍ以下、【最小曲線半径20m程度】"]
[null,null,null,"ブロック間の結合形式",null,"胴込めコンクリート",null,"連結金具の使用、【突起によるかみ合わせ】",null,"ブロックの上下境界部に抵抗板を配置し、ブロック側壁間に凹部空間を形成した。【胴込め栗石と栗石及び抵抗板との嚙み合わせ】",null,"・ブロックが自立するようブロック突起を噛み合わせ、さらにブロック上側に差筋を使用　【・連結金具の使用　・横結合は継ぎ目をモルタル充填】",null,"胴込めコンクリート",null,"胴込めコンクリート",null,"胴込めコンクリート",null,"胴込めコンクリート",null,"胴込めコンクリート",null,"胴込めコンクリート",null,"胴込めコンクリート",null,"胴込めコンクリート",null,"胴込めコンクリート",null,"【縦貫鉄筋＋中詰めコンクリートにより連結】",null,"【単粒度砕石によるかみ合わせ】",null,"【単粒度砕石によるかみ合わせ】",null,"胴込めコンクリート",null,"胴込めコンクリート",null,"胴込コンクリート",null,"胴込コンクリート"]
[null,null,null,"基礎工の形式",null,"プレキャスト",null,"【現場打ち】",null,"【・プレキャスト　・基礎底部のクラッシャーランを現場コンクリ－トに換えることも可能】",null,"プレキャスト",null,"プレキャスト",null,"【現場打ち】",null,"【現場打ち】",null,"【現場打ち】",null,"【現場打ち】",null,"【現場打ち】",null,"【現場打ち】",null,"【現場打ち】",null,"【現場打ち】",null,"現場打ち【プレキャスト】",null,"単粒度砕石(S-40前後)、割栗石(φ50～150)",null,"単粒度砕石(S-40前後)、割栗石(φ50～150)",null,"【現場打ち、プレキャスト】",null,"【現場打ち、プレキャスト】",null,"【現場打ち、プレキャスト】",null,"【現場打ち、プレキャスト】"]
[null,null,null,"設計方法",null,"【ブロック積擁壁に準ずる、もたれ式擁壁に準ずる】",null,"【ブロック積擁壁に準ずる】",null,"【・もたれ式擁壁に準ずる　・護岸力学設計法】",null,"【ブロック積擁壁に準ずる】",null,"【ブロック積擁壁に準ずる】",null,"もたれ式擁壁に準ずる",null,"もたれ式擁壁に準ずる",null,"【もたれ式擁壁に準ずる】",null,"【もたれ式擁壁に準ずる】",null,"もたれ式擁壁に準ずる",null,"もたれ式擁壁に準ずる",null,"【ブロック積・もたれ式擁壁に準ずる】",null,"【ブロック積・もたれ式擁壁に準ずる】",null,"【もたれ式擁壁に準ずる】",null,"【もたれ式擁壁に準ずる】",null,"【もたれ式擁壁に準ずる】",null,"【ブロック積擁壁、もたれ式擁壁に準ずる】",null,"【ブロック積擁壁、もたれ式擁壁に準ずる】",null,"【もたれ式擁壁に準ずる】",null,"【もたれ式擁壁に準ずる】"]
[null,null,null,"護岸に用いる場合の適応性",null,"【可（設計流速8m/s以下）】",null,"可",null,"可（設計流速8m/s以下）",null,"可（設計流速4～8m/s以下）",null,"【可】",null,"可【（設計流速8m/s以下）】",null,"可【（設計流速8m/s以下）】",null,"【可】",null,"【可】",null,"可",null,"可",null,"【可（設計流速8m/s以下）】",null,"【可（設計流速8m/s以下）】",null,"【可（設計流速8m/s以下）】",null,"【不可】",null,"【不可】",null,"可【（設計流速8m/s以下）】",null,"可【（設計流速8m/s以下）】",null,"可【設計流速8m/s以下】",null,"可【設計流速8m/s以下】"]
[null,"⑨","比較する従来技術",null,null,"コンクリートブロック積擁壁",null,"間知ブロック積み工(150kg/個未満)",null,"環境保全型ブロック",null,"コンクリートブロック積(間知ブロック)",null,"コンクリートブロック積工",null,"現場打ちもたれ式擁壁",null,"現場打ちもたれ式擁壁",null,"もたれ式擁壁",null,"もたれ式擁壁",null,"もたれ式擁壁(壁高h=6.9m)",null,"もたれ式擁壁(壁高h=6.9m)",null,"もたれ式擁壁(現場打ち)",null,"もたれ式擁壁(現場打ち)",null,"もたれ式擁壁(現場打ち)",null,"大型ブロック積擁壁",null,"大型ブロック積擁壁",null,"コンクリートブロック積(張)工(大型間知ブロック)",null,"コンクリートブロック積(張)工(大型間知ブロック)",null,"型枠工法による現場打擁壁",null,"型枠工法による現場打擁壁"]
["評価情報","⑩","評価基準","項目",null,"最新の活用効果評価結果,所見",null,"最新の活用効果評価結果,所見",null,"最新の活用効果評価結果,所見",null,"最新の活用効果評価結果,所見",null,"最新の活用効果評価結果,所見",null,"最新の活用効果評価結果,所見",null,"最新の活用効果評価結果,所見",null,"最新の活用効果評価結果,所見",null,"最新の活用効果評価結果,所見",null,"最新の活用効果評価結果,所見",null,"最新の活用効果評価結果,所見",null,"最新の活用効果評価結果,所見",null,"最新の活用効果評価結果,所見",null,"最新の活用効果評価結果,所見",null,"最新の活用効果評価結果,所見",null,"最新の活用効果評価結果,所見",null,"最新の活用効果評価結果,所見",null,"最新の活用効果評価結果,所見",null,"最新の活用効果評価結果,所見",null,"最新の活用効果評価結果,所見"]
[null,null,"・A：従来技術より極めて優れる\n・B：従来技術より優れる\n・C：従来技術と同等\n・D：従来技術より劣る","経済性",null,"C：・本技術の経済性については、作業員人員は削減できるが、間知ブロックよりやや高価であるため、従来技術と同等である。",null,"-",null,"-",null,"-",null,"-",null,"C：本技術の経済性については、従来技術に対して同等である。",null,"C：本技術の経済性については、従来技術に対して同等である。",null,"C：曲線部での場合は、ブロック間の間詰め処理が必要となっている。",null,"C：曲線部での場合は、ブロック間の間詰め処理が必要となっている。",null,"B：現地での裏型枠施工が簡易となるため、型枠の組立・解体費用を低減できることから、従来技術のコストに対して優れる。",null,"B：現地での裏型枠施工が簡易となるため、型枠の組立・解体費用を低減できることから、従来技術のコストに対して優れる。",null,"C：-",null,"C：-",null,"C：背面掘削量や現地でのコンクリート打設量を低減できることから、従来技術のコストに対して優れる。",null,"B：本技術の経済性については、従来技術のコストに対して、優れている。",null,"B：本技術の経済性については、従来技術のコストに対して、優れている。",null,"C：本技術の経済性については従来技術に対して同等である。",null,"C：本技術の経済性については従来技術に対して同等である。",null,"-",null,"-"]
[null,null,null,"工程",null,"B：・本技術の工程については、ブロックの大型化により1日の施工量が増えることから工期の短縮が図れるため、従来技術に対して優れる。",null,"-",null,"-",null,"-",null,"-",null,"B：箱型の大型ブロックの活用により、型枠の組立・解体作業が軽減され、足場の設置・撤去が不要となることから、工程の短縮が図れる。",null,"B：箱型の大型ブロックの活用により、型枠の組立・解体作業が軽減され、足場の設置・撤去が不要となることから、工程の短縮が図れる。",null,"B：-",null,"B：-",null,"B：裏型枠の組立作業が簡便で、裏型枠が残存可能なことから解体作業も不要となり、工程の短縮が図れる。",null,"B：裏型枠の組立作業が簡便で、裏型枠が残存可能なことから解体作業も不要となり、工程の短縮が図れる。",null,"B：・経済性は良くないが、施工性もよく、工期短縮には効果的である。",null,"B：・経済性は良くないが、施工性もよく、工期短縮には効果的である。",null,"B：胴込め及び裏込めコンクリートを使用しないことから、施工後の養生時間が不要となるため、工程の短縮が図れる。",null,"B：現場打ちコンクリートの使用が少ないため、天候の影響を受けにくく、養生時間が必要ないため、工程の短縮が図られている。",null,"B：現場打ちコンクリートの使用が少ないため、天候の影響を受けにくく、養生時間が必要ないため、工程の短縮が図られている。",null,"B：ブロック1個当りの面積が大きく施工時にブロックが自立するので、作業効率が向上し工程の短縮が図れるので、本技術の工程については従来技術に対して優れている。",null,"B：ブロック1個当りの面積が大きく施工時にブロックが自立するので、作業効率が向上し工程の短縮が図れるので、本技術の工程については従来技術に対して優れている。",null,"-",null,"-"]
[null,null,null,"品質・出来形",null,"C：・本技術の品質・出来形については、従来技術と同等である。",null,"-",null,"-",null,"-",null,"-",null,"B：二次製品のため品質にばらつきがなく、品質・出来形に優れる。",null,"B：二次製品のため品質にばらつきがなく、品質・出来形に優れる。",null,"B：-",null,"B：-",null,"B：二次製品のため品質にばらつきがなく、品質・出来形に優れる。",null,"B：二次製品のため品質にばらつきがなく、品質・出来形に優れる。",null,"B：-",null,"B：-",null,"B：二次製品のため品質にばらつきがなく、品質・出来形に優れる。",null,"B：二次製品のため現場での管理項目が減少する。",null,"B：二次製品のため現場での管理項目が減少する。",null,"C：本技術の品質・出来形については従来技術に対して同等である。",null,"C：本技術の品質・出来形については従来技術に対して同等である。",null,"-",null,"-"]
[null,null,null,"安全性",null,"C：・本技術の安全性については、従来技術と同等である。",null,"-",null,"-",null,"-",null,"-",null,"C：本技術の安全性については、従来技術に対して同等である。",null,"C：本技術の安全性については、従来技術に対して同等である。",null,"B：-",null,"B：-",null,"B：現地での型枠作業が簡便で、狭隘な擁壁背面での作業が低減されるため、安全性に優れる。",null,"B：現地での型枠作業が簡便で、狭隘な擁壁背面での作業が低減されるため、安全性に優れる。",null,"C：-",null,"C：-",null,"C：本技術の安全性については、従来技術に対して同等である。",null,"C：擁壁前面が階段状であるため、落下事故のリスクが減少する。",null,"C：擁壁前面が階段状であるため、落下事故のリスクが減少する。",null,"C：ブロックが自立するので作業の安全性は向上するが、重機作業を伴うので、本技術の安全性については従来技術に対して同等である。",null,"C：ブロックが自立するので作業の安全性は向上するが、重機作業を伴うので、本技術の安全性については従来技術に対して同等である。",null,"-",null,"-"]
[null,null,null,"施工性",null,"B：・本技術の施工性については、自立タイプであるため据付作業が容易となり、従来技術に対して優れる。",null,"-",null,"-",null,"-",null,"-",null,"C：主な作業はプレキャスト製品の据付けであり、熟練作業が軽減されるため、施工性の向上が図れるが、評価は同等となった。",null,"B：主な作業はプレキャスト製品の据付けであり、熟練作業が軽減されるため、施工性の向上が図れるが、評価は同等となった。",null,"B：天端コンクリート、妻部の処理等に足場が発生し、仮設工の減少とならない場合がある。",null,"B：天端コンクリート、妻部の処理等に足場が発生し、仮設工の減少とならない場合がある。",null,"B：現地での型枠作業が簡便で、熟練工を必要としないことから、施工性に優れる。",null,"B：現地での型枠作業が簡便で、熟練工を必要としないことから、施工性に優れる。",null,"B：・経済性は良くないが、施工性もよく、工期短縮には効果的である。",null,"B：-",null,"C：プレキャスト化に伴う省力化により、施工性に優れる。",null,"B：ブロック製品の据付、裏込砕石の締固め作業は、熟練工に依存しないため、施工性の向上が図られている。",null,"B：ブロック製品の据付、裏込砕石の締固め作業は、熟練工に依存しないため、施工性の向上が図られている。",null,"C：ブロック1個当りの面積が大きく、施工時にブロックが自立するので、本技術の施工性については従来技術に対して優れる。",null,"C：ブロック1個当りの面積が大きく、施工時にブロックが自立するので、本技術の施工性については従来技術に対して優れる。",null,"-",null,"-"]
[null,null,null,"環境",null,"B：・本技術の環境については、周辺景観に配慮した自然石面を採用しているため、従来技術に対して優れる。",null,"-",null,"-",null,"-",null,"-",null,"C：使用する型枠材量が少なくなり産業廃棄物排出量を抑制できることから、環境面での向上が図れるが、評価は同等となった。",null,"C：使用する型枠材量が少なくなり産業廃棄物排出量を抑制できることから、環境面での向上が図れるが、評価は同等となった。",null,"C：-",null,"C：-",null,"C：型枠材等が不要となり産業廃棄物排出量を抑制できることから、環境面での向上が図れるが、評価は同等となった。",null,"C：型枠材等が不要となり産業廃棄物排出量を抑制できることから、環境面での向上が図れるが、評価は同等となった。",null,"B：-",null,"B：-",null,"C：本技術の環境については、従来技術に対して同等である。",null,"C：-",null,"C：-",null,"C：本技術の環境については従来技術に対して同等である。",null,"C：本技術の環境については従来技術に対して同等である。",null,"-",null,"-"]
[null,null,null,"総合評価",null,"B：-",null,"-",null,"-",null,"-",null,"-",null,"C：-",null,"C：-",null,"C：-",null,"C：-",null,"C：-",null,"C：-",null,"B：・留意事項：ブロック自体が大きいので重ね積みには注意が必要である。",null,"B：・留意事項：ブロック自体が大きいので重ね積みには注意が必要である。",null,"C：留意事項：基礎コンクリートから立ち上がる縦貫鉄筋の設置精度を確保すること。",null,"B：-",null,"B：-",null,"C：曲線半径の小さい護岸等を含む小規模河川への適用は困難である。",null,"C：曲線半径の小さい護岸等を含む小規模河川への適用は困難である。",null,"-",null,"-"]
["統一した従来技術",null,null,null,null,"大型ブロック積",null,"大型ブロック積",null,"大型ブロック積",null,"大型ブロック積",null,"大型ブロック積",null,"大型ブロック積",null,"大型ブロック積",null,"大型ブロック積",null,"大型ブロック積",null,"大型ブロック積",null,"大型ブロック積",null,"大型ブロック積",null,"大型ブロック積",null,"大型ブロック積",null,"大型ブロック積",null,"大型ブロック積",null,"大型ブロック積",null,"大型ブロック積",null,"大型ブロック積",null,"大型ブロック積"]
["補完資料等からの情報",null,null,null,null,"従来技術","新技術","従来技術","新技術","従来技術","新技術","従来技術","新技術","従来技術","新技術","従来技術","新技術","従来技術","新技術","従来技術","新技術","従来技術","新技術","従来技術","新技術","従来技術","新技術","従来技術","新技術","従来技術","新技術","従来技術","新技術","従来技術","新技術","従来技術","新技術","従来技術","新技術","従来技術","新技術","従来技術","新技術","従来技術","新技術"]
[null,"⑪","統一した従来技術との比較（経済性、工程）\n判定の凡例 \n○：従来技術より優れる\n△：従来技術と同程度\n－：上記以外","施工条件CASE1",null,"大型ブロック積【勾配1：0.5、壁高5.0m、控500mm】（道路上側・護岸等）","施工条件：勾配1：0.5、壁高5.0m、控350mm、裏込めコンクリートt=150mm","大型ブロック積【勾配1：0.5、壁高5.0m、控500mm】（道路上側・護岸等）","施工条件：勾配1：0.5、壁高5.0m、控480mm　製品名：（練積タイプ）","大型ブロック積【勾配1：0.5、壁高5.0m、控500mm】（道路上側・護岸等）","施工条件：勾配1：0.5、壁高5.0m、控700mm","大型ブロック積【勾配1：0.5、壁高5.0m、控500mm】（道路上側・護岸等）","勾配1：0.5、壁高5.0m、控500mm　製品名：500A","大型ブロック積【勾配1：0.5、壁高5.0m、控500mm】（道路上側・護岸等）","勾配1：0.5、壁高5.0m、控350mm　製品名：ヌノピタA","大型ブロック積【勾配1：0.5、壁高5.0m、控500mm】（道路上側・護岸等）","施工条件：勾配1：0.5、壁高5.0m、控750mm　製品名：750型","大型ブロック積【勾配1：0.5、壁高5.0m、控1000mm】（道路下側（T-25対応））","施工条件：勾配1：0.5、壁高5.0m、控1000mm　製品名：1000型","大型ブロック積【勾配1：0.5、壁高5.0m、控500mm】（道路上側・護岸等）","施工条件：勾配1：0.5、壁高5.0m、控895mm、製品名：（SPブロックⅢ-1A型、C型）","大型ブロック積【勾配1：0.5、壁高5.0m、控1000mm】（道路下側（T-25対応））","施工条件：勾配1：0.5、壁高5.0m、控895mm、製品名：（SPブロックⅢ-1A型、C型）","大型ブロック積【勾配1：0.5、壁高5.0m、控500mm】（道路上側・護岸等）","施工条件：勾配1：0.5、壁高5.0m、控700mm　製品名：（額縁A型、C型）","大型ブロック積【勾配1：0.5、壁高5.0m、控1000mm】（道路下側（T-25対応））","施工条件：勾配1：0.5、壁高5.0m、控700mm　製品名：（額縁A型、C型）","大型ブロック積【勾配1：0.5、壁高5.0m、控500mm】（道路上側・護岸等）","施工条件：勾配1：0.5、壁高5.0m、控長750mm　製品名：750タイプ","大型ブロック積【勾配1：0.5、壁高5.0m、控1000mm】（道路下側（T-25対応））","施工条件：勾配1：0.5、壁高5.0m、控長1000mm　製品名：1000タイプ","大型ブロック積【勾配1：0.5、壁高5.0m、控1000mm】（道路下側（T-25対応））","施工条件：勾配1：0.5、壁高5.0m、控878mm　製品名：（1型特殊　AH，D－AH）","大型ブロック積【勾配1：0.5、壁高5.0m、控500mm】（道路上側・護岸等）","施工条件：勾配1：0.5、壁高5.0m、控1250mm　製品名：（A型）","大型ブロック積【勾配1：0.5、壁高5.0m、控1000mm】（道路下側（T-25対応））","施工条件：勾配1：0.5、壁高5.0m、控1250mm　製品名：（A型）","大型ブロック積【勾配1：0.5、壁高5.0m、控500mm】（道路上側・護岸等）","施工条件：勾配1：0.5、壁高5.0m、控650mm　製品名：（ホライズンⅡ）","大型ブロック積【勾配1：0.5、壁高5.0m、控1000mm】（道路下側（T-25対応））","施工条件：勾配1：0.5、壁高5.0m、控800mm　製品名：（ホライズンⅡ）","大型ブロック積【勾配1：0.5、壁高5.0m、控500mm】（道路上側・護岸等）","施工条件：勾配1：0.5、壁高5.0m、控750mm　製品名：750型","大型ブロック積【勾配1：0.5、壁高5.0m、控1000mm】（道路下側（T-25対応））","施工条件：勾配1：0.5、壁高5.0m、控1000mm　製品名：1000型"]
[null,null,null,"概算費用","機械・労務","-",892483,"-",621952,"-",2666782,"-",530074,"-",1871780,"-",2354086,"-",2900525,"-",1091100,"-",1091100,"-",1047500,"-",1039800,"-","-","-","-","-",2983900,"-","未回答","-","未回答","-",1519500,"-",1732300,"-",1660720,"-",1917900]
[null,null,null,null,"材料","-",2188468,"-",2470200,"-",942504,"-",3713376,"-",1500000,"-",3030220,"-",3832280,"-",4927600,"-",4927600,"-",3824400,"-",4027000,"-","-","-","-","-",1969200,"-","未回答","-","未回答","-",3675800,"-",4142900,"-",3799200,"-",4130100]
[null,null,null,null,"合計",4963400,3080951,4963400,3092152,4963400,3609286,4963400,4243450,4963400,3371780,4963400,5384306,6481787,6732805,4963400,6018700,6481787,6018700,4963400,4871900,6481787,5066800,4963400,5187700,6481787,6451200,6481787,4953100,4963400,"未回答",6481787,"未回答",4963400,5195300,6481787,5875200,4963400,5459920,6481787,6048000]
[null,"⑫",null,"施工日数",null,8.3699999999999992,13.3,8.3699999999999992,4.8099999999999996,8.3699999999999992,5.1230000000000002,8.3699999999999992,5.88,8.3699999999999992,10.7,8.3699999999999992,7.9808459696727851,9.19,11.09,8.3699999999999992,11.806375442739078,9.19,11.806375442739078,8.3699999999999992,11.806375442739078,9.19,11.806375442739078,8.3699999999999992,8.3892617449664435,9.19,10.245901639344263,9.19,16.100000000000001,8.3699999999999992,"未回答",9.19,"未回答",8.3699999999999992,8.3800000000000008,9.19,9.36,8.3699999999999992,10.46,9.19,10.46]
[null,"⑬",null,"経済性",null,{"$f":"IFERROR(IF(G36=\"-\",\"-\",IF(G36=\"\",\"-\",IF(G36/F36=1,\"△\",IF(G36/F36>1,\"-（\"&ABS(ROUND(100*G36/F36-100,1))&\"％増）\",IF(G36/F36<1,\"○（\"&ABS(ROUND(100*G36/F36-100,1))&\"％減）\",\"\"))))),\"-\")","v":"○（37.9％減）"},{"$f":"IFERROR(IF(F36=\"-\",\"-\",\"（\"&TEXT(G36,\"#,###\")&\"-\"&TEXT(F36,\"#,###\")&\"）/\"&TEXT(F36,\"#,###\")&\"=\"&TEXT((G36-F36)/F36*100,\"0.0\")&\"%\"),\"-\")","v":"（3,080,951-4,963,400）/4,963,400=-37.9%"},{"$f":"IFERROR(IF(I36=\"-\",\"-\",IF(I36=\"\",\"-\",IF(I36/H36=1,\"△\",IF(I36/H36>1,\"-（\"&ABS(ROUND(100*I36/H36-100,1))&\"％増）\",IF(I36/H36<1,\"○（\"&ABS(ROUND(100*I36/H36-100,1))&\"％減）\",\"\"))))),\"-\")","v":"○（37.7％減）"},{"$f":"IFERROR(IF(H36=\"-\",\"-\",\"（\"&TEXT(I36,\"#,###\")&\"-\"&TEXT(H36,\"#,###\")&\"）/\"&TEXT(H36,\"#,###\")&\"=\"&TEXT((I36-H36)/H36*100,\"0.0\")&\"%\"),\"-\")","v":"（3,092,152-4,963,400）/4,963,400=-37.7%"},{"$f":"IFERROR(IF(K36=\"-\",\"-\",IF(K36=\"\",\"-\",IF(K36/J36=1,\"△\",IF(K36/J36>1,\"-（\"&ABS(ROUND(100*K36/J36-100,1))&\"％増）\",IF(K36/J36<1,\"○（\"&ABS(ROUND(100*K36/J36-100,1))&\"％減）\",\"\"))))),\"-\")","v":"○（27.3％減）"},{"$f":"IFERROR(IF(J36=\"-\",\"-\",\"（\"&TEXT(K36,\"#,###\")&\"-\"&TEXT(J36,\"#,###\")&\"）/\"&TEXT(J36,\"#,###\")&\"=\"&TEXT((K36-J36)/J36*100,\"0.0\")&\"%\"),\"-\")","v":"（3,609,286-4,963,400）/4,963,400=-27.3%"},{"$f":"IFERROR(IF(M36=\"-\",\"-\",IF(M36=\"\",\"-\",IF(M36/L36=1,\"△\",IF(M36/L36>1,\"-（\"&ABS(ROUND(100*M36/L36-100,1))&\"％増）\",IF(M36/L36<1,\"○（\"&ABS(ROUND(100*M36/L36-100,1))&\"％減）\",\"\"))))),\"-\")","v":"○（14.5％減）"},{"$f":"IFERROR(IF(L36=\"-\",\"-\",\"（\"&TEXT(M36,\"#,###\")&\"-\"&TEXT(L36,\"#,###\")&\"）/\"&TEXT(L36,\"#,###\")&\"=\"&TEXT((M36-L36)/L36*100,\"0.0\")&\"%\"),\"-\")","v":"（4,243,450-4,963,400）/4,963,400=-14.5%"},{"$f":"IFERROR(IF(O36=\"-\",\"-\",IF(O36=\"\",\"-\",IF(O36/N36=1,\"△\",IF(O36/N36>1,\"-（\"&ABS(ROUND(100*O36/N36-100,1))&\"％増）\",IF(O36/N36<1,\"○（\"&ABS(ROUND(100*O36/N36-100,1))&\"％減）\",\"\"))))),\"-\")","v":"○（32.1％減）"},{"$f":"IFERROR(IF(N36=\"-\",\"-\",\"（\"&TEXT(O36,\"#,###\")&\"-\"&TEXT(N36,\"#,###\")&\"）/\"&TEXT(N36,\"#,###\")&\"=\"&TEXT((O36-N36)/N36*100,\"0.0\")&\"%\"),\"-\")","v":"（3,371,780-4,963,400）/4,963,400=-32.1%"},{"$f":"IFERROR(IF(Q36=\"-\",\"-\",IF(Q36=\"\",\"-\",IF(Q36/P36=1,\"△\",IF(Q36/P36>1,\"-（\"&ABS(ROUND(100*Q36/P36-100,1))&\"％増）\",IF(Q36/P36<1,\"○（\"&ABS(ROUND(100*Q36/P36-100,1))&\"％減）\",\"\"))))),\"-\")","v":"-（8.5％増）"},{"$f":"IFERROR(IF(P36=\"-\",\"-\",\"（\"&TEXT(Q36,\"#,###\")&\"-\"&TEXT(P36,\"#,###\")&\"）/\"&TEXT(P36,\"#,###\")&\"=\"&TEXT((Q36-P36)/P36*100,\"0.0\")&\"%\"),\"-\")","v":"（5,384,306-4,963,400）/4,963,400=8.5%"},{"$f":"IFERROR(IF(S36=\"-\",\"-\",IF(S36=\"\",\"-\",IF(S36/R36=1,\"△\",IF(S36/R36>1,\"-（\"&ABS(ROUND(100*S36/R36-100,1))&\"％増）\",IF(S36/R36<1,\"○（\"&ABS(ROUND(100*S36/R36-100,1))&\"％減）\",\"\"))))),\"-\")","v":"-（3.9％増）"},{"$f":"IFERROR(IF(R36=\"-\",\"-\",\"（\"&TEXT(S36,\"#,###\")&\"-\"&TEXT(R36,\"#,###\")&\"）/\"&TEXT(R36,\"#,###\")&\"=\"&TEXT((S36-R36)/R36*100,\"0.0\")&\"%\"),\"-\")","v":"（6,732,805-6,481,787）/6,481,787=3.9%"},{"$f":"IFERROR(IF(U36=\"-\",\"-\",IF(U36=\"\",\"-\",IF(U36/T36=1,\"△\",IF(U36/T36>1,\"-（\"&ABS(ROUND(100*U36/T36-100,1))&\"％増）\",IF(U36/T36<1,\"○（\"&ABS(ROUND(100*U36/T36-100,1))&\"％減）\",\"\"))))),\"-\")","v":"-（21.3％増）"},{"$f":"IFERROR(IF(T36=\"-\",\"-\",\"（\"&TEXT(U36,\"#,###\")&\"-\"&TEXT(T36,\"#,###\")&\"）/\"&TEXT(T36,\"#,###\")&\"=\"&TEXT((U36-T36)/T36*100,\"0.0\")&\"%\"),\"-\")","v":"（6,018,700-4,963,400）/4,963,400=21.3%"},{"$f":"IFERROR(IF(W36=\"-\",\"-\",IF(W36=\"\",\"-\",IF(W36/V36=1,\"△\",IF(W36/V36>1,\"-（\"&ABS(ROUND(100*W36/V36-100,1))&\"％増）\",IF(W36/V36<1,\"○（\"&ABS(ROUND(100*W36/V36-100,1))&\"％減）\",\"\"))))),\"-\")","v":"○（7.1％減）"},{"$f":"IFERROR(IF(V36=\"-\",\"-\",\"（\"&TEXT(W36,\"#,###\")&\"-\"&TEXT(V36,\"#,###\")&\"）/\"&TEXT(V36,\"#,###\")&\"=\"&TEXT((W36-V36)/V36*100,\"0.0\")&\"%\"),\"-\")","v":"（6,018,700-6,481,787）/6,481,787=-7.1%"},{"$f":"IFERROR(IF(Y36=\"-\",\"-\",IF(Y36=\"\",\"-\",IF(Y36/X36=1,\"△\",IF(Y36/X36>1,\"-（\"&ABS(ROUND(100*Y36/X36-100,1))&\"％増）\",IF(Y36/X36<1,\"○（\"&ABS(ROUND(100*Y36/X36-100,1))&\"％減）\",\"\"))))),\"-\")","v":"○（1.8％減）"},{"$f":"IFERROR(IF(X36=\"-\",\"-\",\"（\"&TEXT(Y36,\"#,###\")&\"-\"&TEXT(X36,\"#,###\")&\"）/\"&TEXT(X36,\"#,###\")&\"=\"&TEXT((Y36-X36)/X36*100,\"0.0\")&\"%\"),\"-\")","v":"（4,871,900-4,963,400）/4,963,400=-1.8%"},{"$f":"IFERROR(IF(AA36=\"-\",\"-\",IF(AA36=\"\",\"-\",IF(AA36/Z36=1,\"△\",IF(AA36/Z36>1,\"-（\"&ABS(ROUND(100*AA36/Z36-100,1))&\"％増）\",IF(AA36/Z36<1,\"○（\"&ABS(ROUND(100*AA36/Z36-100,1))&\"％減）\",\"\"))))),\"-\")","v":"○（21.8％減）"},{"$f":"IFERROR(IF(Z36=\"-\",\"-\",\"（\"&TEXT(AA36,\"#,###\")&\"-\"&TEXT(Z36,\"#,###\")&\"）/\"&TEXT(Z36,\"#,###\")&\"=\"&TEXT((AA36-Z36)/Z36*100,\"0.0\")&\"%\"),\"-\")","v":"（5,066,800-6,481,787）/6,481,787=-21.8%"},{"$f":"IFERROR(IF(AC36=\"-\",\"-\",IF(AC36=\"\",\"-\",IF(AC36/AB36=1,\"△\",IF(AC36/AB36>1,\"-（\"&ABS(ROUND(100*AC36/AB36-100,1))&\"％増）\",IF(AC36/AB36<1,\"○（\"&ABS(ROUND(100*AC36/AB36-100,1))&\"％減）\",\"\"))))),\"-\")","v":"-（4.5％増）"},{"$f":"IFERROR(IF(AB36=\"-\",\"-\",\"（\"&TEXT(AC36,\"#,###\")&\"-\"&TEXT(AB36,\"#,###\")&\"）/\"&TEXT(AB36,\"#,###\")&\"=\"&TEXT((AC36-AB36)/AB36*100,\"0.0\")&\"%\"),\"-\")","v":"（5,187,700-4,963,400）/4,963,400=4.5%"},{"$f":"IFERROR(IF(AE36=\"-\",\"-\",IF(AE36=\"\",\"-\",IF(AE36/AD36=1,\"△\",IF(AE36/AD36>1,\"-（\"&ABS(ROUND(100*AE36/AD36-100,1))&\"％増）\",IF(AE36/AD36<1,\"○（\"&ABS(ROUND(100*AE36/AD36-100,1))&\"％減）\",\"\"))))),\"-\")","v":"○（0.5％減）"},{"$f":"IFERROR(IF(AD36=\"-\",\"-\",\"（\"&TEXT(AE36,\"#,###\")&\"-\"&TEXT(AD36,\"#,###\")&\"）/\"&TEXT(AD36,\"#,###\")&\"=\"&TEXT((AE36-AD36)/AD36*100,\"0.0\")&\"%\"),\"-\")","v":"（6,451,200-6,481,787）/6,481,787=-0.5%"},{"$f":"IFERROR(IF(AG36=\"-\",\"-\",IF(AG36=\"\",\"-\",IF(AG36/AF36=1,\"△\",IF(AG36/AF36>1,\"-（\"&ABS(ROUND(100*AG36/AF36-100,1))&\"％増）\",IF(AG36/AF36<1,\"○（\"&ABS(ROUND(100*AG36/AF36-100,1))&\"％減）\",\"\"))))),\"-\")","v":"○（23.6％減）"},{"$f":"IFERROR(IF(AF36=\"-\",\"-\",\"（\"&TEXT(AG36,\"#,###\")&\"-\"&TEXT(AF36,\"#,###\")&\"）/\"&TEXT(AF36,\"#,###\")&\"=\"&TEXT((AG36-AF36)/AF36*100,\"0.0\")&\"%\"),\"-\")","v":"（4,953,100-6,481,787）/6,481,787=-23.6%"},{"$f":"IFERROR(IF(AI36=\"-\",\"-\",IF(AI36=\"\",\"-\",IF(AI36/AH36=1,\"△\",IF(AI36/AH36>1,\"-（\"&ABS(ROUND(100*AI36/AH36-100,1))&\"％増）\",IF(AI36/AH36<1,\"○（\"&ABS(ROUND(100*AI36/AH36-100,1))&\"％減）\",\"\"))))),\"-\")","v":"-"},{"$f":"IFERROR(IF(AH36=\"-\",\"-\",\"（\"&TEXT(AI36,\"#,###\")&\"-\"&TEXT(AH36,\"#,###\")&\"）/\"&TEXT(AH36,\"#,###\")&\"=\"&TEXT((AI36-AH36)/AH36*100,\"0.0\")&\"%\"),\"-\")","v":"-"},{"$f":"IFERROR(IF(AK36=\"-\",\"-\",IF(AK36=\"\",\"-\",IF(AK36/AJ36=1,\"△\",IF(AK36/AJ36>1,\"-（\"&ABS(ROUND(100*AK36/AJ36-100,1))&\"％増）\",IF(AK36/AJ36<1,\"○（\"&ABS(ROUND(100*AK36/AJ36-100,1))&\"％減）\",\"\"))))),\"-\")","v":"-"},{"$f":"IFERROR(IF(AJ36=\"-\",\"-\",\"（\"&TEXT(AK36,\"#,###\")&\"-\"&TEXT(AJ36,\"#,###\")&\"）/\"&TEXT(AJ36,\"#,###\")&\"=\"&TEXT((AK36-AJ36)/AJ36*100,\"0.0\")&\"%\"),\"-\")","v":"-"},{"$f":"IFERROR(IF(AM36=\"-\",\"-\",IF(AM36=\"\",\"-\",IF(AM36/AL36=1,\"△\",IF(AM36/AL36>1,\"-（\"&ABS(ROUND(100*AM36/AL36-100,1))&\"％増）\",IF(AM36/AL36<1,\"○（\"&ABS(ROUND(100*AM36/AL36-100,1))&\"％減）\",\"\"))))),\"-\")","v":"-（4.7％増）"},{"$f":"IFERROR(IF(AL36=\"-\",\"-\",\"（\"&TEXT(AM36,\"#,###\")&\"-\"&TEXT(AL36,\"#,###\")&\"）/\"&TEXT(AL36,\"#,###\")&\"=\"&TEXT((AM36-AL36)/AL36*100,\"0.0\")&\"%\"),\"-\")","v":"（5,195,300-4,963,400）/4,963,400=4.7%"},{"$f":"IFERROR(IF(AO36=\"-\",\"-\",IF(AO36=\"\",\"-\",IF(AO36/AN36=1,\"△\",IF(AO36/AN36>1,\"-（\"&ABS(ROUND(100*AO36/AN36-100,1))&\"％増）\",IF(AO36/AN36<1,\"○（\"&ABS(ROUND(100*AO36/AN36-100,1))&\"％減）\",\"\"))))),\"-\")","v":"○（9.4％減）"},{"$f":"IFERROR(IF(AN36=\"-\",\"-\",\"（\"&TEXT(AO36,\"#,###\")&\"-\"&TEXT(AN36,\"#,###\")&\"）/\"&TEXT(AN36,\"#,###\")&\"=\"&TEXT((AO36-AN36)/AN36*100,\"0.0\")&\"%\"),\"-\")","v":"（5,875,200-6,481,787）/6,481,787=-9.4%"},{"$f":"IFERROR(IF(AQ36=\"-\",\"-\",IF(AQ36=\"\",\"-\",IF(AQ36/AP36=1,\"△\",IF(AQ36/AP36>1,\"-（\"&ABS(ROUND(100*AQ36/AP36-100,1))&\"％増）\",IF(AQ36/AP36<1,\"○（\"&ABS(ROUND(100*AQ36/AP36-100,1))&\"％減）\",\"\"))))),\"-\")","v":"-（10％増）"},{"$f":"IFERROR(IF(AP36=\"-\",\"-\",\"（\"&TEXT(AQ36,\"#,###\")&\"-\"&TEXT(AP36,\"#,###\")&\"）/\"&TEXT(AP36,\"#,###\")&\"=\"&TEXT((AQ36-AP36)/AP36*100,\"0.0\")&\"%\"),\"-\")","v":"（5,459,920-4,963,400）/4,963,400=10.0%"},{"$f":"IFERROR(IF(AS36=\"-\",\"-\",IF(AS36=\"\",\"-\",IF(AS36/AR36=1,\"△\",IF(AS36/AR36>1,\"-（\"&ABS(ROUND(100*AS36/AR36-100,1))&\"％増）\",IF(AS36/AR36<1,\"○（\"&ABS(ROUND(100*AS36/AR36-100,1))&\"％減）\",\"\"))))),\"-\")","v":"○（6.7％減）"},{"$f":"IFERROR(IF(AR36=\"-\",\"-\",\"（\"&TEXT(AS36,\"#,###\")&\"-\"&TEXT(AR36,\"#,###\")&\"）/\"&TEXT(AR36,\"#,###\")&\"=\"&TEXT((AS36-AR36)/AR36*100,\"0.0\")&\"%\"),\"-\")","v":"（6,048,000-6,481,787）/6,481,787=-6.7%"}]
[null,null,null,"工程",null,{"$f":"IFERROR(IF(G37=\"-\",\"-\",IF(G37=\"\",\"-\",IF(G37/F37=1,\"△\",IF(G37/F37>1,\"-（\"&ABS(ROUND(100*G37/F37-100,1))&\"％増）\",IF(G37/F37<1,\"○（\"&ABS(ROUND(100*G37/F37-100,1))&\"％減）\",\"\"))))),\"-\")","v":"-（58.9％増）"},{"$f":"IFERROR(IF(F37=\"-\",\"-\",\"（\"&TEXT(G37,\"##0.000\")&\"-\"&TEXT(F37,\"##0.000\")&\"）/\"&TEXT(F37,\"##0.000\")&\"=\"&TEXT((G37-F37)/F37*100,\"0.0\")&\"%\"),\"-\")","v":"（13.300-8.370）/8.370=58.9%"},{"$f":"IFERROR(IF(I37=\"-\",\"-\",IF(I37=\"\",\"-\",IF(I37/H37=1,\"△\",IF(I37/H37>1,\"-（\"&ABS(ROUND(100*I37/H37-100,1))&\"％増）\",IF(I37/H37<1,\"○（\"&ABS(ROUND(100*I37/H37-100,1))&\"％減）\",\"\"))))),\"-\")","v":"○（42.5％減）"},{"$f":"IFERROR(IF(H37=\"-\",\"-\",\"（\"&TEXT(I37,\"##0.000\")&\"-\"&TEXT(H37,\"##0.000\")&\"）/\"&TEXT(H37,\"##0.000\")&\"=\"&TEXT((I37-H37)/H37*100,\"0.0\")&\"%\"),\"-\")","v":"（4.810-8.370）/8.370=-42.5%"},{"$f":"IFERROR(IF(K37=\"-\",\"-\",IF(K37=\"\",\"-\",IF(K37/J37=1,\"△\",IF(K37/J37>1,\"-（\"&ABS(ROUND(100*K37/J37-100,1))&\"％増）\",IF(K37/J37<1,\"○（\"&ABS(ROUND(100*K37/J37-100,1))&\"％減）\",\"\"))))),\"-\")","v":"○（38.8％減）"},{"$f":"IFERROR(IF(J37=\"-\",\"-\",\"（\"&TEXT(K37,\"##0.000\")&\"-\"&TEXT(J37,\"##0.000\")&\"）/\"&TEXT(J37,\"##0.000\")&\"=\"&TEXT((K37-J37)/J37*100,\"0.0\")&\"%\"),\"-\")","v":"（5.123-8.370）/8.370=-38.8%"},{"$f":"IFERROR(IF(M37=\"-\",\"-\",IF(M37=\"\",\"-\",IF(M37/L37=1,\"△\",IF(M37/L37>1,\"-（\"&ABS(ROUND(100*M37/L37-100,1))&\"％増）\",IF(M37/L37<1,\"○（\"&ABS(ROUND(100*M37/L37-100,1))&\"％減）\",\"\"))))),\"-\")","v":"○（29.7％減）"},{"$f":"IFERROR(IF(L37=\"-\",\"-\",\"（\"&TEXT(M37,\"##0.000\")&\"-\"&TEXT(L37,\"##0.000\")&\"）/\"&TEXT(L37,\"##0.000\")&\"=\"&TEXT((M37-L37)/L37*100,\"0.0\")&\"%\"),\"-\")","v":"（5.880-8.370）/8.370=-29.7%"},{"$f":"IFERROR(IF(O37=\"-\",\"-\",IF(O37=\"\",\"-\",IF(O37/N37=1,\"△\",IF(O37/N37>1,\"-（\"&ABS(ROUND(100*O37/N37-100,1))&\"％増）\",IF(O37/N37<1,\"○（\"&ABS(ROUND(100*O37/N37-100,1))&\"％減）\",\"\"))))),\"-\")","v":"-（27.8％増）"},{"$f":"IFERROR(IF(N37=\"-\",\"-\",\"（\"&TEXT(O37,\"##0.000\")&\"-\"&TEXT(N37,\"##0.000\")&\"）/\"&TEXT(N37,\"##0.000\")&\"=\"&TEXT((O37-N37)/N37*100,\"0.0\")&\"%\"),\"-\")","v":"（10.700-8.370）/8.370=27.8%"},{"$f":"IFERROR(IF(Q37=\"-\",\"-\",IF(Q37=\"\",\"-\",IF(Q37/P37=1,\"△\",IF(Q37/P37>1,\"-（\"&ABS(ROUND(100*Q37/P37-100,1))&\"％増）\",IF(Q37/P37<1,\"○（\"&ABS(ROUND(100*Q37/P37-100,1))&\"％減）\",\"\"))))),\"-\")","v":"○（4.6％減）"},{"$f":"IFERROR(IF(P37=\"-\",\"-\",\"（\"&TEXT(Q37,\"##0.000\")&\"-\"&TEXT(P37,\"##0.000\")&\"）/\"&TEXT(P37,\"##0.000\")&\"=\"&TEXT((Q37-P37)/P37*100,\"0.0\")&\"%\"),\"-\")","v":"（7.981-8.370）/8.370=-4.6%"},{"$f":"IFERROR(IF(S37=\"-\",\"-\",IF(S37=\"\",\"-\",IF(S37/R37=1,\"△\",IF(S37/R37>1,\"-（\"&ABS(ROUND(100*S37/R37-100,1))&\"％増）\",IF(S37/R37<1,\"○（\"&ABS(ROUND(100*S37/R37-100,1))&\"％減）\",\"\"))))),\"-\")","v":"-（20.7％増）"},{"$f":"IFERROR(IF(R37=\"-\",\"-\",\"（\"&TEXT(S37,\"##0.000\")&\"-\"&TEXT(R37,\"##0.000\")&\"）/\"&TEXT(R37,\"##0.000\")&\"=\"&TEXT((S37-R37)/R37*100,\"0.0\")&\"%\"),\"-\")","v":"（11.090-9.190）/9.190=20.7%"},{"$f":"IFERROR(IF(U37=\"-\",\"-\",IF(U37=\"\",\"-\",IF(U37/T37=1,\"△\",IF(U37/T37>1,\"-（\"&ABS(ROUND(100*U37/T37-100,1))&\"％増）\",IF(U37/T37<1,\"○（\"&ABS(ROUND(100*U37/T37-100,1))&\"％減）\",\"\"))))),\"-\")","v":"-（41.1％増）"},{"$f":"IFERROR(IF(T37=\"-\",\"-\",\"（\"&TEXT(U37,\"##0.000\")&\"-\"&TEXT(T37,\"##0.000\")&\"）/\"&TEXT(T37,\"##0.000\")&\"=\"&TEXT((U37-T37)/T37*100,\"0.0\")&\"%\"),\"-\")","v":"（11.806-8.370）/8.370=41.1%"},{"$f":"IFERROR(IF(W37=\"-\",\"-\",IF(W37=\"\",\"-\",IF(W37/V37=1,\"△\",IF(W37/V37>1,\"-（\"&ABS(ROUND(100*W37/V37-100,1))&\"％増）\",IF(W37/V37<1,\"○（\"&ABS(ROUND(100*W37/V37-100,1))&\"％減）\",\"\"))))),\"-\")","v":"-（28.5％増）"},{"$f":"IFERROR(IF(V37=\"-\",\"-\",\"（\"&TEXT(W37,\"##0.000\")&\"-\"&TEXT(V37,\"##0.000\")&\"）/\"&TEXT(V37,\"##0.000\")&\"=\"&TEXT((W37-V37)/V37*100,\"0.0\")&\"%\"),\"-\")","v":"（11.806-9.190）/9.190=28.5%"},{"$f":"IFERROR(IF(Y37=\"-\",\"-\",IF(Y37=\"\",\"-\",IF(Y37/X37=1,\"△\",IF(Y37/X37>1,\"-（\"&ABS(ROUND(100*Y37/X37-100,1))&\"％増）\",IF(Y37/X37<1,\"○（\"&ABS(ROUND(100*Y37/X37-100,1))&\"％減）\",\"\"))))),\"-\")","v":"-（41.1％増）"},{"$f":"IFERROR(IF(X37=\"-\",\"-\",\"（\"&TEXT(Y37,\"##0.000\")&\"-\"&TEXT(X37,\"##0.000\")&\"）/\"&TEXT(X37,\"##0.000\")&\"=\"&TEXT((Y37-X37)/X37*100,\"0.0\")&\"%\"),\"-\")","v":"（11.806-8.370）/8.370=41.1%"},{"$f":"IFERROR(IF(AA37=\"-\",\"-\",IF(AA37=\"\",\"-\",IF(AA37/Z37=1,\"△\",IF(AA37/Z37>1,\"-（\"&ABS(ROUND(100*AA37/Z37-100,1))&\"％増）\",IF(AA37/Z37<1,\"○（\"&ABS(ROUND(100*AA37/Z37-100,1))&\"％減）\",\"\"))))),\"-\")","v":"-（28.5％増）"},{"$f":"IFERROR(IF(Z37=\"-\",\"-\",\"（\"&TEXT(AA37,\"##0.000\")&\"-\"&TEXT(Z37,\"##0.000\")&\"）/\"&TEXT(Z37,\"##0.000\")&\"=\"&TEXT((AA37-Z37)/Z37*100,\"0.0\")&\"%\"),\"-\")","v":"（11.806-9.190）/9.190=28.5%"},{"$f":"IFERROR(IF(AC37=\"-\",\"-\",IF(AC37=\"\",\"-\",IF(AC37/AB37=1,\"△\",IF(AC37/AB37>1,\"-（\"&ABS(ROUND(100*AC37/AB37-100,1))&\"％増）\",IF(AC37/AB37<1,\"○（\"&ABS(ROUND(100*AC37/AB37-100,1))&\"％減）\",\"\"))))),\"-\")","v":"-（0.2％増）"},{"$f":"IFERROR(IF(AB37=\"-\",\"-\",\"（\"&TEXT(AC37,\"##0.000\")&\"-\"&TEXT(AB37,\"##0.000\")&\"）/\"&TEXT(AB37,\"##0.000\")&\"=\"&TEXT((AC37-AB37)/AB37*100,\"0.0\")&\"%\"),\"-\")","v":"（8.389-8.370）/8.370=0.2%"},{"$f":"IFERROR(IF(AE37=\"-\",\"-\",IF(AE37=\"\",\"-\",IF(AE37/AD37=1,\"△\",IF(AE37/AD37>1,\"-（\"&ABS(ROUND(100*AE37/AD37-100,1))&\"％増）\",IF(AE37/AD37<1,\"○（\"&ABS(ROUND(100*AE37/AD37-100,1))&\"％減）\",\"\"))))),\"-\")","v":"-（11.5％増）"},{"$f":"IFERROR(IF(AD37=\"-\",\"-\",\"（\"&TEXT(AE37,\"##0.000\")&\"-\"&TEXT(AD37,\"##0.000\")&\"）/\"&TEXT(AD37,\"##0.000\")&\"=\"&TEXT((AE37-AD37)/AD37*100,\"0.0\")&\"%\"),\"-\")","v":"（10.246-9.190）/9.190=11.5%"},{"$f":"IFERROR(IF(AG37=\"-\",\"-\",IF(AG37=\"\",\"-\",IF(AG37/AF37=1,\"△\",IF(AG37/AF37>1,\"-（\"&ABS(ROUND(100*AG37/AF37-100,1))&\"％増）\",IF(AG37/AF37<1,\"○（\"&ABS(ROUND(100*AG37/AF37-100,1))&\"％減）\",\"\"))))),\"-\")","v":"-（75.2％増）"},{"$f":"IFERROR(IF(AF37=\"-\",\"-\",\"（\"&TEXT(AG37,\"##0.000\")&\"-\"&TEXT(AF37,\"##0.000\")&\"）/\"&TEXT(AF37,\"##0.000\")&\"=\"&TEXT((AG37-AF37)/AF37*100,\"0.0\")&\"%\"),\"-\")","v":"（16.100-9.190）/9.190=75.2%"},{"$f":"IFERROR(IF(AI37=\"-\",\"-\",IF(AI37=\"\",\"-\",IF(AI37/AH37=1,\"△\",IF(AI37/AH37>1,\"-（\"&ABS(ROUND(100*AI37/AH37-100,1))&\"％増）\",IF(AI37/AH37<1,\"○（\"&ABS(ROUND(100*AI37/AH37-100,1))&\"％減）\",\"\"))))),\"-\")","v":"-"},{"$f":"IFERROR(IF(AH37=\"-\",\"-\",\"（\"&TEXT(AI37,\"##0.000\")&\"-\"&TEXT(AH37,\"##0.000\")&\"）/\"&TEXT(AH37,\"##0.000\")&\"=\"&TEXT((AI37-AH37)/AH37*100,\"0.0\")&\"%\"),\"-\")","v":"-"},{"$f":"IFERROR(IF(AK37=\"-\",\"-\",IF(AK37=\"\",\"-\",IF(AK37/AJ37=1,\"△\",IF(AK37/AJ37>1,\"-（\"&ABS(ROUND(100*AK37/AJ37-100,1))&\"％増）\",IF(AK37/AJ37<1,\"○（\"&ABS(ROUND(100*AK37/AJ37-100,1))&\"％減）\",\"\"))))),\"-\")","v":"-"},{"$f":"IFERROR(IF(AJ37=\"-\",\"-\",\"（\"&TEXT(AK37,\"##0.000\")&\"-\"&TEXT(AJ37,\"##0.000\")&\"）/\"&TEXT(AJ37,\"##0.000\")&\"=\"&TEXT((AK37-AJ37)/AJ37*100,\"0.0\")&\"%\"),\"-\")","v":"-"},{"$f":"IFERROR(IF(AM37=\"-\",\"-\",IF(AM37=\"\",\"-\",IF(AM37/AL37=1,\"△\",IF(AM37/AL37>1,\"-（\"&ABS(ROUND(100*AM37/AL37-100,1))&\"％増）\",IF(AM37/AL37<1,\"○（\"&ABS(ROUND(100*AM37/AL37-100,1))&\"％減）\",\"\"))))),\"-\")","v":"-（0.1％増）"},{"$f":"IFERROR(IF(AL37=\"-\",\"-\",\"（\"&TEXT(AM37,\"##0.000\")&\"-\"&TEXT(AL37,\"##0.000\")&\"）/\"&TEXT(AL37,\"##0.000\")&\"=\"&TEXT((AM37-AL37)/AL37*100,\"0.0\")&\"%\"),\"-\")","v":"（8.380-8.370）/8.370=0.1%"},{"$f":"IFERROR(IF(AO37=\"-\",\"-\",IF(AO37=\"\",\"-\",IF(AO37/AN37=1,\"△\",IF(AO37/AN37>1,\"-（\"&ABS(ROUND(100*AO37/AN37-100,1))&\"％増）\",IF(AO37/AN37<1,\"○（\"&ABS(ROUND(100*AO37/AN37-100,1))&\"％減）\",\"\"))))),\"-\")","v":"-（1.8％増）"},{"$f":"IFERROR(IF(AN37=\"-\",\"-\",\"（\"&TEXT(AO37,\"##0.000\")&\"-\"&TEXT(AN37,\"##0.000\")&\"）/\"&TEXT(AN37,\"##0.000\")&\"=\"&TEXT((AO37-AN37)/AN37*100,\"0.0\")&\"%\"),\"-\")","v":"（9.360-9.190）/9.190=1.8%"},{"$f":"IFERROR(IF(AQ37=\"-\",\"-\",IF(AQ37=\"\",\"-\",IF(AQ37/AP37=1,\"△\",IF(AQ37/AP37>1,\"-（\"&ABS(ROUND(100*AQ37/AP37-100,1))&\"％増）\",IF(AQ37/AP37<1,\"○（\"&ABS(ROUND(100*AQ37/AP37-100,1))&\"％減）\",\"\"))))),\"-\")","v":"-（25％増）"},{"$f":"IFERROR(IF(AP37=\"-\",\"-\",\"（\"&TEXT(AQ37,\"##0.000\")&\"-\"&TEXT(AP37,\"##0.000\")&\"）/\"&TEXT(AP37,\"##0.000\")&\"=\"&TEXT((AQ37-AP37)/AP37*100,\"0.0\")&\"%\"),\"-\")","v":"（10.460-8.370）/8.370=25.0%"},{"$f":"IFERROR(IF(AS37=\"-\",\"-\",IF(AS37=\"\",\"-\",IF(AS37/AR37=1,\"△\",IF(AS37/AR37>1,\"-（\"&ABS(ROUND(100*AS37/AR37-100,1))&\"％増）\",IF(AS37/AR37<1,\"○（\"&ABS(ROUND(100*AS37/AR37-100,1))&\"％減）\",\"\"))))),\"-\")","v":"-（13.8％増）"},{"$f":"IFERROR(IF(AR37=\"-\",\"-\",\"（\"&TEXT(AS37,\"##0.000\")&\"-\"&TEXT(AR37,\"##0.000\")&\"）/\"&TEXT(AR37,\"##0.000\")&\"=\"&TEXT((AS37-AR37)/AR37*100,\"0.0\")&\"%\"),\"-\")","v":"（10.460-9.190）/9.190=13.8%"}]
[null,"⑭",null,"施工条件CASE2",null,"大型ブロック積【勾配1：0.5、壁高8.0m、控1000mm】（道路上側・護岸等）","大型ブロック積【勾配1：0.5、壁高8.0m、控1000mm】（道路上側・護岸等）","-","-","-","-","-","-","-","-","大型ブロック積【勾配1：0.5、壁高8.0m、控1000mm】（道路上側・護岸等）","大型ブロック積【勾配1：0.5、壁高8.0m、控1000mm】（道路上側・護岸等）","大型ブロック積【勾配1：0.5、壁高8.0m、控1500mm】（道路下側（T-25対応））","大型ブロック積【勾配1：0.5、壁高8.0m、控1500mm】（道路下側（T-25対応））","大型ブロック積【勾配1：0.5、壁高8.0m、控1000mm】（道路上側・護岸等）","大型ブロック積【勾配1：0.5、壁高8.0m、控1000mm】（道路上側・護岸等）","大型ブロック積【勾配1：0.5、壁高8.0m、控1500mm】（道路下側（T-25対応））","大型ブロック積【勾配1：0.5、壁高8.0m、控1500mm】（道路下側（T-25対応））","大型ブロック積【勾配1：0.5、壁高8.0m、控1000mm】（道路上側・護岸等）","大型ブロック積【勾配1：0.5、壁高8.0m、控1000mm】（道路上側・護岸等）","大型ブロック積【勾配1：0.5、壁高8.0m、控1500mm】（道路下側（T-25対応））","大型ブロック積【勾配1：0.5、壁高8.0m、控1500mm】（道路下側（T-25対応））","大型ブロック積【勾配1：0.5、壁高8.0m、控1000mm】（道路上側・護岸等）","大型ブロック積【勾配1：0.5、壁高8.0m、控1000mm】（道路上側・護岸等）","大型ブロック積【勾配1：0.5、壁高8.0m、控1500mm】（道路下側（T-25対応））","大型ブロック積【勾配1：0.5、壁高8.0m、控1500mm】（道路下側（T-25対応））","大型ブロック積【勾配1：0.5、壁高8.0m、控1500mm】（道路下側（T-25対応））","大型ブロック積【勾配1：0.5、壁高8.0m、控1500mm】（道路下側（T-25対応））","大型ブロック積【勾配1：0.5、壁高8.0m、控1000mm】（道路上側・護岸等）","大型ブロック積【勾配1：0.5、壁高8.0m、控1000mm】（道路上側・護岸等）","大型ブロック積【勾配1：0.5、壁高8.0m、控1500mm】（道路下側（T-25対応））","大型ブロック積【勾配1：0.5、壁高8.0m、控1500mm】（道路下側（T-25対応））","大型ブロック積【勾配1：0.5、壁高8.0m、控1000mm】（道路上側・護岸等）","大型ブロック積【勾配1：0.5、壁高8.0m、控1000mm】（道路上側・護岸等）","大型ブロック積【勾配1：0.5、壁高8.0m、控1500mm】（道路下側（T-25対応））","大型ブロック積【勾配1：0.5、壁高8.0m、控1500mm】（道路下側（T-25対応））","大型ブロック積【勾配1：0.5、壁高8.0m、控1000mm】（道路上側・護岸等）","大型ブロック積【勾配1：0.5、壁高8.0m、控1000mm】（道路上側・護岸等）","大型ブロック積【勾配1：0.5、壁高8.0m、控1500mm】（道路下側（T-25対応））","大型ブロック積【勾配1：0.5、壁高8.0m、控1500mm】（道路下側（T-25対応））"]
[null,null,null,"概算費用","機械・労務","-",856949,"-","-","-","-","-","-","-","-","-",2336910,"-",3002878,"-",1257000,"-",1257000,"-",1210700,"-",1322100,"-","-","-","-","-",4422000,"-","未回答","-","未回答","-",1889100,"-",2131200,"-",1928200,"-",2658700]
[null,null,null,null,"材料","-",2124440,"-","-","-","-","-","-","-","-","-",3543210,"-",3874000,"-",5536400,"-",5536400,"-",4645200,"-",5042700,"-","-","-","-","-",2804600,"-","未回答","-","未回答","-",4870300,"-",5377100,"-",4895500,"-",6550400]
[null,null,null,null,"合計",8330250,2981389,"-","-","-","-","-","-","-","-",8330250,5880120,8251416.5625,6876878,8330250,6793400,8251416.5625,6793400,8330250,5855900,8251416.5625,6364800,8330250,7774500,8251416.5625,7774500,8251416.5625,7226600,8330250,"未回答",8251416.5625,"未回答",8330250,6759400,8251416.5625,7508300,8330250,6823700,8251416.5625,9209100]
[null,"⑮",null,"施工日数",null,12.26,13.3,"-","-","-","-","-","-","-","-",12.26,9.5969289827255277,11.81,11.38,12.26,11.806375442739078,11.81,11.806375442739078,12.26,11.806375442739078,11.81,11.806375442739078,12.26,11.013215859030836,11.81,11.013215859030836,11.81,17.89,12.26,"未回答",11.81,"未回答",12.26,8.26,11.81,9,12.26,8.42,11.81,8.42]
[null,"⑯",null,"経済性",null,{"$f":"IFERROR(IF(G43=\"-\",\"-\",IF(G43=\"\",\"-\",IF(G43/F43=1,\"△\",IF(G43/F43>1,\"-（\"&ABS(ROUND(100*G43/F43-100,1))&\"％増）\",IF(G43/F43<1,\"○（\"&ABS(ROUND(100*G43/F43-100,1))&\"％減）\",\"\"))))),\"-\")","v":"○（64.2％減）"},{"$f":"IFERROR(IF(F43=\"-\",\"-\",\"（\"&TEXT(G43,\"#,###\")&\"-\"&TEXT(F43,\"#,###\")&\"）/\"&TEXT(F43,\"#,###\")&\"=\"&TEXT((G43-F43)/F43*100,\"0.0\")&\"%\"),\"-\")","v":"（2,981,389-8,330,250）/8,330,250=-64.2%"},{"$f":"IFERROR(IF(I43=\"-\",\"-\",IF(I43=\"\",\"-\",IF(I43/H43=1,\"△\",IF(I43/H43>1,\"-（\"&ABS(ROUND(100*I43/H43-100,1))&\"％増）\",IF(I43/H43<1,\"○（\"&ABS(ROUND(100*I43/H43-100,1))&\"％減）\",\"\"))))),\"-\")","v":"-"},{"$f":"IFERROR(IF(H43=\"-\",\"-\",\"（\"&TEXT(I43,\"#,###\")&\"-\"&TEXT(H43,\"#,###\")&\"）/\"&TEXT(H43,\"#,###\")&\"=\"&TEXT((I43-H43)/H43*100,\"0.0\")&\"%\"),\"-\")","v":"-"},{"$f":"IFERROR(IF(K43=\"-\",\"-\",IF(K43=\"\",\"-\",IF(K43/J43=1,\"△\",IF(K43/J43>1,\"-（\"&ABS(ROUND(100*K43/J43-100,1))&\"％増）\",IF(K43/J43<1,\"○（\"&ABS(ROUND(100*K43/J43-100,1))&\"％減）\",\"\"))))),\"-\")","v":"-"},{"$f":"IFERROR(IF(J43=\"-\",\"-\",\"（\"&TEXT(K43,\"#,###\")&\"-\"&TEXT(J43,\"#,###\")&\"）/\"&TEXT(J43,\"#,###\")&\"=\"&TEXT((K43-J43)/J43*100,\"0.0\")&\"%\"),\"-\")","v":"-"},{"$f":"IFERROR(IF(M43=\"-\",\"-\",IF(M43=\"\",\"-\",IF(M43/L43=1,\"△\",IF(M43/L43>1,\"-（\"&ABS(ROUND(100*M43/L43-100,1))&\"％増）\",IF(M43/L43<1,\"○（\"&ABS(ROUND(100*M43/L43-100,1))&\"％減）\",\"\"))))),\"-\")","v":"-"},{"$f":"IFERROR(IF(L43=\"-\",\"-\",\"（\"&TEXT(M43,\"#,###\")&\"-\"&TEXT(L43,\"#,###\")&\"）/\"&TEXT(L43,\"#,###\")&\"=\"&TEXT((M43-L43)/L43*100,\"0.0\")&\"%\"),\"-\")","v":"-"},{"$f":"IFERROR(IF(O43=\"-\",\"-\",IF(O43=\"\",\"-\",IF(O43/N43=1,\"△\",IF(O43/N43>1,\"-（\"&ABS(ROUND(100*O43/N43-100,1))&\"％増）\",IF(O43/N43<1,\"○（\"&ABS(ROUND(100*O43/N43-100,1))&\"％減）\",\"\"))))),\"-\")","v":"-"},{"$f":"IFERROR(IF(N43=\"-\",\"-\",\"（\"&TEXT(O43,\"#,###\")&\"-\"&TEXT(N43,\"#,###\")&\"）/\"&TEXT(N43,\"#,###\")&\"=\"&TEXT((O43-N43)/N43*100,\"0.0\")&\"%\"),\"-\")","v":"-"},{"$f":"IFERROR(IF(Q43=\"-\",\"-\",IF(Q43=\"\",\"-\",IF(Q43/P43=1,\"△\",IF(Q43/P43>1,\"-（\"&ABS(ROUND(100*Q43/P43-100,1))&\"％増）\",IF(Q43/P43<1,\"○（\"&ABS(ROUND(100*Q43/P43-100,1))&\"％減）\",\"\"))))),\"-\")","v":"○（29.4％減）"},{"$f":"IFERROR(IF(P43=\"-\",\"-\",\"（\"&TEXT(Q43,\"#,###\")&\"-\"&TEXT(P43,\"#,###\")&\"）/\"&TEXT(P43,\"#,###\")&\"=\"&TEXT((Q43-P43)/P43*100,\"0.0\")&\"%\"),\"-\")","v":"（5,880,120-8,330,250）/8,330,250=-29.4%"},{"$f":"IFERROR(IF(S43=\"-\",\"-\",IF(S43=\"\",\"-\",IF(S43/R43=1,\"△\",IF(S43/R43>1,\"-（\"&ABS(ROUND(100*S43/R43-100,1))&\"％増）\",IF(S43/R43<1,\"○（\"&ABS(ROUND(100*S43/R43-100,1))&\"％減）\",\"\"))))),\"-\")","v":"○（16.7％減）"},{"$f":"IFERROR(IF(R43=\"-\",\"-\",\"（\"&TEXT(S43,\"#,###\")&\"-\"&TEXT(R43,\"#,###\")&\"）/\"&TEXT(R43,\"#,###\")&\"=\"&TEXT((S43-R43)/R43*100,\"0.0\")&\"%\"),\"-\")","v":"（6,876,878-8,251,417）/8,251,417=-16.7%"},{"$f":"IFERROR(IF(U43=\"-\",\"-\",IF(U43=\"\",\"-\",IF(U43/T43=1,\"△\",IF(U43/T43>1,\"-（\"&ABS(ROUND(100*U43/T43-100,1))&\"％増）\",IF(U43/T43<1,\"○（\"&ABS(ROUND(100*U43/T43-100,1))&\"％減）\",\"\"))))),\"-\")","v":"○（18.4％減）"},{"$f":"IFERROR(IF(T43=\"-\",\"-\",\"（\"&TEXT(U43,\"#,###\")&\"-\"&TEXT(T43,\"#,###\")&\"）/\"&TEXT(T43,\"#,###\")&\"=\"&TEXT((U43-T43)/T43*100,\"0.0\")&\"%\"),\"-\")","v":"（6,793,400-8,330,250）/8,330,250=-18.4%"},{"$f":"IFERROR(IF(W43=\"-\",\"-\",IF(W43=\"\",\"-\",IF(W43/V43=1,\"△\",IF(W43/V43>1,\"-（\"&ABS(ROUND(100*W43/V43-100,1))&\"％増）\",IF(W43/V43<1,\"○（\"&ABS(ROUND(100*W43/V43-100,1))&\"％減）\",\"\"))))),\"-\")","v":"○（17.7％減）"},{"$f":"IFERROR(IF(V43=\"-\",\"-\",\"（\"&TEXT(W43,\"#,###\")&\"-\"&TEXT(V43,\"#,###\")&\"）/\"&TEXT(V43,\"#,###\")&\"=\"&TEXT((W43-V43)/V43*100,\"0.0\")&\"%\"),\"-\")","v":"（6,793,400-8,251,417）/8,251,417=-17.7%"},{"$f":"IFERROR(IF(Y43=\"-\",\"-\",IF(Y43=\"\",\"-\",IF(Y43/X43=1,\"△\",IF(Y43/X43>1,\"-（\"&ABS(ROUND(100*Y43/X43-100,1))&\"％増）\",IF(Y43/X43<1,\"○（\"&ABS(ROUND(100*Y43/X43-100,1))&\"％減）\",\"\"))))),\"-\")","v":"○（29.7％減）"},{"$f":"IFERROR(IF(X43=\"-\",\"-\",\"（\"&TEXT(Y43,\"#,###\")&\"-\"&TEXT(X43,\"#,###\")&\"）/\"&TEXT(X43,\"#,###\")&\"=\"&TEXT((Y43-X43)/X43*100,\"0.0\")&\"%\"),\"-\")","v":"（5,855,900-8,330,250）/8,330,250=-29.7%"},{"$f":"IFERROR(IF(AA43=\"-\",\"-\",IF(AA43=\"\",\"-\",IF(AA43/Z43=1,\"△\",IF(AA43/Z43>1,\"-（\"&ABS(ROUND(100*AA43/Z43-100,1))&\"％増）\",IF(AA43/Z43<1,\"○（\"&ABS(ROUND(100*AA43/Z43-100,1))&\"％減）\",\"\"))))),\"-\")","v":"○（22.9％減）"},{"$f":"IFERROR(IF(Z43=\"-\",\"-\",\"（\"&TEXT(AA43,\"#,###\")&\"-\"&TEXT(Z43,\"#,###\")&\"）/\"&TEXT(Z43,\"#,###\")&\"=\"&TEXT((AA43-Z43)/Z43*100,\"0.0\")&\"%\"),\"-\")","v":"（6,364,800-8,251,417）/8,251,417=-22.9%"},{"$f":"IFERROR(IF(AC43=\"-\",\"-\",IF(AC43=\"\",\"-\",IF(AC43/AB43=1,\"△\",IF(AC43/AB43>1,\"-（\"&ABS(ROUND(100*AC43/AB43-100,1))&\"％増）\",IF(AC43/AB43<1,\"○（\"&ABS(ROUND(100*AC43/AB43-100,1))&\"％減）\",\"\"))))),\"-\")","v":"○（6.7％減）"},{"$f":"IFERROR(IF(AB43=\"-\",\"-\",\"（\"&TEXT(AC43,\"#,###\")&\"-\"&TEXT(AB43,\"#,###\")&\"）/\"&TEXT(AB43,\"#,###\")&\"=\"&TEXT((AC43-AB43)/AB43*100,\"0.0\")&\"%\"),\"-\")","v":"（7,774,500-8,330,250）/8,330,250=-6.7%"},{"$f":"IFERROR(IF(AE43=\"-\",\"-\",IF(AE43=\"\",\"-\",IF(AE43/AD43=1,\"△\",IF(AE43/AD43>1,\"-（\"&ABS(ROUND(100*AE43/AD43-100,1))&\"％増）\",IF(AE43/AD43<1,\"○（\"&ABS(ROUND(100*AE43/AD43-100,1))&\"％減）\",\"\"))))),\"-\")","v":"○（5.8％減）"},{"$f":"IFERROR(IF(AD43=\"-\",\"-\",\"（\"&TEXT(AE43,\"#,###\")&\"-\"&TEXT(AD43,\"#,###\")&\"）/\"&TEXT(AD43,\"#,###\")&\"=\"&TEXT((AE43-AD43)/AD43*100,\"0.0\")&\"%\"),\"-\")","v":"（7,774,500-8,251,417）/8,251,417=-5.8%"},{"$f":"IFERROR(IF(AG43=\"-\",\"-\",IF(AG43=\"\",\"-\",IF(AG43/AF43=1,\"△\",IF(AG43/AF43>1,\"-（\"&ABS(ROUND(100*AG43/AF43-100,1))&\"％増）\",IF(AG43/AF43<1,\"○（\"&ABS(ROUND(100*AG43/AF43-100,1))&\"％減）\",\"\"))))),\"-\")","v":"○（12.4％減）"},{"$f":"IFERROR(IF(AF43=\"-\",\"-\",\"（\"&TEXT(AG43,\"#,###\")&\"-\"&TEXT(AF43,\"#,###\")&\"）/\"&TEXT(AF43,\"#,###\")&\"=\"&TEXT((AG43-AF43)/AF43*100,\"0.0\")&\"%\"),\"-\")","v":"（7,226,600-8,251,417）/8,251,417=-12.4%"},{"$f":"IFERROR(IF(AI43=\"-\",\"-\",IF(AI43=\"\",\"-\",IF(AI43/AH43=1,\"△\",IF(AI43/AH43>1,\"-（\"&ABS(ROUND(100*AI43/AH43-100,1))&\"％増）\",IF(AI43/AH43<1,\"○（\"&ABS(ROUND(100*AI43/AH43-100,1))&\"％減）\",\"\"))))),\"-\")","v":"-"},{"$f":"IFERROR(IF(AH43=\"-\",\"-\",\"（\"&TEXT(AI43,\"#,###\")&\"-\"&TEXT(AH43,\"#,###\")&\"）/\"&TEXT(AH43,\"#,###\")&\"=\"&TEXT((AI43-AH43)/AH43*100,\"0.0\")&\"%\"),\"-\")","v":"-"},{"$f":"IFERROR(IF(AK43=\"-\",\"-\",IF(AK43=\"\",\"-\",IF(AK43/AJ43=1,\"△\",IF(AK43/AJ43>1,\"-（\"&ABS(ROUND(100*AK43/AJ43-100,1))&\"％増）\",IF(AK43/AJ43<1,\"○（\"&ABS(ROUND(100*AK43/AJ43-100,1))&\"％減）\",\"\"))))),\"-\")","v":"-"},{"$f":"IFERROR(IF(AJ43=\"-\",\"-\",\"（\"&TEXT(AK43,\"#,###\")&\"-\"&TEXT(AJ43,\"#,###\")&\"）/\"&TEXT(AJ43,\"#,###\")&\"=\"&TEXT((AK43-AJ43)/AJ43*100,\"0.0\")&\"%\"),\"-\")","v":"-"},{"$f":"IFERROR(IF(AM43=\"-\",\"-\",IF(AM43=\"\",\"-\",IF(AM43/AL43=1,\"△\",IF(AM43/AL43>1,\"-（\"&ABS(ROUND(100*AM43/AL43-100,1))&\"％増）\",IF(AM43/AL43<1,\"○（\"&ABS(ROUND(100*AM43/AL43-100,1))&\"％減）\",\"\"))))),\"-\")","v":"○（18.9％減）"},{"$f":"IFERROR(IF(AL43=\"-\",\"-\",\"（\"&TEXT(AM43,\"#,###\")&\"-\"&TEXT(AL43,\"#,###\")&\"）/\"&TEXT(AL43,\"#,###\")&\"=\"&TEXT((AM43-AL43)/AL43*100,\"0.0\")&\"%\"),\"-\")","v":"（6,759,400-8,330,250）/8,330,250=-18.9%"},{"$f":"IFERROR(IF(AO43=\"-\",\"-\",IF(AO43=\"\",\"-\",IF(AO43/AN43=1,\"△\",IF(AO43/AN43>1,\"-（\"&ABS(ROUND(100*AO43/AN43-100,1))&\"％増）\",IF(AO43/AN43<1,\"○（\"&ABS(ROUND(100*AO43/AN43-100,1))&\"％減）\",\"\"))))),\"-\")","v":"○（9％減）"},{"$f":"IFERROR(IF(AN43=\"-\",\"-\",\"（\"&TEXT(AO43,\"#,###\")&\"-\"&TEXT(AN43,\"#,###\")&\"）/\"&TEXT(AN43,\"#,###\")&\"=\"&TEXT((AO43-AN43)/AN43*100,\"0.0\")&\"%\"),\"-\")","v":"（7,508,300-8,251,417）/8,251,417=-9.0%"},{"$f":"IFERROR(IF(AQ43=\"-\",\"-\",IF(AQ43=\"\",\"-\",IF(AQ43/AP43=1,\"△\",IF(AQ43/AP43>1,\"-（\"&ABS(ROUND(100*AQ43/AP43-100,1))&\"％増）\",IF(AQ43/AP43<1,\"○（\"&ABS(ROUND(100*AQ43/AP43-100,1))&\"％減）\",\"\"))))),\"-\")","v":"○（18.1％減）"},{"$f":"IFERROR(IF(AP43=\"-\",\"-\",\"（\"&TEXT(AQ43,\"#,###\")&\"-\"&TEXT(AP43,\"#,###\")&\"）/\"&TEXT(AP43,\"#,###\")&\"=\"&TEXT((AQ43-AP43)/AP43*100,\"0.0\")&\"%\"),\"-\")","v":"（6,823,700-8,330,250）/8,330,250=-18.1%"},{"$f":"IFERROR(IF(AS43=\"-\",\"-\",IF(AS43=\"\",\"-\",IF(AS43/AR43=1,\"△\",IF(AS43/AR43>1,\"-（\"&ABS(ROUND(100*AS43/AR43-100,1))&\"％増）\",IF(AS43/AR43<1,\"○（\"&ABS(ROUND(100*AS43/AR43-100,1))&\"％減）\",\"\"))))),\"-\")","v":"-（11.6％増）"},{"$f":"IFERROR(IF(AR43=\"-\",\"-\",\"（\"&TEXT(AS43,\"#,###\")&\"-\"&TEXT(AR43,\"#,###\")&\"）/\"&TEXT(AR43,\"#,###\")&\"=\"&TEXT((AS43-AR43)/AR43*100,\"0.0\")&\"%\"),\"-\")","v":"（9,209,100-8,251,417）/8,251,417=11.6%"}]
[null,null,null,"工程",null,{"$f":"IFERROR(IF(G44=\"-\",\"-\",IF(G44=\"\",\"-\",IF(ROUND(G44,2)/F44=1,\"△\",IF(ROUND(G44,2)/F44>1,\"-（\"&ABS(ROUND(100*G44/F44-100,1))&\"％増）\",IF(G44/F44<1,\"○（\"&ABS(ROUND(100*G44/F44-100,1))&\"％減）\",\"\"))))),\"-\")","v":"-（8.5％増）"},{"$f":"IFERROR(IF(F44=\"-\",\"-\",\"（\"&TEXT(G44,\"##0.000\")&\"-\"&TEXT(F44,\"##0.000\")&\"）/\"&TEXT(F44,\"##0.000\")&\"=\"&TEXT((G44-F44)/F44*100,\"0.0\")&\"%\"),\"-\")","v":"（13.300-12.260）/12.260=8.5%"},{"$f":"IFERROR(IF(I44=\"-\",\"-\",IF(I44=\"\",\"-\",IF(ROUND(I44,2)/H44=1,\"△\",IF(ROUND(I44,2)/H44>1,\"-（\"&ABS(ROUND(100*I44/H44-100,1))&\"％増）\",IF(I44/H44<1,\"○（\"&ABS(ROUND(100*I44/H44-100,1))&\"％減）\",\"\"))))),\"-\")","v":"-"},{"$f":"IFERROR(IF(H44=\"-\",\"-\",\"（\"&TEXT(I44,\"##0.000\")&\"-\"&TEXT(H44,\"##0.000\")&\"）/\"&TEXT(H44,\"##0.000\")&\"=\"&TEXT((I44-H44)/H44*100,\"0.0\")&\"%\"),\"-\")","v":"-"},{"$f":"IFERROR(IF(K44=\"-\",\"-\",IF(K44=\"\",\"-\",IF(ROUND(K44,2)/J44=1,\"△\",IF(ROUND(K44,2)/J44>1,\"-（\"&ABS(ROUND(100*K44/J44-100,1))&\"％増）\",IF(K44/J44<1,\"○（\"&ABS(ROUND(100*K44/J44-100,1))&\"％減）\",\"\"))))),\"-\")","v":"-"},{"$f":"IFERROR(IF(J44=\"-\",\"-\",\"（\"&TEXT(K44,\"##0.000\")&\"-\"&TEXT(J44,\"##0.000\")&\"）/\"&TEXT(J44,\"##0.000\")&\"=\"&TEXT((K44-J44)/J44*100,\"0.0\")&\"%\"),\"-\")","v":"-"},{"$f":"IFERROR(IF(M44=\"-\",\"-\",IF(M44=\"\",\"-\",IF(ROUND(M44,2)/L44=1,\"△\",IF(ROUND(M44,2)/L44>1,\"-（\"&ABS(ROUND(100*M44/L44-100,1))&\"％増）\",IF(M44/L44<1,\"○（\"&ABS(ROUND(100*M44/L44-100,1))&\"％減）\",\"\"))))),\"-\")","v":"-"},{"$f":"IFERROR(IF(L44=\"-\",\"-\",\"（\"&TEXT(M44,\"##0.000\")&\"-\"&TEXT(L44,\"##0.000\")&\"）/\"&TEXT(L44,\"##0.000\")&\"=\"&TEXT((M44-L44)/L44*100,\"0.0\")&\"%\"),\"-\")","v":"-"},{"$f":"IFERROR(IF(O44=\"-\",\"-\",IF(O44=\"\",\"-\",IF(ROUND(O44,2)/N44=1,\"△\",IF(ROUND(O44,2)/N44>1,\"-（\"&ABS(ROUND(100*O44/N44-100,1))&\"％増）\",IF(O44/N44<1,\"○（\"&ABS(ROUND(100*O44/N44-100,1))&\"％減）\",\"\"))))),\"-\")","v":"-"},{"$f":"IFERROR(IF(N44=\"-\",\"-\",\"（\"&TEXT(O44,\"##0.000\")&\"-\"&TEXT(N44,\"##0.000\")&\"）/\"&TEXT(N44,\"##0.000\")&\"=\"&TEXT((O44-N44)/N44*100,\"0.0\")&\"%\"),\"-\")","v":"-"},{"$f":"IFERROR(IF(Q44=\"-\",\"-\",IF(Q44=\"\",\"-\",IF(ROUND(Q44,2)/P44=1,\"△\",IF(ROUND(Q44,2)/P44>1,\"-（\"&ABS(ROUND(100*Q44/P44-100,1))&\"％増）\",IF(Q44/P44<1,\"○（\"&ABS(ROUND(100*Q44/P44-100,1))&\"％減）\",\"\"))))),\"-\")","v":"○（21.7％減）"},{"$f":"IFERROR(IF(P44=\"-\",\"-\",\"（\"&TEXT(Q44,\"##0.000\")&\"-\"&TEXT(P44,\"##0.000\")&\"）/\"&TEXT(P44,\"##0.000\")&\"=\"&TEXT((Q44-P44)/P44*100,\"0.0\")&\"%\"),\"-\")","v":"（9.597-12.260）/12.260=-21.7%"},{"$f":"IFERROR(IF(S44=\"-\",\"-\",IF(S44=\"\",\"-\",IF(ROUND(S44,2)/R44=1,\"△\",IF(ROUND(S44,2)/R44>1,\"-（\"&ABS(ROUND(100*S44/R44-100,1))&\"％増）\",IF(S44/R44<1,\"○（\"&ABS(ROUND(100*S44/R44-100,1))&\"％減）\",\"\"))))),\"-\")","v":"○（3.6％減）"},{"$f":"IFERROR(IF(R44=\"-\",\"-\",\"（\"&TEXT(S44,\"##0.000\")&\"-\"&TEXT(R44,\"##0.000\")&\"）/\"&TEXT(R44,\"##0.000\")&\"=\"&TEXT((S44-R44)/R44*100,\"0.0\")&\"%\"),\"-\")","v":"（11.380-11.810）/11.810=-3.6%"},{"$f":"IFERROR(IF(U44=\"-\",\"-\",IF(U44=\"\",\"-\",IF(ROUND(U44,2)/T44=1,\"△\",IF(ROUND(U44,2)/T44>1,\"-（\"&ABS(ROUND(100*U44/T44-100,1))&\"％増）\",IF(U44/T44<1,\"○（\"&ABS(ROUND(100*U44/T44-100,1))&\"％減）\",\"\"))))),\"-\")","v":"○（3.7％減）"},{"$f":"IFERROR(IF(T44=\"-\",\"-\",\"（\"&TEXT(U44,\"##0.000\")&\"-\"&TEXT(T44,\"##0.000\")&\"）/\"&TEXT(T44,\"##0.000\")&\"=\"&TEXT((U44-T44)/T44*100,\"0.0\")&\"%\"),\"-\")","v":"（11.806-12.260）/12.260=-3.7%"},{"$f":"IFERROR(IF(W44=\"-\",\"-\",IF(W44=\"\",\"-\",IF(ROUND(W44,2)/V44=1,\"△\",IF(ROUND(W44,2)/V44>1,\"-（\"&ABS(ROUND(100*W44/V44-100,1))&\"％増）\",IF(W44/V44<1,\"○（\"&ABS(ROUND(100*W44/V44-100,1))&\"％減）\",\"\"))))),\"-\")","v":"△"},{"$f":"IFERROR(IF(V44=\"-\",\"-\",\"（\"&TEXT(W44,\"##0.000\")&\"-\"&TEXT(V44,\"##0.000\")&\"）/\"&TEXT(V44,\"##0.000\")&\"=\"&TEXT((W44-V44)/V44*100,\"0.0\")&\"%\"),\"-\")","v":"（11.806-11.810）/11.810=0.0%"},{"$f":"IFERROR(IF(Y44=\"-\",\"-\",IF(Y44=\"\",\"-\",IF(ROUND(Y44,2)/X44=1,\"△\",IF(ROUND(Y44,2)/X44>1,\"-（\"&ABS(ROUND(100*Y44/X44-100,1))&\"％増）\",IF(Y44/X44<1,\"○（\"&ABS(ROUND(100*Y44/X44-100,1))&\"％減）\",\"\"))))),\"-\")","v":"○（3.7％減）"},{"$f":"IFERROR(IF(X44=\"-\",\"-\",\"（\"&TEXT(Y44,\"##0.000\")&\"-\"&TEXT(X44,\"##0.000\")&\"）/\"&TEXT(X44,\"##0.000\")&\"=\"&TEXT((Y44-X44)/X44*100,\"0.0\")&\"%\"),\"-\")","v":"（11.806-12.260）/12.260=-3.7%"},{"$f":"IFERROR(IF(AA44=\"-\",\"-\",IF(AA44=\"\",\"-\",IF(ROUND(AA44,2)/Z44=1,\"△\",IF(ROUND(AA44,2)/Z44>1,\"-（\"&ABS(ROUND(100*AA44/Z44-100,1))&\"％増）\",IF(AA44/Z44<1,\"○（\"&ABS(ROUND(100*AA44/Z44-100,1))&\"％減）\",\"\"))))),\"-\")","v":"△"},{"$f":"IFERROR(IF(Z44=\"-\",\"-\",\"（\"&TEXT(AA44,\"##0.000\")&\"-\"&TEXT(Z44,\"##0.000\")&\"）/\"&TEXT(Z44,\"##0.000\")&\"=\"&TEXT((AA44-Z44)/Z44*100,\"0.0\")&\"%\"),\"-\")","v":"（11.806-11.810）/11.810=0.0%"},{"$f":"IFERROR(IF(AC44=\"-\",\"-\",IF(AC44=\"\",\"-\",IF(ROUND(AC44,2)/AB44=1,\"△\",IF(ROUND(AC44,2)/AB44>1,\"-（\"&ABS(ROUND(100*AC44/AB44-100,1))&\"％増）\",IF(AC44/AB44<1,\"○（\"&ABS(ROUND(100*AC44/AB44-100,1))&\"％減）\",\"\"))))),\"-\")","v":"○（10.2％減）"},{"$f":"IFERROR(IF(AB44=\"-\",\"-\",\"（\"&TEXT(AC44,\"##0.000\")&\"-\"&TEXT(AB44,\"##0.000\")&\"）/\"&TEXT(AB44,\"##0.000\")&\"=\"&TEXT((AC44-AB44)/AB44*100,\"0.0\")&\"%\"),\"-\")","v":"（11.013-12.260）/12.260=-10.2%"},{"$f":"IFERROR(IF(AE44=\"-\",\"-\",IF(AE44=\"\",\"-\",IF(ROUND(AE44,2)/AD44=1,\"△\",IF(ROUND(AE44,2)/AD44>1,\"-（\"&ABS(ROUND(100*AE44/AD44-100,1))&\"％増）\",IF(AE44/AD44<1,\"○（\"&ABS(ROUND(100*AE44/AD44-100,1))&\"％減）\",\"\"))))),\"-\")","v":"○（6.7％減）"},{"$f":"IFERROR(IF(AD44=\"-\",\"-\",\"（\"&TEXT(AE44,\"##0.000\")&\"-\"&TEXT(AD44,\"##0.000\")&\"）/\"&TEXT(AD44,\"##0.000\")&\"=\"&TEXT((AE44-AD44)/AD44*100,\"0.0\")&\"%\"),\"-\")","v":"（11.013-11.810）/11.810=-6.7%"},{"$f":"IFERROR(IF(AG44=\"-\",\"-\",IF(AG44=\"\",\"-\",IF(ROUND(AG44,2)/AF44=1,\"△\",IF(ROUND(AG44,2)/AF44>1,\"-（\"&ABS(ROUND(100*AG44/AF44-100,1))&\"％増）\",IF(AG44/AF44<1,\"○（\"&ABS(ROUND(100*AG44/AF44-100,1))&\"％減）\",\"\"))))),\"-\")","v":"-（51.5％増）"},{"$f":"IFERROR(IF(AF44=\"-\",\"-\",\"（\"&TEXT(AG44,\"##0.000\")&\"-\"&TEXT(AF44,\"##0.000\")&\"）/\"&TEXT(AF44,\"##0.000\")&\"=\"&TEXT((AG44-AF44)/AF44*100,\"0.0\")&\"%\"),\"-\")","v":"（17.890-11.810）/11.810=51.5%"},{"$f":"IFERROR(IF(AI44=\"-\",\"-\",IF(AI44=\"\",\"-\",IF(ROUND(AI44,2)/AH44=1,\"△\",IF(ROUND(AI44,2)/AH44>1,\"-（\"&ABS(ROUND(100*AI44/AH44-100,1))&\"％増）\",IF(AI44/AH44<1,\"○（\"&ABS(ROUND(100*AI44/AH44-100,1))&\"％減）\",\"\"))))),\"-\")","v":"-"},{"$f":"IFERROR(IF(AH44=\"-\",\"-\",\"（\"&TEXT(AI44,\"##0.000\")&\"-\"&TEXT(AH44,\"##0.000\")&\"）/\"&TEXT(AH44,\"##0.000\")&\"=\"&TEXT((AI44-AH44)/AH44*100,\"0.0\")&\"%\"),\"-\")","v":"-"},{"$f":"IFERROR(IF(AK44=\"-\",\"-\",IF(AK44=\"\",\"-\",IF(ROUND(AK44,2)/AJ44=1,\"△\",IF(ROUND(AK44,2)/AJ44>1,\"-（\"&ABS(ROUND(100*AK44/AJ44-100,1))&\"％増）\",IF(AK44/AJ44<1,\"○（\"&ABS(ROUND(100*AK44/AJ44-100,1))&\"％減）\",\"\"))))),\"-\")","v":"-"},{"$f":"IFERROR(IF(AJ44=\"-\",\"-\",\"（\"&TEXT(AK44,\"##0.000\")&\"-\"&TEXT(AJ44,\"##0.000\")&\"）/\"&TEXT(AJ44,\"##0.000\")&\"=\"&TEXT((AK44-AJ44)/AJ44*100,\"0.0\")&\"%\"),\"-\")","v":"-"},{"$f":"IFERROR(IF(AM44=\"-\",\"-\",IF(AM44=\"\",\"-\",IF(ROUND(AM44,2)/AL44=1,\"△\",IF(ROUND(AM44,2)/AL44>1,\"-（\"&ABS(ROUND(100*AM44/AL44-100,1))&\"％増）\",IF(AM44/AL44<1,\"○（\"&ABS(ROUND(100*AM44/AL44-100,1))&\"％減）\",\"\"))))),\"-\")","v":"○（32.6％減）"},{"$f":"IFERROR(IF(AL44=\"-\",\"-\",\"（\"&TEXT(AM44,\"##0.000\")&\"-\"&TEXT(AL44,\"##0.000\")&\"）/\"&TEXT(AL44,\"##0.000\")&\"=\"&TEXT((AM44-AL44)/AL44*100,\"0.0\")&\"%\"),\"-\")","v":"（8.260-12.260）/12.260=-32.6%"},{"$f":"IFERROR(IF(AO44=\"-\",\"-\",IF(AO44=\"\",\"-\",IF(ROUND(AO44,2)/AN44=1,\"△\",IF(ROUND(AO44,2)/AN44>1,\"-（\"&ABS(ROUND(100*AO44/AN44-100,1))&\"％増）\",IF(AO44/AN44<1,\"○（\"&ABS(ROUND(100*AO44/AN44-100,1))&\"％減）\",\"\"))))),\"-\")","v":"○（23.8％減）"},{"$f":"IFERROR(IF(AN44=\"-\",\"-\",\"（\"&TEXT(AO44,\"##0.000\")&\"-\"&TEXT(AN44,\"##0.000\")&\"）/\"&TEXT(AN44,\"##0.000\")&\"=\"&TEXT((AO44-AN44)/AN44*100,\"0.0\")&\"%\"),\"-\")","v":"（9.000-11.810）/11.810=-23.8%"},{"$f":"IFERROR(IF(AQ44=\"-\",\"-\",IF(AQ44=\"\",\"-\",IF(ROUND(AQ44,2)/AP44=1,\"△\",IF(ROUND(AQ44,2)/AP44>1,\"-（\"&ABS(ROUND(100*AQ44/AP44-100,1))&\"％増）\",IF(AQ44/AP44<1,\"○（\"&ABS(ROUND(100*AQ44/AP44-100,1))&\"％減）\",\"\"))))),\"-\")","v":"○（31.3％減）"},{"$f":"IFERROR(IF(AP44=\"-\",\"-\",\"（\"&TEXT(AQ44,\"##0.000\")&\"-\"&TEXT(AP44,\"##0.000\")&\"）/\"&TEXT(AP44,\"##0.000\")&\"=\"&TEXT((AQ44-AP44)/AP44*100,\"0.0\")&\"%\"),\"-\")","v":"（8.420-12.260）/12.260=-31.3%"},{"$f":"IFERROR(IF(AS44=\"-\",\"-\",IF(AS44=\"\",\"-\",IF(ROUND(AS44,2)/AR44=1,\"△\",IF(ROUND(AS44,2)/AR44>1,\"-（\"&ABS(ROUND(100*AS44/AR44-100,1))&\"％増）\",IF(AS44/AR44<1,\"○（\"&ABS(ROUND(100*AS44/AR44-100,1))&\"％減）\",\"\"))))),\"-\")","v":"○（28.7％減）"},{"$f":"IFERROR(IF(AR44=\"-\",\"-\",\"（\"&TEXT(AS44,\"##0.000\")&\"-\"&TEXT(AR44,\"##0.000\")&\"）/\"&TEXT(AR44,\"##0.000\")&\"=\"&TEXT((AS44-AR44)/AR44*100,\"0.0\")&\"%\"),\"-\")","v":"（8.420-11.810）/11.810=-28.7%"}]
[null,"⑰","統一した従来技術との比較\n判定の凡例 \n○：従来技術より優れる\n△：従来技術と同程度\n－：上記以外","品質・出来形",null,"△：従来技術と同程度。",null,"△：従来技術と同程度。",null,"△：従来技術と同程度。",null,"△：従来技術と同程度。",null,"△：従来技術と同程度。",null,"△：従来技術と同程度。",null,"△：従来技術と同程度。",null,"△：従来技術と同程度。",null,"△：従来技術と同程度。",null,"△：従来技術と同程度。",null,"△：従来技術と同程度。",null,"△：従来技術と同程度。",null,"△：従来技術と同程度。",null,"△：従来技術と同程度。",null,"△：従来技術と同程度。",null,"△：従来技術と同程度。",null,"△：従来技術と同程度。",null,"△：従来技術と同程度。",null,"△：従来技術と同程度。",null,"△：従来技術と同程度。"]
[null,null,null,"安全性",null,"△：従来技術と同程度。",null,"△：従来技術と同程度。",null,"△：従来技術と同程度。",null,"△：従来技術と同程度。",null,"△：従来技術と同程度。",null,"△：従来技術と同程度。",null,"△：従来技術と同程度。",null,"△：従来技術と同程度。",null,"△：従来技術と同程度。",null,"△：従来技術と同程度。",null,"△：従来技術と同程度。",null,"△：従来技術と同程度。",null,"△：従来技術と同程度。",null,"△：従来技術と同程度。",null,"△：従来技術と同程度。",null,"△：従来技術と同程度。",null,"△：従来技術と同程度。",null,"△：従来技術と同程度。",null,"△：従来技術と同程度。",null,"△：従来技術と同程度。"]
[null,null,null,"施工性",null,"△：従来技術と同程度。",null,"〇：中詰材と水抜きパイプが不要であり、連結金具による連結であるため、曲線施工が容易となる。",null,"△：従来技術と同程度。",null,"〇：自立する大型ブロックで、胴込コンクリートを一体化したブロックの為、胴込コンクリートを不要とした。",null,"△：従来技術と同程度。",null,"△：従来技術と同程度。",null,"△：従来技術と同程度。",null,"△：従来技術と同程度。",null,"△：従来技術と同程度。",null,"△：従来技術と同程度。",null,"△：従来技術と同程度。",null,"△：従来技術と同程度。",null,"△：従来技術と同程度。",null,"△：従来技術と同程度。",null,"△：従来技術と同程度。",null,"△：従来技術と同程度。",null,"△：従来技術と同程度。",null,"△：従来技術と同程度。",null,"△：従来技術と同程度。",null,"△：従来技術と同程度。"]
[null,null,null,"環境",null,"△：従来技術と同程度。",null,"△：従来技術と同程度。",null,"○：水中部では魚類や甲殻類の生息場を与え、水際部においては植生や背後地との連続性に優れるため、地下水などの水循環を促進して周辺環境の改善も期待できる。",null,"△：従来技術と同程度。",null,"△：従来技術と同程度。",null,"○：建設副産物である現地発生土やコンクリート瓦礫を中詰材として再利用できるため、効率的な処理が行なえる。",null,"○：建設副産物である現地発生土やコンクリート瓦礫を中詰材として再利用できるため、効率的な処理が行なえる。",null,"△：従来技術と同程度。",null,"△：従来技術と同程度。",null,"○：専用裏型枠のKCパネルは、リサイクル素材を用いた製品で環境に影響が無いため、脱型をせずに埋めて使用するので、廃材が出ない。",null,"○：専用裏型枠のKCパネルは、リサイクル素材を用いた製品で環境に影響が無いため、脱型をせずに埋めて使用するので、廃材が出ない。",null,"△：従来技術と同程度。",null,"△：従来技術と同程度。",null,"△：従来技術と同程度。",null,"△：従来技術と同程度。",null,"△：従来技術と同程度。",null,"△：従来技術と同程度。",null,"△：従来技術と同程度。",null,"△：従来技術と同程度。",null,"△：従来技術と同程度。"]
[null,"⑱","大型積みブロックの材料・品質規格","コンクリートブロック製品のコンクリート強度","規格・構造","プレキャスト鉄筋コンクリート",null,"無筋コンクリート",null,"プレキャスト鉄筋コンクリート",null,"プレキャスト無筋コンクリート",null,"プレキャスト無筋コンクリート",null,"プレキャスト鉄筋コンクリート",null,"プレキャスト鉄筋コンクリート",null,"プレキャスト鉄筋コンクリート",null,"プレキャスト鉄筋コンクリート",null,"プレキャスト鉄筋コンクリート",null,"プレキャスト鉄筋コンクリート",null,"プレキャスト無筋コンクリート",null,"プレキャスト無筋コンクリート",null,"プレキャスト鉄筋コンクリート",null,"プレキャスト鉄筋コンクリート",null,"プレキャスト鉄筋コンクリート",null,"プレキャスト鉄筋コンクリート",null,"プレキャスト鉄筋コンクリート",null,"プレキャスト鉄筋コンクリート",null,"プレキャスト鉄筋コンクリート"]
[null,null,null,null,"基準・比較対象","設計基準強度30N/mm2以上（道路プレキャストコンクリート工指針）",null,"設計基準強度18N/mm2（土木工事設計要領）",null,"設計基準強度30N/mm2以上（道路プレキャストコンクリート工指針）",null,"設計基準強度21N/mm2以上（道路プレキャストコンクリート工指針）",null,"設計基準強度21N/mm2以上（道路プレキャストコンクリート工指針）",null,"設計基準強度30N/mm2以上（道路プレキャストコンクリート工指針）",null,"設計基準強度30N/mm2以上（道路プレキャストコンクリート工指針）",null,"設計基準強度30N/mm2以上（道路プレキャストコンクリート工指針）",null,"設計基準強度30N/mm2以上（道路プレキャストコンクリート工指針）",null,"設計基準強度30N/mm2以上（道路プレキャストコンクリート工指針）",null,"設計基準強度30N/mm2以上（道路プレキャストコンクリート工指針）",null,"設計基準強度21N/mm2以上（道路プレキャストコンクリート工指針）",null,"設計基準強度21N/mm2以上（道路プレキャストコンクリート工指針）",null,"設計基準強度30N/mm2以上（道路プレキャストコンクリート工指針）",null,"設計基準強度30N/mm2以上（道路プレキャストコンクリート工指針）",null,"設計基準強度30N/mm2以上（道路プレキャストコンクリート工指針）",null,"設計基準強度30N/mm2以上（道路プレキャストコンクリート工指針）",null,"設計基準強度30N/mm2以上（道路プレキャストコンクリート工指針）",null,"設計基準強度30N/mm2以上（道路プレキャストコンクリート工指針）",null,"設計基準強度30N/mm2以上（道路プレキャストコンクリート工指針）"]
[null,null,null,null,"試験結果","設計基準強度36.9N/mm2",null,"設計基準強度18N/mm2",null,"設計基準強度35N/mm2",null,"設計基準強度21N/mm2",null,"設計基準強度41.4N/mm2",null,"設計基準強度30N/mm2",null,"設計基準強度30N/mm2",null,"設計基準強度57.4N/mm2",null,"設計基準強度57.4N/mm2",null,"設計基準強度30N/mm2",null,"設計基準強度30N/mm2",null,"設計基準強度30N/mm2",null,"設計基準強度30N/mm2",null,"設計基準強度33～42N/mm2",null,"設計基準強度30N/mm2",null,"設計基準強度30N/mm2",null,"設計基準強度31.5N/mm2",null,"設計基準強度31.5N/mm2",null,"設計基準強度30N/mm2",null,"設計基準強度30N/mm2"]
[null,null,null,"ブロック間の結合部強度","規格・構造","-",null,"-",null,"-",null,"-",null,"-",null,"-",null,"-",null,"-",null,"-",null,"-",null,"-",null,"-",null,"-",null,"-",null,"-",null,"-",null,"-",null,"-",null,"-",null,"-"]
[null,null,null,null,"基準・比較対象","-",null,"-",null,"-",null,"-",null,"-",null,"-",null,"-",null,"-",null,"-",null,"-",null,"-",null,"-",null,"-",null,"-",null,"-",null,"-",null,"-",null,"-",null,"-",null,"-"]
[null,null,null,null,"試験結果","-",null,"-",null,"-",null,"-",null,"-",null,"-",null,"-",null,"-",null,"-",null,"-",null,"-",null,"-",null,"-",null,"-",null,"-",null,"-",null,"-",null,"-",null,"-",null,"-"]
[null,null,null,"その他の試験結果",null,"",null,"",null,"",null,"",null,"",null,"",null,"",null,"",null,"",null,"",null,"",null,"",null,"",null,"",null,"",null,"",null,"",null,"",null,"",null,""]
[null,"⑲","施工実績\n（過去３年）","国土交通省：活用効果調査表数",null,"8件（九州で8件）",null,"0件（九州で0件）",null,"0件（九州で0件）",null,"0件（九州で0件）",null,"0件（九州で0件）",null,"30件（九州で5件）",null,"30件（九州で5件）",null,"20件（九州で0件）",null,"20件（九州で0件）",null,"51件（九州で3件）",null,"51件（九州で3件）",null,"35件（九州で0件）",null,"35件（九州で0件）",null,"28件（九州で4件）",null,"16件（九州で6件）",null,"16件（九州で6件）",null,"49件（九州で15件）",null,"49件（九州で15件）",null,"0件（九州で0件）",null,"0件（九州で0件）"]
[null,null,null,"地方自治体：開発者ヒアリング",null,"100件（九州で100件）",null,"7件（九州で5件）",null,"6件（九州で6件）",null,"375件（九州で5件）",null,"25件（九州で2件）",null,"3件（九州で3件）",null,"3件（九州で3件）",null,"53件（九州で1件）",null,"53件（九州で1件）",null,"155件（九州で10件）",null,"155件（九州で10件）",null,"多数件（九州で0件）",null,"多数件（九州で0件）",null,"50件（九州で10件）",null,"未回答",null,"未回答",null,"190件（九州で0件）",null,"190件（九州で0件）",null,"215件（九州で52件）",null,"215件（九州で52件）"]
[null,null,null,"その他：開発者ヒアリング",null,"0件（九州で0件）",null,"0件（九州で0件）",null,"0件（九州で0件）",null,"70件（九州で0件）",null,"2件（九州で0件）",null,"0件（九州で0件）",null,"0件（九州で0件）",null,"12件（九州で1件）",null,"12件（九州で1件）",null,"62件（九州で3件）",null,"62件（九州で3件）",null,"0件（九州で0件）",null,"0件（九州で0件）",null,"1件（九州で0件）",null,"未回答",null,"未回答",null,"0件（九州で0件）",null,"0件（九州で0件）",null,"5件（九州で0件）",null,"5件（九州で0件）"]
[null,"⑳","特許等","特許",null,"-",null,"-",null,"第5065527号擁壁構造及び植栽可能な擁壁構築法、第4809431号構造物の基礎部構造及び擁壁、第5309295号構造物におけるブロックの上下境界部構造及び構造物",null,"第5958622号　擁壁構造及び植栽可能な擁壁構築法",null,"-",null,"第5816420号擁壁構築用貯水ブロック",null,"第5816420号擁壁構築用貯水ブロック",null,"-",null,"-",null,"-",null,"-",null,"第4576018号擁壁",null,"第4576018号擁壁",null,"-",null,"第2858079号ビン型擁壁",null,"第2858079号ビン型擁壁",null,"-",null,"-",null,"第6359733号　擁壁用積ブロック、第6359750号　擁壁用積ブロック",null,"第6359733号　擁壁用積ブロック、第6359750号　擁壁用積ブロック"]
[null,null,null,"建設技術審査証明",null,"-",null,"-",null,"-",null,"-",null,"-",null,"-",null,"-",null,"-",null,"-",null,"-",null,"-",null,"-",null,"-",null,"-",null,"一般財団法人土木研究センター　建技審証第0327号　平成31年3月31日",null,"一般財団法人土木研究センター　建技審証第0327号　平成31年3月31日",null,"-",null,"-",null,"-",null,"-"]
[null,"㉑","作業空間",null,null,"製品仮置きヤード：1.0ｍ×5.0ｍ程度、作業ヤード：ブロック基礎より3.0m程度",null,"作業ヤード：大型車両(10t車)による製品搬入が可能であること、ブロック吊上げ機(ラフテレーンクレーン25t吊)等の施工ヤードが確保できること",null,"製品仮置きヤード：ブロック20個あたりの置場として7ｍ×6ｍ程度、作業ヤード：クレーンの作業スペースとして5ｍ×10ｍ程度",null,"製品仮置きヤード：20～30㎡程度、作業ヤード：稼働時ばバックホーの半径8.0m以内",null,"製品仮置きヤード：ブロック施工面積100m2・基礎工25mにつき、幅5m×長さ12m=60m2程度、作業ヤード：ラフテレーンクレーン16tの作業半径24m×最大高さ31.3m",null,"製品仮置きヤード：2ｍ×5ｍ＝10ｍ2程度以上、作業ヤード：据付時に使用するクレーン等の大型重機の作業スペースを確保すること",null,"製品仮置きヤード：2ｍ×5ｍ＝10ｍ2程度以上、作業ヤード：据付時に使用するクレーン等の大型重機の作業スペースを確保すること",null,"製品仮置きヤード：製品A型を8個で20.0㎡程度、作業ヤード：10t車1台、16tラフテレーンクレーン車1台で68.9㎡程度必要",null,"製品仮置きヤード：製品A型を8個で20.0㎡程度、作業ヤード：10t車1台、16tラフテレーンクレーン車1台で68.9㎡程度必要",null,"製品仮置きヤード：施工機械:16tラフテレーンクレーン(現場条件により大きさを選定)が設置できるスペースが確保されていること、作業ヤード：1パネル当たり、1m×3m程度",null,"製品仮置きヤード：施工機械:16tラフテレーンクレーン(現場条件により大きさを選定)が設置できるスペースが確保されていること、作業ヤード：1パネル当たり、1m×3m程度",null,"・作業ヤード：トラック及び16tクレーンなどの施工機械の搬入が可能な箇所",null,"・作業ヤード：トラック及び16tクレーンなどの施工機械の搬入が可能な箇所",null,"作業ヤード：16ｔクレーン以上の施工機械の搬入が可能な場所",null,"・作業ヤード：施工機械16t吊クレーン（現場条件により大きさを選定）が設置できるスペースが確保されていること",null,"・作業ヤード：施工機械16t吊クレーン（現場条件により大きさを選定）が設置できるスペースが確保されていること",null,"・ブロックを仮置するヤードが必要。・所定のクレーンが搬入・作業できるスペースが必要。",null,"・ブロックを仮置するヤードが必要。・所定のクレーンが搬入・作業できるスペースが必要。",null,"製品仮置きヤード：5.0ｍ×10.0ｍ程度、作業ヤード：ブロック基礎より5.0ｍ程度",null,"製品仮置きヤード：5.0ｍ×10.0ｍ程度、作業ヤード：ブロック基礎より5.0ｍ程度"]
[null,"㉒","生産供給体制（販売拠点、製造工場、納期等）",null,null,"・技術提供可能地域：全国　・在庫として1000㎡程度保有(製造工場：福岡県田川郡香春町)",null,"技術提供可能地域：全国",null,"技術提供可能地域：全国、納期は受注生産とし、1ヶ月程度で納入可能",null,"技術提供は全国、機械の保有台数80台（全タイプの計）",null,"技術提供可能地域：全国",null,"-",null,"-",null,"・技術提供可能地域：九州管内全域\n・供給可能地域：委託販売先は福岡県、佐賀県、長崎県、熊本県、大分県、宮崎県、鹿児島県の13社にて供給体制を構築",null,"・技術提供可能地域：九州管内全域\n・供給可能地域：委託販売先は福岡県、佐賀県、長崎県、熊本県、大分県、宮崎県、鹿児島県の13社にて供給体制を構築",null,"・技術提供可能地域：九州管内全域\n・供給可能地域：委託販売先は福岡県、佐賀県、長崎県、熊本県、大分県、宮崎県、鹿児島県の13社にて供給体制を構築",null,"・技術提供可能地域：九州管内全域\n・供給可能地域：委託販売先は福岡県、佐賀県、長崎県、熊本県、大分県、宮崎県、鹿児島県の13社にて供給体制を構築",null,"納入地域に近い協力工場で委託生産し、納入計画を立てる。",null,"納入地域に近い協力工場で委託生産し、納入計画を立てる。",null,"-",null,"未回答",null,"未回答",null,"九州管内",null,"九州管内",null,"東北（福島）　関東（栃木・群馬・千葉）　中部（三重・岐阜・長野・福井・新潟）　近畿（滋賀）　中国（山口・広島・島根・鳥取）　四国（高知・徳島）　九州（福岡・熊本・佐賀・大分・鹿児島）組立15～20個（パネル在庫があれば）/日",null,"東北（福島）　関東（栃木・群馬・千葉）　中部（三重・岐阜・長野・福井・新潟）　近畿（滋賀）　中国（山口・広島・島根・鳥取）　四国（高知・徳島）　九州（福岡・熊本・佐賀・大分・鹿児島）組立15～20個（パネル在庫があれば）/日"]
[null,"㉓","備考",null,null,"-",null,"-",null,"-",null,"-",null,"-",null,"-",null,"-",null,"-",null,"-",null,"-",null,"-",null,"-",null,"-",null,"-",null,"-",null,"-",null,"-",null,"-",null,"-",null,"-"]
["発注者ニーズへの適応性","㉔","統一した従来技術との比較評価","省人化・省力化",null,"△：作業工程が同等であるため、省人化・省力化は従来技術と同程度である。",null,"○：作業工程に、中詰コンクリートと水抜きパイプが不要なため、省人化・省力化が可能。",null,"△：作業工程が同等であるため、省人化・省力化は従来技術と同程度である。",null,"○：作業工程に胴込コンクリート工が不要なため、省人化・省力化は従来技術より優れる。",null,"△：作業工程が同等であるため、省人化・省力化は従来技術と同程度である。",null,"△：作業工程が同等であるため、省人化・省力化は従来技術と同程度である。",null,"△：作業工程が同等であるため、省人化・省力化は従来技術と同程度である。",null,"△：作業工程が同等であるため、省人化・省力化は従来技術と同程度である。",null,"△：作業工程が同等であるため、省人化・省力化は従来技術と同程度である。",null,"△：作業工程が同等であるため、省人化・省力化は従来技術と同程度である。",null,"△：作業工程が同等であるため、省人化・省力化は従来技術と同程度である。",null,"△：作業工程が同等であるため、省人化・省力化は従来技術と同程度である。",null,"△：作業工程が同等であるため、省人化・省力化は従来技術と同程度である。",null,"△：作業工程が同等であるため、省人化・省力化は従来技術と同程度である。",null,"△：作業工程が同等であるため、省人化・省力化は従来技術と同程度である。",null,"△：作業工程が同等であるため、省人化・省力化は従来技術と同程度である。",null,"△：作業工程が同等であるため、省人化・省力化は従来技術と同程度である。",null,"△：作業工程が同等であるため、省人化・省力化は従来技術と同程度である。",null,"△：作業工程が同等であるため、省人化・省力化は従来技術と同程度である。",null,"△：作業工程が同等であるため、省人化・省力化は従来技術と同程度である。"]
[null,"㉕","判定の凡例\n○：従来技術より優れる\n-：従来技術と同程度\n-：上記以外","湧水への適応性",null,"△：背面の排水機能が同等であるため、湧水への適応性は従来技術と同程度である。",null,"○：ブロックがポーラスコンクリートで透水性を有しており、背面排水に優れる。",null,"○：裏込め材に栗石を用いることにより、背面水を容易に排出できるため従来技術より優れる。",null,"△：背面の排水機能が同等であるため、湧水への適応性は従来技術と同程度である。",null,"△：背面の排水機能が同等であるため、湧水への適応性は従来技術と同程度である。",null,"○：環境保全タイプは前後排水孔を備えており、中詰を砕石とするため向上する。",null,"○：環境保全タイプは前後排水孔を備えており、中詰を砕石とするため向上する。",null,"△：背面の排水機能が同等であるため、湧水への適応性は従来技術と同程度である。",null,"△：背面の排水機能が同等であるため、湧水への適応性は従来技術と同程度である。",null,"△：背面の排水機能が同等であるため、湧水への適応性は従来技術と同程度である。",null,"△：背面の排水機能が同等であるため、湧水への適応性は従来技術と同程度である。",null,"△：背面の排水機能が同等であるため、湧水への適応性は従来技術と同程度である。",null,"△：背面の排水機能が同等であるため、湧水への適応性は従来技術と同程度である。",null,"△：背面の排水機能が同等であるため、湧水への適応性は従来技術と同程度である。",null,"○：中詰めに単粒度砕石を用いているため、背面排水に優れており、湧水への適応性は向上する。",null,"○：中詰めに単粒度砕石を用いているため、背面排水に優れており、湧水への適応性は向上する。",null,"△：背面の排水機能が同等であるため、湧水への適応性は従来技術と同程度である。",null,"△：背面の排水機能が同等であるため、湧水への適応性は従来技術と同程度である。",null,"△：背面の排水機能が同等であるため、湧水への適応性は従来技術と同程度である。",null,"△：背面の排水機能が同等であるため、湧水への適応性は従来技術と同程度である。"]
[null,"㉖",null,"景観性への影響\n（表面の模様）",null,"○：表面の模様は擬石模様の対応可能であり、景観性への影響は向上する。",null,"○：低明度のポーラスコンクリート製品であり、周辺環境と調和し景観性への影響は向上する。",null,"○：表面の模様はハツリ模様の対応可能であり、景観性への影響は向上する。",null,"○：表面の模様は擬石模様の対応可能であり、景観性への影響は向上する。",null,"○：表面の模様は擬石模様の対応可能であり、景観性への影響は向上する。",null,"○：表面の模様は擬石模様の対応可能であり、景観性への影響は向上する。",null,"○：表面の模様は擬石模様の対応可能であり、景観性への影響は向上する。",null,"○：表面の模様は額縁模様、額縁はつり模様の対応可能であり、景観性への影響は向上する。",null,"○：表面の模様は額縁模様、額縁はつり模様の対応可能であり、景観性への影響は向上する。",null,"○：表面の模様は額縁（滑面）、額縁はつり（粗面）、石乱積み、ストーンの対応可能であり、景観性への影響は向上する。",null,"○：表面の模様は額縁（滑面）、額縁はつり（粗面）、石乱積み、ストーンの対応可能であり、景観性への影響は向上する。",null,"○：表面の模様は、擬石模様の対応可能であり、景観性への影響は向上する。",null,"○：表面の模様は、擬石模様の対応可能であり、景観性への影響は向上する。",null,"○：表面の模様は滑面模様の対応可能であり、景観性への影響は向上する。",null,"○：表面の模様は石積みであるため、景観性への影響は向上する。",null,"○：表面の模様は石積みであるため、景観性への影響は向上する。",null,"○：表面の模様は、擬石模様の対応可能であり、景観性への影響は向上する。",null,"○：表面の模様は、擬石模様の対応可能であり、景観性への影響は向上する。",null,"○：表面の模様は、擬石模様の対応可能であり、景観性への影響は向上する。",null,"○：表面の模様は、擬石模様の対応可能であり、景観性への影響は向上する。"]
[null,"㉗",null,"自然環境への影響\n（生態系、植生等）",null,"△：自然環境への影響は従来技術と同程度である。",null,"○：ブロック天端の緑化ポケットが植生基盤となる空間となり、水際では水棲生物の生息空間と植生機能を有している。",null,"○：両端部の凹部空間並びに栗石の隙間は魚難類・甲殻類の日常の棲みか、増水時には避難場となり河川の生態系の保全に寄与する。",null,"△：自然環境への影響は従来技術と同程度である。",null,"△：自然環境への影響は従来技術と同程度である。",null,"○：環境保全タイプは、緑化・魚巣機能のある大型ブロック積み擁壁の構築が可能であり、多孔質な水辺環境を形成するため向上する。",null,"○：環境保全タイプは、緑化・魚巣機能のある大型ブロック積み擁壁の構築が可能であり、多孔質な水辺環境を形成するため向上する。",null,"△：自然環境への影響は従来技術と同程度である。",null,"△：自然環境への影響は従来技術と同程度である。",null,"△：自然環境への影響は従来技術と同程度である。",null,"△：自然環境への影響は従来技術と同程度である。",null,"△：自然環境への影響は従来技術と同程度である。",null,"△：自然環境への影響は従来技術と同程度である。",null,"○：魚類配慮タイプ、緑化配慮タイプがあり、魚巣、植生機能を有している。",null,"○：植生を箱体前面の小段に施すことにより、自然環境への影響は向上する。",null,"○：植生を箱体前面の小段に施すことにより、自然環境への影響は向上する。",null,"△：自然環境への影響は従来技術と同程度である。",null,"△：自然環境への影響は従来技術と同程度である。",null,"△：自然環境への影響は従来技術と同程度である。",null,"△：自然環境への影響は従来技術と同程度である。"]
["総括","㉘","耐久性等",null,null,"・[新技術の特徴]：ブロック1個の大きさを、0.5m2/個とし水平方向にブロックを積むことを可能にした自立安定タイプである。基礎をプレキャスト化することで、養生等が不要になり所定勾配の擁壁を構築する際の作業効率の向上及び省力化・工期短縮が期待できる（補完情報より）。・プレキャスト鉄筋コンクリートブロックであり、道路プレキャストコンクリート工指針による設計基準30N/mm2以上を満足している（補完情報より）。",null,"・［新技術の特徴］：レベル積みで安全に敷設することができ、連結金具による連結で結合できることから、施工の省力化が図れる。ブロックをポーラスコンクリートとしたことにより、透水能力を有していることから、水抜きパイプが不要となる。十分な壁体重量があることから、中詰材を施工せずとも土圧や流体力に対する安定性と壁体強度が確保できる（NETIS情報、補完情報より）。\n・ポーラスコンクリートブロックであり、設計基準18N/mm2以上を確認している（補完情報より）。",null,"・[新技術の特徴]：栗石のかみ合わせと抵抗板に作用する土圧で抵抗する空積みブロック構造で、ブロク底部の摩擦力と抵抗板の前面の受働土圧が協同して土圧に抵抗するため滑動抵抗性に優れている。また、簡単・迅速な施工法で工期を短縮し、生物に棲みかを提供するとともに水循環を促進して河川環境の改善が期待できる（補完情報より）。\n・プレキャスト鉄筋コンクリートブロックであり、道路プレキャストコンクリート工指針による設計基準30N/mm2以上を満足している（補完情報より）。",null,"・[新技術の特徴]：練積タイプの大型ブロックで、単体が1.125m2/個、控350～500mmとタイプがある。練積ブロックで胴込コンクリート工が不要となり、天候に左右されず施工出来る為、工期短縮に繋がる。連結差筋を使用することで施工時の自立を促し、省人化で施工が可能である（補完情報より）。\n\n・プレキャスト無筋コンクリートブロックであり、道路プレキャストコンクリート工指針による設計基準21N/mm2以上を満足している（補完情報より）。",null,"・[新技術の特徴]：自立構造式の大型積みブロック0.5m2/個とプレキャスト製基礎で、施工が簡単・スピーディーに行えるため経済性・施工性の向上が期待できる。壁面は小割石を積上げたような景観で、壁面全体で調和し自然景観にも馴染む（補完情報より）。\n\n・プレキャスト鉄筋コンクリートブロックであり、道路プレキャストコンクリート工指針による設計基準21N/mm2以上を満足している（補完情報より）。",null,"・［新技術の特徴］：中空型のブロックを階段状もたれ状及び直積み状に積み上げて擁壁を構築する技術で、各種控長のブロックの組み合わせで様々な積み方が可能である。中詰材として現地発生材等が利用可能で環境負荷、コストの低減を図ることができる（NETIS情報より）。\n\n・プレキャスト鉄筋コンクリートブロックであり、道路プレキャストコンクリート工指針による設計基準30N/mm2以上を満足している（補完情報より）。",null,"・［新技術の特徴］：中空型のブロックを階段状もたれ状及び直積み状に積み上げて擁壁を構築する技術で、各種控長のブロックの組み合わせで様々な積み方が可能である。中詰材として現地発生材等が利用可能で環境負荷、コストの低減を図ることができる（NETIS情報より）。\n\n・プレキャスト鉄筋コンクリートブロックであり、道路プレキャストコンクリート工指針による設計基準30N/mm2以上を満足している（補完情報より）。",null,"・［新技術の特徴］：ブロック前壁に専用の勾配(1:0.3,0.4,0.5)を付け、自立性が高い形状とする事で、製品を水平に据えつけ、コンクリート打設の単純な作業の繰り返しで、専用勾配の擁壁が容易に築造できる（補完情報より）。\n\n・プレキャスト鉄筋コンクリートブロックであり、道路プレキャストコンクリート工指針による設計基準30N/mm2以上を満足している（補完情報より）。",null,"・［新技術の特徴］：ブロック前壁に専用の勾配(1:0.3,0.4,0.5)を付け、自立性が高い形状とする事で、製品を水平に据えつけ、コンクリート打設の単純な作業の繰り返しで、専用勾配の擁壁が容易に築造できる（補完情報より）。\n\n・プレキャスト鉄筋コンクリートブロックであり、道路プレキャストコンクリート工指針による設計基準30N/mm2以上を満足している（補完情報より）。",null,"・［新技術の特徴］：ハーフプレキャストとは、工場にてインサートを埋込んだブロックとKCパネルを現地にてセパレータを介して連結する工法である。裏型枠の組みばらし工程が省略され飛躍的に工程が短縮される（補完情報より）。\n\n・プレキャスト鉄筋コンクリートブロックであり、道路プレキャストコンクリート工指針による設計基準30N/mm2以上を満足している（補完情報より）。",null,"・［新技術の特徴］：ハーフプレキャストとは、工場にてインサートを埋込んだブロックとKCパネルを現地にてセパレータを介して連結する工法である。裏型枠の組みばらし工程が省略され飛躍的に工程が短縮される（補完情報より）。\n\n・プレキャスト鉄筋コンクリートブロックであり、道路プレキャストコンクリート工指針による設計基準30N/mm2以上を満足している（補完情報より）。",null,"・［新技術の特徴］：鉛直及び水平方向にブロックの一体化が容易で堅固であり、ブロック１個当りが2m2強と大きく、積み手間が大幅に削減でき施工性の向上が期待できる（補完情報より）。\n\n・プレキャスト無筋コンクリートブロックであり、道路プレキャストコンクリート工指針による設計基準21N/mm2以上を満足している（補完情報より）。",null,"・［新技術の特徴］：鉛直及び水平方向にブロックの一体化が容易で堅固であり、ブロック１個当りが2m2強と大きく、積み手間が大幅に削減でき施工性の向上が期待できる（補完情報より）。\n\n・プレキャスト無筋コンクリートブロックであり、道路プレキャストコンクリート工指針による設計基準21N/mm2以上を満足している（補完情報より）。",null,"・［新技術の特徴］：胴込め部は砕石を使用できるため、胴込めコンクリートが不要となる。また、最大で3m2の大型パネルがあり、自立式のブロックとなっている。道路土工指針に準拠しており、鉄筋コンクリートで一体化する擁壁のため、もたれ式擁壁と同等の構造として扱える（NETIS情報、補完情報より）。\n・プレキャスト鉄筋コンクリートブロックであり、道路プレキャストコンクリート工指針による設計基準30N/mm2以上を満足している（補完情報より）。",null,"・［新技術の特徴］：箱型擁壁ブロックに単粒度砕石を充填するだけで、擁壁を構築する構造のため施工が早く簡単に行える。フレキシブルな構造のため地震時に強く、また基礎地盤、背面土の不同沈下にも追従性を発揮して擁壁全体の安定を確保する。また、単粒度砕石層は極めて排水性が高いため擁壁の安定性が図れる（補完情報より）。\n・プレキャスト鉄筋コンクリートブロックであり、道路プレキャストコンクリート工指針による設計基準30N/mm2以上を満足している（補完情報より）。",null,"・［新技術の特徴］：箱型擁壁ブロックに単粒度砕石を充填するだけで、擁壁を構築する構造のため施工が早く簡単に行える。フレキシブルな構造のため地震時に強く、また基礎地盤、背面土の不同沈下にも追従性を発揮して擁壁全体の安定を確保する。また、単粒度砕石層は極めて排水性が高いため擁壁の安定性が図れる（補完情報より）。\n・プレキャスト鉄筋コンクリートブロックであり、道路プレキャストコンクリート工指針による設計基準30N/mm2以上を満足している（補完情報より）。",null,"・［新技術の特徴］：自立安定する大型積ブロックにより、安全性・施工性が向上する技術である。また、表面の模様を擬石・ポーラスにすることにより、明度を下げ景観に配慮することができる（補完情報より）。\n\n・プレキャスト鉄筋コンクリートブロックであり、道路プレキャストコンクリート工指針による設計基準30N/mm2以上を満足している（補完情報より）。",null,"・［新技術の特徴］：自立安定する大型積ブロックにより、安全性・施工性が向上する技術である。また、表面の模様を擬石・ポーラスにすることにより、明度を下げ景観に配慮することができる（補完情報より）。\n\n・プレキャスト鉄筋コンクリートブロックであり、道路プレキャストコンクリート工指針による設計基準30N/mm2以上を満足している（補完情報より）。",null,"・［新技術の特徴］：ブロックの控え幅は500㎜以上で、自由に設定・変更が可能であり、安定幅を無駄なく選択することができる。また、中詰めコンクリート内は、鉄骨構造であるため耐震性が向上する（補完情報より）。\n・コンクリートパネルは、プレキャスト鉄筋コンクリートブロックであり、道路プレキャストコンクリート工指針による設計基準30N/mm2以上を満足している（補完情報より）。",null,"・［新技術の特徴］：ブロックの控え幅は500㎜以上で、自由に設定・変更が可能であり、安定幅を無駄なく選択することができる。また、中詰めコンクリート内は、鉄骨構造であるため耐震性が向上する（補完情報より）。\n・コンクリートパネルは、プレキャスト鉄筋コンクリートブロックであり、道路プレキャストコンクリート工指針による設計基準30N/mm2以上を満足している（補完情報より）。"]
[null,"㉙","施工性\n(留意事項含む）",null,null,"・曲線部での施工では、曲線半径R＝16m以下の場合は適用不可（NETIS情報より）。\n・5分勾配はブロックが自立するため、石工の専門技術がなくても機械施工で簡単に構築できる（NETIS情報より）。",null,"・曲線施工では、目地処理が不要で連結部を折り曲げ、ブロック自体が湾曲することから、壁体の枠線に合わせた曲線施工が可能である(内外曲がり共に半径5.0mまで対応可能)（NETIS情報より）。\n・レベル積みで敷設して階段状に積み上げる施工方法で、安全かつ簡単に施工可能。また、勾配積にも対応可能である（NETIS情報より）。\n・三連の柱状ブロックは、それぞれがめっき鉄線で連結されており、連結部で折り曲げることができる（NETIS情報より）。",null,"・ブロック側壁間に空間を形成したことにより、ブロック間の離隔を自由に調整でき、曲線半径R＝40m程度のカーブ施工(凹凸とも)への対応が容易である（NETIS情報より）。\n・水平積ブロックにより、作業効率が向上する（NETIS情報より）。",null,"・曲線部での施工では、実績として曲線半径R=15.0mと可能であり、曲線半径R=15ｍ未満の場合は要検討すること（NETIS情報より）。\n・水平積ではないが、ブロックの上端に突起と差筋を2ヵ所設けて使用することで自立が可能となり、作業効率の向上が期待できる（NETIS情報より）。",null,"・水平状態で5分勾配にブロックが自立する構造で、勾配が定まり易く、型枠の組立・撤去が不要なため、容易に施工できる（NETIS情報より）。\n・裏込コンクリート厚が15cmを超える時や、積勾配が1：0.5以外の時は、基礎部をヌノピタA根と現場打ち基礎とすることで対応可能（補完情報より）。\n・曲線施工への対応性は、事前の確認が必要である（WGからのコメント）。",null,"・曲線部での施工では、ブロックは前面幅(1.5m)より後側の幅を狭くしているため、最小半径30mのカーブにも対応が可能（NETIS情報より）。\n・中空型のボックスを積み上げ、内部に土砂(建設残土)や砕石、コンクリート瓦礫等を充填し壁体重量が確保できる構造としているため、自立し安定している（NETIS情報より）。",null,"・曲線部での施工では、ブロックは前面幅(1.5m)より後側の幅を狭くしているため、最小半径30mのカーブにも対応が可能（NETIS情報より）。\n・中空型のボックスを積み上げ、内部に土砂(建設残土)や砕石、コンクリート瓦礫等を充填し壁体重量が確保できる構造としているため、自立し安定している（NETIS情報より）。",null,"・控え壁(扶壁)を有するL型コンクリート壁体(箱状ブロック)の底版上に、埋め戻しされた土砂・砕石・コンクリートがカウンターウェイトとして作用するので、単体の安定が保持できる（NETIS情報より）。",null,"・控え壁(扶壁)を有するL型コンクリート壁体(箱状ブロック)の底版上に、埋め戻しされた土砂・砕石・コンクリートがカウンターウェイトとして作用するので、単体の安定が保持できる（NETIS情報より）。",null,"・インサートを埋込んだ製品と専用裏型枠(KCパネル)をセパレータ(KCセパレータ)で連結することにより、型枠の組立て脱型作業が軽減(裏型枠は残存が可能)できる（NETIS情報より）。\n・積みブロックの壁面・控長を大型化し、前壁に勾配（1：0.5）を付けている為、製品を水平に据付けるだけで簡単に所定の勾配に築造できる（NETIS情報より）。",null,"・インサートを埋込んだ製品と専用裏型枠(KCパネル)をセパレータ(KCセパレータ)で連結することにより、型枠の組立て脱型作業が軽減(裏型枠は残存が可能)できる（NETIS情報より）。\n・積みブロックの壁面・控長を大型化し、前壁に勾配（1：0.5）を付けている為、製品を水平に据付けるだけで簡単に所定の勾配に築造できる（NETIS情報より）。",null,"・上下のブロックを、U型鉄筋を用いて固定するため、ブロックが転倒する恐れがなくなり安全である（NETIS情報より）。\n・専用発泡スチロール型枠の使用により、現場打ち部分や曲線施工への対応可能がとなるが、現場条件毎に事前の確認が必要である（WGからのコメント）。",null,"・上下のブロックを、U型鉄筋を用いて固定するため、ブロックが転倒する恐れがなくなり安全である（NETIS情報より）。\n・専用発泡スチロール型枠の使用により、現場打ち部分や曲線施工への対応可能がとなるが、現場条件毎に事前の確認が必要である（WGからのコメント）。",null,"・ブロックを水平に設置したときのブロックの前面の形状は1：0.4であるため、1：0.5の勾配とするときは、ブロックを背面に傾斜させて設置する必要がある（NETIS情報より）。\n・ブロック内円筒部に配置する縦貫鉄筋は、ブロックの据付に先行して設置するため、単管等により支保する必要がある（NETIS情報より）。\n・二次製品ブロックに鉄筋を通して、積み重ねていく施工となっているが、鉄筋挿入箇所の間詰めコンクリートの充填において締め固め作業が施工しにくい。充填不足箇所がある場合は、鉄筋腐食などが懸念されるため、施工に注意する必要がある（NETIS情報より）。",null,"・従来工法には無い可撓性を有する箱型擁壁は、ある程度地盤の変形に追随でき、自立型の箱体を積上げるため勾配設定が容易で、コーナー部や曲線施工も反転組み合わせにより可能となり、縦断勾配(最大12%)にも容易に対応できるなど施工性に優れる（NETIS情報より）。\n・基礎砕石、中・裏込め砕石に使用する材料は、単粒度砕石(S-40前後)、割栗石(φ50～150)を使用し、クラッシャランは使用不可（NETIS情報より）。",null,"・従来工法には無い可撓性を有する箱型擁壁は、ある程度地盤の変形に追随でき、自立型の箱体を積上げるため勾配設定が容易で、コーナー部や曲線施工も反転組み合わせにより可能となり、縦断勾配(最大12%)にも容易に対応できるなど施工性に優れる（NETIS情報より）。\n・基礎砕石、中・裏込め砕石に使用する材料は、単粒度砕石(S-40前後)、割栗石(φ50～150)を使用し、クラッシャランは使用不可（NETIS情報より）。",null,"・ブロックが自立安定するため、施工性と安全性が向上する（NETIS情報より）。\n・ブロックを水平に設置するだけで5分勾配となるため、勾配合わせが容易である（ホライズンII、ポーラス・ホライズンII ）（NETIS情報より）。\n・ブロックを水平に設置するだけで3分勾配となるため、勾配合わせが容易である（ホライズンF、ホライズンF(洗出 ）（NETIS情報より）。 \n・曲線半径の小さい護岸等を含む小規模河川への適用は困難である（NETIS情報より）。",null,"・ブロックが自立安定するため、施工性と安全性が向上する（NETIS情報より）。\n・ブロックを水平に設置するだけで5分勾配となるため、勾配合わせが容易である（ホライズンII、ポーラス・ホライズンII ）（NETIS情報より）。\n・ブロックを水平に設置するだけで3分勾配となるため、勾配合わせが容易である（ホライズンF、ホライズンF(洗出 ）（NETIS情報より）。 \n・曲線半径の小さい護岸等を含む小規模河川への適用は困難である（NETIS情報より）。",null,"・自立するコンクリートパネルを組み上げ、中詰めコンクリートを打設することで、構築できる大型ブロック積擁壁であり、法勾配(直壁～1.0)、控長(500～6000ｍｍ)を自在に設定できる（補完情報より）。",null,"・自立するコンクリートパネルを組み上げ、中詰めコンクリートを打設することで、構築できる大型ブロック積擁壁であり、法勾配(直壁～1.0)、控長(500～6000ｍｍ)を自在に設定できる（補完情報より）。"]
[null,"㉚","その他\n（留意事項含む）",null,null,"・本比較表の施工費、施工日数は、載荷重なしの場合である。載荷重を考慮する場合は、別途考慮する必要がある（補完情報より）。\n・大型ブロック積擁壁の安定計算は、施工箇所における現地踏査、地質調査等の結果に基づき実施すること（WGからのコメント）。\n・河川護岸に適用する場合、残留水圧等を考慮し、裏込コンクリートの厚さを検討する（補完情報より）。",null,"・九州地方（国土交通省）での活用実績はない（補完情報より）。\n・ブロックの壁体質量は、コンクリートブロック練積み約750ｋｇ/ｍ2に対して、979ｋｇ/ｍ2を確保している（補完情報より）。\n・大型ブロック積擁壁の安定計算は、施工箇所における現地踏査、地質調査等の結果に基づき実施すること（WGからのコメント）。\n・ブロックがポーラスコンクリートで透水性を有しており、背面からの排水が可能（補完情報より）。",null,"・九州地方（国土交通省）での活用実績はない（補完情報より）。\n・大型ブロック積擁壁の安定計算は、施工箇所における現地踏査、地質調査等の結果に基づき実施すること（WGからのコメント）。\n・多自然型の護岸製品であり、裏込材に割栗石を用いることで背面からの排水が可能（補完情報より）。",null,"・九州地方（国土交通省）での活用実績はない（補完情報より）。\n・大型ブロック積擁壁の安定計算は、施工箇所における現地踏査、地質調査等の結果に基づき実施すること（WGからのコメント）。\n・河川護岸に適用する場合、残留水圧に有効な裏込め材の厚さ等を考慮する（補完情報より）。",null,"・九州地方（国土交通省）での活用実績はない（補完情報より）。\n・ヌノピタA根を使用する場合の基礎は、現場打ちとなる（補完情報より）。\n・大型ブロック積擁壁の安定計算は、施工箇所における現地踏査、地質調査等の結果に基づき実施すること（WGからのコメント）。\n・製品に水抜き用の矩形のノックアウト孔が設けられており、排水性に考慮している（補完情報より）。",null,"・現場に合わせて積み方の選定が可能（重力式かさね積み擁壁、もたれ式階段積み擁壁、もたれ式かさね積み擁壁、逆台形式直積み擁壁）。ただし、逆台形式直積み擁壁を施工する際は、地盤の支持力確認が必要である（補完情報より、NETIS情報より）。\n・環境保全タイプは地下水との連続による水質の改善が図れ、魚巣はんざきタイプと組み合わせることで生態系にも配慮された護岸が構築できる（補完情報より）。\n・大型ブロック積擁壁の安定計算は、施工箇所における現地踏査、地質調査等の結果に基づき実施すること（WGからのコメント）。\n・周辺環境を考慮して、植生の種類や維持管理について適宜検討すること（WGからのコメント）。\n・環境保全タイプは、箱型の製品の前面、背面にそれぞれ排水孔を備えており、中詰材を砕石とすることで、排水性に考慮している（補完情報より）。",null,"・現場に合わせて積み方の選定が可能（重力式かさね積み擁壁、もたれ式階段積み擁壁、もたれ式かさね積み擁壁、逆台形式直積み擁壁）。ただし、逆台形式直積み擁壁を施工する際は、地盤の支持力確認が必要である（補完情報より、NETIS情報より）。\n・環境保全タイプは地下水との連続による水質の改善が図れ、魚巣はんざきタイプと組み合わせることで生態系にも配慮された護岸が構築できる（補完情報より）。\n・大型ブロック積擁壁の安定計算は、施工箇所における現地踏査、地質調査等の結果に基づき実施すること（WGからのコメント）。\n・周辺環境を考慮して、植生の種類や維持管理について適宜検討すること（WGからのコメント）。\n・環境保全タイプは、箱型の製品の前面、背面にそれぞれ排水孔を備えており、中詰材を砕石とすることで、排水性に考慮している（補完情報より）。",null,"・曲線部への適応は、現場毎に事前確認が必要である（補完情報より）。\n・その他製品の仕様として、緑化タイプのSPグリーン（最大壁高4ｍ以下）、既存の地山の土を活用可能なウエストン（最大壁高3ｍ以下）がある（NETIS情報より）。\n・大型ブロック積擁壁の安定計算は、施工箇所における現地踏査、地質調査等の結果に基づき実施すること（WGからのコメント）。\n・ブロック底面に空洞が設けられており、排水性に考慮している（補完情報より）。",null,"・曲線部への適応は、現場毎に事前確認が必要である（補完情報より）。\n・その他製品の仕様として、緑化タイプのSPグリーン（最大壁高4ｍ以下）、既存の地山の土を活用可能なウエストン（最大壁高3ｍ以下）がある（NETIS情報より）。\n・大型ブロック積擁壁の安定計算は、施工箇所における現地踏査、地質調査等の結果に基づき実施すること（WGからのコメント）。\n・ブロック底面に空洞が設けられており、排水性に考慮している（補完情報より）。",null,"・施工区間が曲線区間である場合は、裏型枠であるパネルに隙間が生じるため、裏型枠の現場製作が一部発生する（NETIS情報より）。\n・胴込コンクリートが十分養生されていない状況で、周囲を重機が走行するとブロックを変位させる恐れがあり注意が必要である（NETIS情報より）。\n・大型ブロック積擁壁の安定計算は、施工箇所における現地踏査、地質調査等の結果に基づき実施すること（WGからのコメント）。\n・河川護岸に適用する場合、透水性の高い裏込め材料の使用や厚さを考慮する（補完情報より）。",null,"・施工区間が曲線区間である場合は、裏型枠であるパネルに隙間が生じるため、裏型枠の現場製作が一部発生する（NETIS情報より）。\n・胴込コンクリートが十分養生されていない状況で、周囲を重機が走行するとブロックを変位させる恐れがあり注意が必要である（NETIS情報より）。\n・大型ブロック積擁壁の安定計算は、施工箇所における現地踏査、地質調査等の結果に基づき実施すること（WGからのコメント）。\n・河川護岸に適用する場合、透水性の高い裏込め材料の使用や厚さを考慮する（補完情報より）。",null,"・控長の異なる製品を組合せて使用（不等厚施工）することが可能。ただし、極端にサイズの異なるタイプの組合せは地震時などに応力の集中を受けやすいため、不等厚施工を検討する場合は、事前に確認が必要である（補完情報より）。\n・大型ブロック積擁壁の安定計算は、施工箇所における現地踏査、地質調査等の結果に基づき実施すること（WGからのコメント）。\n・河川護岸に適用する場合、透水性の高い裏込め材料の使用や厚さを考慮する（補完情報より）。",null,"・控長の異なる製品を組合せて使用（不等厚施工）することが可能。ただし、極端にサイズの異なるタイプの組合せは地震時などに応力の集中を受けやすいため、不等厚施工を検討する場合は、事前に確認が必要である（補完情報より）。\n・大型ブロック積擁壁の安定計算は、施工箇所における現地踏査、地質調査等の結果に基づき実施すること（WGからのコメント）。\n・河川護岸に適用する場合、透水性の高い裏込め材料の使用や厚さを考慮する（補完情報より）。",null,"・曲線部への適応は、現場条件毎に事前の確認が必要である（WGからのコメント）。\n・大型ブロック積擁壁の安定計算は、施工箇所における現地踏査、地質調査等の結果に基づき実施すること（WGからのコメント）。\n・河川護岸に適用する場合、透水性の高い裏込め材料の使用や厚さを考慮する（補完情報より）。",null,"・曲線部への適応は、直角曲がり、壁体の端部止めも容易に可能（NETIS情報より）。\n・大型ブロック積擁壁の安定計算は、施工箇所における現地踏査、地質調査等の結果に基づき実施すること（WGからのコメント）。\n・流速がある河川護岸に用いた場合、箱型擁壁の小段から砕石が流出することで、擁壁の安定性を欠くため、護岸への適用は不可（補完情報より）。\n・流れのない調整池等における水際での使用は可能であるが、現場条件、開発会社の意見等を勘案して要検討（WGからのコメント）。",null,"・曲線部への適応は、直角曲がり、壁体の端部止めも容易に可能（NETIS情報より）。\n・大型ブロック積擁壁の安定計算は、施工箇所における現地踏査、地質調査等の結果に基づき実施すること（WGからのコメント）。\n・流速がある河川護岸に用いた場合、箱型擁壁の小段から砕石が流出することで、擁壁の安定性を欠くため、護岸への適用は不可（補完情報より）。\n・流れのない調整池等における水際での使用は可能であるが、現場条件、開発会社の意見等を勘案して要検討（WGからのコメント）。",null,"・石積は、異形形状をした谷積みするブロックで、積み上げ段数が高くなるにつれ、施工性が低下する場合があるため、ブロック設置精度を確保する必要がある（NETIS情報より）。\n・大型ブロック積擁壁の安定計算は、施工箇所における現地踏査、地質調査等の結果に基づき実施すること（WGからのコメント）。\n・水抜きパイプを設置する箇所にノックアウト孔を設けており、排水性に考慮している（補完情報より）。",null,"・石積は、異形形状をした谷積みするブロックで、積み上げ段数が高くなるにつれ、施工性が低下する場合があるため、ブロック設置精度を確保する必要がある（NETIS情報より）。\n・大型ブロック積擁壁の安定計算は、施工箇所における現地踏査、地質調査等の結果に基づき実施すること（WGからのコメント）。\n・水抜きパイプを設置する箇所にノックアウト孔を設けており、排水性に考慮している（補完情報より）。",null,"・九州地方（国土交通省）での活用実績はない（補完情報より）。\n・曲線半径が小さい場合は検討が必要である（補完情報より）。\n・不等厚式擁壁（重力式、もたれ式、逆台形式）にも対応可能である（補完情報より）。\n・大型ブロック積擁壁の安定計算は、施工箇所における現地踏査、地質調査等の結果に基づき実施すること（WGからのコメント）。\n・河川護岸に適用する場合、透水性の高い裏込め材料の使用や厚さを考慮する（補完情報より）。",null,"・九州地方（国土交通省）での活用実績はない（補完情報より）。\n・曲線半径が小さい場合は検討が必要である（補完情報より）。\n・不等厚式擁壁（重力式、もたれ式、逆台形式）にも対応可能である（補完情報より）。\n・大型ブロック積擁壁の安定計算は、施工箇所における現地踏査、地質調査等の結果に基づき実施すること（WGからのコメント）。\n・河川護岸に適用する場合、透水性の高い裏込め材料の使用や厚さを考慮する（補完情報より）。"]
[]
[]
[null,null,null,"施工条件CASE1",null,{"$f":"G33","v":"施工条件：勾配1：0.5、壁高5.0m、控350mm、裏込めコンクリートt=150mm"},null,{"$f":"I33","v":"施工条件：勾配1：0.5、壁高5.0m、控480mm　製品名：（練積タイプ）"},null,{"$f":"K33","v":"施工条件：勾配1：0.5、壁高5.0m、控700mm"},null,{"$f":"M33","v":"勾配1：0.5、壁高5.0m、控500mm　製品名：500A"},null,{"$f":"O33","v":"勾配1：0.5、壁高5.0m、控350mm　製品名：ヌノピタA"},null,{"$f":"Q33","v":"施工条件：勾配1：0.5、壁高5.0m、控750mm　製品名：750型"},null,{"$f":"S33","v":"施工条件：勾配1：0.5、壁高5.0m、控1000mm　製品名：1000型"},null,{"$f":"U33","v":"施工条件：勾配1：0.5、壁高5.0m、控895mm、製品名：（SPブロックⅢ-1A型、C型）"},null,{"$f":"W33","v":"施工条件：勾配1：0.5、壁高5.0m、控895mm、製品名：（SPブロックⅢ-1A型、C型）"},null,{"$f":"Y33","v":"施工条件：勾配1：0.5、壁高5.0m、控700mm　製品名：（額縁A型、C型）"},null,{"$f":"AA33","v":"施工条件：勾配1：0.5、壁高5.0m、控700mm　製品名：（額縁A型、C型）"},null,{"$f":"AC33","v":"施工条件：勾配1：0.5、壁高5.0m、控長750mm　製品名：750タイプ"},null,{"$f":"AE33","v":"施工条件：勾配1：0.5、壁高5.0m、控長1000mm　製品名：1000タイプ"},null,{"$f":"AG33","v":"施工条件：勾配1：0.5、壁高5.0m、控878mm　製品名：（1型特殊　AH，D－AH）"},null,{"$f":"AI33","v":"施工条件：勾配1：0.5、壁高5.0m、控1250mm　製品名：（A型）"},null,{"$f":"AK33","v":"施工条件：勾配1：0.5、壁高5.0m、控1250mm　製品名：（A型）"},null,{"$f":"AM33","v":"施工条件：勾配1：0.5、壁高5.0m、控650mm　製品名：（ホライズンⅡ）"},null,{"$f":"AO33","v":"施工条件：勾配1：0.5、壁高5.0m、控800mm　製品名：（ホライズンⅡ）"},null,{"$f":"AQ33","v":"施工条件：勾配1：0.5、壁高5.0m、控750mm　製品名：750型"},null,{"$f":"AS33","v":"施工条件：勾配1：0.5、壁高5.0m、控1000mm　製品名：1000型"}]
[null,null,null,"概算費用","機械・労務",{"$f":"G34","v":892483},null,621952,null,2666782,null,530074,null,1871780,null,2354086,null,2900525,null,1091100,null,1091100,null,1047500,null,1039800,null,"-",null,"-",null,2983900,null,"未回答",null,"未回答",null,1519500,null,1732300,null,1660720,null,1917900]
[null,null,null,null,"材料",2188468,null,{"$f":"I35","v":2470200},null,942504,null,3713376,null,1500000,null,3030220,null,3832280,null,4927600,null,4927600,null,3824400,null,4027000,null,"-",null,"-",null,1969200,null,"未回答",null,"未回答",null,3675800,null,4142900,null,3799200,null,4130100]
[null,null,null,null,"合計",3080951,null,3092152,null,3609286,null,4243450,null,3371780,null,5384306,null,6732805,null,6018700,null,6018700,null,4871900,null,5066800,null,5187700,null,6451200,null,4953100,null,"未回答",null,"未回答",null,5195300,null,5875200,null,5459920,null,6048000]
[null,null,null,"施工日数",null,13.3,null,4.8099999999999996,null,5.1230000000000002,null,5.88,null,10.7,null,7.9808459696727851,null,11.09,null,11.806375442739078,null,11.806375442739078,null,11.806375442739078,null,11.806375442739078,null,8.3892617449664435,null,10.245901639344263,null,16.100000000000001,null,"未回答",null,"未回答",null,8.3800000000000008,null,9.36,null,10.46,null,10.46]
[null,null,null,"経済性",null,"（3,080,951-4,963,400）/4,963,400=-37.9%",null,"（3,092,152-4,963,400）/4,963,400=-37.7%",null,"（3,609,286-4,963,400）/4,963,400=-27.3%",null,"（4,243,450-4,963,400）/4,963,400=-14.5%",null,"（3,371,780-4,963,400）/4,963,400=-32.1%",null,"（5,384,306-4,963,400）/4,963,400=8.5%",null,"（6,732,805-6,481,787）/6,481,787=3.9%",null,"（6,018,700-4,963,400）/4,963,400=21.3%",null,"（6,018,700-6,481,787）/6,481,787=-7.1%",null,"（4,871,900-4,963,400）/4,963,400=-1.8%",null,"（5,066,800-6,481,787）/6,481,787=-21.8%",null,"（5,187,700-4,963,400）/4,963,400=4.5%",null,"（6,451,200-6,481,787）/6,481,787=-0.5%",null,"（4,953,100-6,481,787）/6,481,787=-23.6%",null,"-",null,"-",null,"（5,195,300-4,963,400）/4,963,400=4.7%",null,"（5,875,200-6,481,787）/6,481,787=-9.4%",null,"（5,459,920-4,963,400）/4,963,400=10.0%",null,"（6,048,000-6,481,787）/6,481,787=-6.7%"]
[null,null,null,"工程",null,"（13.300-8.370）/8.370=58.9%",null,"（4.810-8.370）/8.370=-42.5%",null,"（5.123-8.370）/8.370=-38.8%",null,"（5.880-8.370）/8.370=-29.7%",null,"（10.700-8.370）/8.370=27.8%",null,"（7.981-8.370）/8.370=-4.6%",null,"（11.090-9.190）/9.190=20.7%",null,"（11.806-8.370）/8.370=41.1%",null,"（11.806-9.190）/9.190=28.5%",null,"（11.806-8.370）/8.370=41.1%",null,"（11.806-9.190）/9.190=28.5%",null,"（8.389-8.370）/8.370=0.2%",null,"（10.246-9.190）/9.190=11.5%",null,"（16.100-9.190）/9.190=75.2%",null,"-",null,"-",null,"（8.380-8.370）/8.370=0.1%",null,"（9.360-9.190）/9.190=1.8%",null,"（10.460-8.370）/8.370=25.0%",null,"（10.460-9.190）/9.190=13.8%"]
[null,null,null,"施工条件CASE2",null,"大型ブロック積【勾配1：0.5、壁高8.0m、控1000mm】（道路上側・護岸等）",null,"-",null,"-",null,"-",null,"-",null,"大型ブロック積【勾配1：0.5、壁高8.0m、控1000mm】（道路上側・護岸等）",null,"大型ブロック積【勾配1：0.5、壁高8.0m、控1500mm】（道路下側（T-25対応））",null,"大型ブロック積【勾配1：0.5、壁高8.0m、控1000mm】（道路上側・護岸等）",null,"大型ブロック積【勾配1：0.5、壁高8.0m、控1500mm】（道路下側（T-25対応））",null,"大型ブロック積【勾配1：0.5、壁高8.0m、控1000mm】（道路上側・護岸等）",null,"大型ブロック積【勾配1：0.5、壁高8.0m、控1500mm】（道路下側（T-25対応））",null,"大型ブロック積【勾配1：0.5、壁高8.0m、控1000mm】（道路上側・護岸等）",null,"大型ブロック積【勾配1：0.5、壁高8.0m、控1500mm】（道路下側（T-25対応））",null,"大型ブロック積【勾配1：0.5、壁高8.0m、控1500mm】（道路下側（T-25対応））",null,"大型ブロック積【勾配1：0.5、壁高8.0m、控1000mm】（道路上側・護岸等）",null,"大型ブロック積【勾配1：0.5、壁高8.0m、控1500mm】（道路下側（T-25対応））",null,"大型ブロック積【勾配1：0.5、壁高8.0m、控1000mm】（道路上側・護岸等）",null,"大型ブロック積【勾配1：0.5、壁高8.0m、控1500mm】（道路下側（T-25対応））",null,"大型ブロック積【勾配1：0.5、壁高8.0m、控1000mm】（道路上側・護岸等）",null,"大型ブロック積【勾配1：0.5、壁高8.0m、控1500mm】（道路下側（T-25対応））"]
[null,null,null,"概算費用","機械・労務",856949,null,"-",null,"-",null,"-",null,"-",null,2336910,null,3002878,null,1257000,null,1257000,null,1210700,null,1322100,null,"-",null,"-",null,4422000,null,"未回答",null,"未回答",null,1889100,null,2131200,null,1928200,null,2658700]
[null,null,null,null,"材料",2124440,null,"-",null,"-",null,"-",null,"-",null,3543210,null,3874000,null,5536400,null,5536400,null,4645200,null,5042700,null,"-",null,"-",null,2804600,null,"未回答",null,"未回答",null,4870300,null,5377100,null,4895500,null,6550400]
[null,null,null,null,"合計",2981389,null,"-",null,"-",null,"-",null,"-",null,5880120,null,6876878,null,6793400,null,6793400,null,5855900,null,6364800,null,7774500,null,7774500,null,7226600,null,"未回答",null,"未回答",null,6759400,null,7508300,null,6823700,null,9209100]
[null,null,null,"施工日数",null,13.3,null,"-",null,"-",null,"-",null,"-",null,9.5969289827255277,null,11.38,null,11.806375442739078,null,11.806375442739078,null,11.806375442739078,null,11.806375442739078,null,11.013215859030836,null,11.013215859030836,null,17.89,null,"未回答",null,"未回答",null,8.26,null,9,null,8.42,null,8.42]
[null,null,null,"経済性",null,"（2,981,389-8,330,250）/8,330,250=-64.2%",null,"-",null,"-",null,"-",null,"-",null,"（5,880,120-8,330,250）/8,330,250=-29.4%",null,"（6,876,878-8,251,417）/8,251,417=-16.7%",null,"（6,793,400-8,330,250）/8,330,250=-18.4%",null,"（6,793,400-8,251,417）/8,251,417=-17.7%",null,"（5,855,900-8,330,250）/8,330,250=-29.7%",null,"（6,364,800-8,251,417）/8,251,417=-22.9%",null,"（7,774,500-8,330,250）/8,330,250=-6.7%",null,"（7,774,500-8,251,417）/8,251,417=-5.8%",null,"（7,226,600-8,251,417）/8,251,417=-12.4%",null,"-",null,"-",null,"（6,759,400-8,330,250）/8,330,250=-18.9%",null,"（7,508,300-8,251,417）/8,251,417=-9.0%",null,"（6,823,700-8,330,250）/8,330,250=-18.1%",null,"（9,209,100-8,251,417）/8,251,417=11.6%"]
[null,null,null,"工程",null,"（13.300-12.260）/12.260=8.5%",null,"-",null,"-",null,"-",null,"-",null,"（9.597-12.260）/12.260=-21.7%",null,"（11.380-11.810）/11.810=-3.6%",null,"（11.806-12.260）/12.260=-3.7%",null,"（11.806-11.810）/11.810=0.0%",null,"（11.806-12.260）/12.260=-3.7%",null,"（11.806-11.810）/11.810=0.0%",null,"（11.013-12.260）/12.260=-10.2%",null,"（11.013-11.810）/11.810=-6.7%",null,"（17.890-11.810）/11.810=51.5%",null,"-",null,"-",null,"（8.260-12.260）/12.260=-32.6%",null,"（9.000-11.810）/11.810=-23.8%",null,"（8.420-12.260）/12.260=-31.3%",null,"（8.420-11.810）/11.810=-28.7%"]
[null,null,null,"品質・出来形",null,{"$f":"LEFT(F47,1)","v":"△"},null,{"$f":"LEFT(H47,1)","v":"△"},null,{"$f":"LEFT(J47,1)","v":"△"},null,{"$f":"LEFT(L47,1)","v":"△"},null,{"$f":"LEFT(N47,1)","v":"△"},null,{"$f":"LEFT(P47,1)","v":"△"},null,{"$f":"LEFT(R47,1)","v":"△"},null,{"$f":"LEFT(T47,1)","v":"△"},null,{"$f":"LEFT(V47,1)","v":"△"},null,{"$f":"LEFT(X47,1)","v":"△"},null,{"$f":"LEFT(Z47,1)","v":"△"},null,{"$f":"LEFT(AB47,1)","v":"△"},null,{"$f":"LEFT(AD47,1)","v":"△"},null,{"$f":"LEFT(AF47,1)","v":"△"},null,{"$f":"LEFT(AH47,1)","v":"△"},null,{"$f":"LEFT(AJ47,1)","v":"△"},null,{"$f":"LEFT(AL47,1)","v":"△"},null,{"$f":"LEFT(AN47,1)","v":"△"},null,{"$f":"LEFT(AP47,1)","v":"△"},null,{"$f":"LEFT(AR47,1)","v":"△"}]
[null,null,null,"安全性",null,{"$f":"LEFT(F48,1)","v":"△"},null,"△",null,"△",null,"△",null,"△",null,"△",null,"△",null,"△",null,"△",null,"△",null,"△",null,"△",null,"△",null,"△",null,"△",null,"△",null,"△",null,"△",null,"△",null,"△"]
[null,null,null,"施工性",null,"△",null,{"$f":"LEFT(H49,1)","v":"〇"},null,"△",null,"〇",null,"△",null,"△",null,"△",null,"△",null,"△",null,"△",null,"△",null,"△",null,"△",null,"△",null,"△",null,"△",null,"△",null,"△",null,"△",null,"△"]
[null,null,null,"環境",null,"△",null,"△",null,"○",null,"△",null,"△",null,"○",null,"○",null,"△",null,"△",null,"○",null,"○",null,"△",null,"△",null,"△",null,"△",null,"△",null,"△",null,"△",null,"△",null,"△"]
[null,null,null,"省人化・省力化",null,{"$f":"LEFT(F66,1)","v":"△"},null,{"$f":"LEFT(H66,1)","v":"○"},null,{"$f":"LEFT(J66,1)","v":"△"},null,{"$f":"LEFT(L66,1)","v":"○"},null,{"$f":"LEFT(N66,1)","v":"△"},null,{"$f":"LEFT(P66,1)","v":"△"},null,{"$f":"LEFT(R66,1)","v":"△"},null,{"$f":"LEFT(T66,1)","v":"△"},null,{"$f":"LEFT(V66,1)","v":"△"},null,{"$f":"LEFT(X66,1)","v":"△"},null,{"$f":"LEFT(Z66,1)","v":"△"},null,{"$f":"LEFT(AB66,1)","v":"△"},null,{"$f":"LEFT(AD66,1)","v":"△"},null,{"$f":"LEFT(AF66,1)","v":"△"},null,{"$f":"LEFT(AH66,1)","v":"△"},null,{"$f":"LEFT(AJ66,1)","v":"△"},null,{"$f":"LEFT(AL66,1)","v":"△"},null,{"$f":"LEFT(AN66,1)","v":"△"},null,{"$f":"LEFT(AP66,1)","v":"△"},null,{"$f":"LEFT(AR66,1)","v":"△"}]
[null,null,null,"湧水への適応性",null,{"$f":"LEFT(F67,1)","v":"△"},null,"○",null,"○",null,"△",null,"△",null,"○",null,"○",null,"△",null,"△",null,"△",null,"△",null,"△",null,"△",null,"△",null,"○",null,"○",null,"△",null,"△",null,"△",null,"△"]
[null,null,null,"景観性への影響\n（表面の模様）",null,"○",null,{"$f":"LEFT(H68,1)","v":"○"},null,"○",null,"○",null,"○",null,"○",null,"○",null,"○",null,"○",null,"○",null,"○",null,"○",null,"○",null,"○",null,"○",null,"○",null,"○",null,"○",null,"○",null,"○"]
[null,null,null,"自然環境への影響\n（生態系、植生等）",null,"△",null,"○",null,"○",null,"△",null,"△",null,"○",null,"○",null,"△",null,"△",null,"△",null,"△",null,"△",null,"△",null,"○",null,"○",null,"○",null,"△",null,"△",null,"△",null,"△"]

{"sheet":"仕様の整理","index":5,"n_rows":23,"n_cols":44,"rows_kept":23,"cut":false,"hidden":false,"merged":[[1,8,2,8],[1,20,2,20],[1,21,1,22],[1,23,1,25],[1,26,1,27],[1,16,1,19],[1,9,1,10],[1,11,1,13],[1,14,1,15]]}
[null," 対象工種の仕様の整理",null,null,"登録技術：",{"$f":"SUMPRODUCT((E4:E993<>\"\")/COUNTIF(E4:E993,E4:E993&\"\"))&\"技術\"&MAX(B:B)&\"仕様\"","v":"13技術20仕様"},"検索結果：",{"$f":"\"\"&SUM(IF((A4:A993<>\"\")*(A4:A993<>\"-\")*(E4:E993<>\"\"),1/COUNTIFS(A4:A993,\"<>\",A4:A993,\"<>-\",E4:E993,E4:E993)))&\"技術\"&COUNT(A:A)&\"仕様\"","v":"10技術10仕様"},null,null,null,null,null,null,null,null,null,null,null,null,null,null,null,null,null,null,null,null,null,null,null,null,null,"→絶対順位"]
[null,"基本情報",null,null,null,null,null,null,"種類","工事種別",null,"最大壁高",null,null,"設計条件",null,"発注者ニーズ",null,null,null,"条件一致","工事種別",null,"最大壁高",null,null,"設計条件",null,"発注者ニーズ","省人化・省力化","湧水への適応性","景観性への影響","自然環境への影響"]
["検索順位","番号","技術\n番号","技術名","NETIS登録番号","技術の種類","審議終了技術","更新日",null,"道路改良","河川改修","5m以下","5mを超え8m未満","8mを超える","道路下側（T-25対応）","道路上側・護岸等","省人化・省力化","湧水への適応性","景観性への影響","自然環境への影響",null,{"$f":"IF(検索!$R$8=J3,J3,\"\")","v":"道路改良"},{"$f":"IF(検索!R8=K3,K3,\"-\")","v":"-"},{"$f":"IF(検索!$R$9=L3,L3,\"-\")","v":"5m以下"},{"$f":"IF(検索!$R$9=M3,M3,\"-\")","v":"-"},{"$f":"IF(検索!$R$9=N3,N3,\"-\")","v":"-"},{"$f":"IF(検索!$R$10=O3,O3,\"-\")","v":"-"},{"$f":"IF(検索!$R$10=P3,P3,\"-\")","v":"道路上側・護岸等"},{"$f":"検索!R11","v":"優れている"},{"$f":"検索!R12","v":""},{"$f":"検索!R13","v":""},{"$f":"検索!R14","v":""},{"$f":"検索!R15","v":""},"九州本社","Aの技術","九州でA","記号","登録年度","登録番号","審議終了","仕様","地整","重み付け","絶対順位"]
[{"$f":"IF(検索!$U$1=\"条件検索\", IF(U4=\"○\", COUNTIFS(U:U,\"○\",AR:AR,\"<\"&AR4)+1, \"-\"), IF(検索!$U$1=\"技術名検索\", IF(検索!$B$35=仕様の整理!E4, 仕様の整理!AR4, \"-\"), \"-\"))","v":2},1,"3-1","自立安定型ブロック「スリムブロック」","QS-180011-VE","有用な新技術","○","令和7年10月","練積ブロック","○","○","○","○","○",null,"○",{"$f":"LEFT(HLOOKUP($C4,DB!$1:$1048576,66,0),1)","v":"△"},{"$f":"LEFT(HLOOKUP($C4,DB!$1:$1048576,67,0),1)","v":"△"},{"$f":"LEFT(HLOOKUP($C4,DB!$1:$1048576,68,0),1)","v":"○"},{"$f":"LEFT(HLOOKUP($C4,DB!$1:$1048576,69,0),1)","v":"△"},{"$f":"IF(COUNTIF(V4:AC4,\"○\")=4,\"○\",\"×\")","v":"○"},{"$f":"IF(AND(V$3=J$3,J4=\"○\"),\"○\",\"\")","v":"○"},"","○","","","","○",{"$f":"IF(COUNTIF(AD4:AG4,\"○\")=4,\"○\",\"×\")","v":"○"},{"$f":"IF(COUNTIF($AD$3:$AG$3,\"✓\")=0, \"○\",  IF(AD$3<>\"✓\", \"○\",    IF(AND(AD$3=\"✓\", OR(AND($AC$3=\"優れている\", Q4=\"○\"), AND($AC$3=\"同等以上\", OR(Q4=\"○\", Q4=\"△\")))),\"○\", \"×\")))","v":"○"},{"$f":"IF(COUNTIF($AD$3:$AG$3,\"✓\")=0, \"○\",  IF(AE$3<>\"✓\", \"○\",    IF(AND(AE$3=\"✓\", OR(AND($AC$3=\"優れている\", R4=\"○\"), AND($AC$3=\"同等以上\", OR(R4=\"○\", R4=\"△\")))),\"○\", \"×\")))","v":"○"},"○","○",{"$f":"HLOOKUP($C4,DB!$1:$1048576,9,0)","v":"◎"},{"$f":"RIGHT(E4,LEN(E4)-FIND(\"-\",E4,FIND(\"-\",E4)+1))","v":"VE"},{"$f":"IF(AND(AH4=\"◎\",AI4=\"A\"),1,2)","v":2},{"$f":"VLOOKUP(AI4,条件!D:E,2,0)","v":1},{"$f":"IFERROR(IF(VALUE(LEFT(MID(E4,FIND(\"-\",E4)+1,FIND(\"-\",E4,FIND(\"-\",E4)+1)-FIND(\"-\",E4)-1),2))>=90,\"19\"&LEFT(MID(E4,FIND(\"-\",E4)+1,FIND(\"-\",E4,FIND(\"-\",E4)+1)-FIND(\"-\",E4)-1),2),\"20\"&LEFT(MID(E4,FIND(\"-\",E4)+1,FIND(\"-\",E4,FIND(\"-\",E4)+1)-FIND(\"-\",E4)-1),2)),\"\")","v":"2018"},{"$f":"MID(E4, FIND(\"-\", E4) + 3, FIND(\"-\", E4, FIND(\"-\", E4) + 1) - FIND(\"-\", E4) - 3)","v":"0011"},{"$f":"IF(G4=\"\",2,1)","v":1},{"$f":"MID(C4,FIND(\"-\",C4)+1,LEN(C4))","v":"1"},{"$f":"VLOOKUP(LEFT(E4,2),条件!A:B,2,0)","v":"01"},{"$f":"(AJ4&AK4&AL4&AM4&AN4&TEXT(AO4,\"00\")&AP4)*1","v":212018001110101},{"$f":"_xlfn.RANK.EQ(AQ4,AQ:AQ,1)","v":2}]
[{"$f":"IF(検索!$U$1=\"条件検索\", IF(U5=\"○\", COUNTIFS(U:U,\"○\",AR:AR,\"<\"&AR5)+1, \"-\"), IF(検索!$U$1=\"技術名検索\", IF(検索!$B$35=仕様の整理!E5, 仕様の整理!AR5, \"-\"), \"-\"))","v":"-"},2,"4-1","ヘキサゴン","SK-180013-A","事後評価未実施技術","○","令和7年10月","空積ブロック、練積ブロック",null,"○","○",null,null,null,"○",{"$f":"LEFT(HLOOKUP($C5,DB!$1:$1048576,66,0),1)","v":"○"},{"$f":"LEFT(HLOOKUP($C5,DB!$1:$1048576,67,0),1)","v":"○"},{"$f":"LEFT(HLOOKUP($C5,DB!$1:$1048576,68,0),1)","v":"○"},{"$f":"LEFT(HLOOKUP($C5,DB!$1:$1048576,69,0),1)","v":"○"},"×",{"$f":"IF(AND(V$3=J$3,J5=\"○\"),\"○\",\"\")","v":""},{"$f":"IF(AND(W$3=K$3,K5=\"○\"),\"○\",\"\")","v":""},{"$f":"IF(AND(X$3=L$3,L5=\"○\"),\"○\",\"\")","v":"○"},{"$f":"IF(AND(Y$3=M$3,M5=\"○\"),\"○\",\"\")","v":""},{"$f":"IF(AND(Z$3=N$3,N5=\"○\"),\"○\",\"\")","v":""},{"$f":"IF(AND(AA$3=O$3,O5=\"○\"),\"○\",\"\")","v":""},{"$f":"IF(AND(AB$3=P$3,P5=\"○\"),\"○\",\"\")","v":"○"},{"$f":"IF(COUNTIF(AD5:AG5,\"○\")=4,\"○\",\"×\")","v":"○"},{"$f":"IF(COUNTIF($AD$3:$AG$3,\"✓\")=0, \"○\",  IF(AD$3<>\"✓\", \"○\",    IF(AND(AD$3=\"✓\", OR(AND($AC$3=\"優れている\", Q5=\"○\"), AND($AC$3=\"同等以上\", OR(Q5=\"○\", Q5=\"△\")))),\"○\", \"×\")))","v":"○"},"○","○","○",{"$f":"HLOOKUP($C5,DB!$1:$1048576,9,0)","v":"-"},"A",{"$f":"IF(AND(AH5=\"◎\",AI5=\"A\"),1,2)","v":2},{"$f":"VLOOKUP(AI5,条件!D:E,2,0)","v":1},"2018","0013",1,"1",{"$f":"VLOOKUP(LEFT(E5,2),条件!A:B,2,0)","v":"02"},{"$f":"(AJ5&AK5&AL5&AM5&AN5&TEXT(AO5,\"00\")&AP5)*1","v":212018001310102},{"$f":"_xlfn.RANK.EQ(AQ5,AQ:AQ,1)","v":3}]
[{"$f":"IF(検索!$U$1=\"条件検索\", IF(U6=\"○\", COUNTIFS(U:U,\"○\",AR:AR,\"<\"&AR6)+1, \"-\"), IF(検索!$U$1=\"技術名検索\", IF(検索!$B$35=仕様の整理!E6, 仕様の整理!AR6, \"-\"), \"-\"))","v":"-"},3,"5-1","マザーズロックⅢ型(環境型ブロック)","QS-180033-VR","事後評価済技術","○","令和7年10月","空積ブロック",null,"○","○","○",null,null,"○",{"$f":"LEFT(HLOOKUP($C6,DB!$1:$1048576,66,0),1)","v":"△"},{"$f":"LEFT(HLOOKUP($C6,DB!$1:$1048576,67,0),1)","v":"○"},{"$f":"LEFT(HLOOKUP($C6,DB!$1:$1048576,68,0),1)","v":"○"},{"$f":"LEFT(HLOOKUP($C6,DB!$1:$1048576,69,0),1)","v":"○"},"×","","","○","","","","○",{"$f":"IF(COUNTIF(AD6:AG6,\"○\")=4,\"○\",\"×\")","v":"○"},"○","○","○","○",{"$f":"HLOOKUP($C6,DB!$1:$1048576,9,0)","v":"◎"},"VR",2,{"$f":"VLOOKUP(AI6,条件!D:E,2,0)","v":1},"2018","0033",1,"1",{"$f":"VLOOKUP(LEFT(E6,2),条件!A:B,2,0)","v":"01"},212018003310101,4]
[{"$f":"IF(検索!$U$1=\"条件検索\", IF(U7=\"○\", COUNTIFS(U:U,\"○\",AR:AR,\"<\"&AR7)+1, \"-\"), IF(検索!$U$1=\"技術名検索\", IF(検索!$B$35=仕様の整理!E7, 仕様の整理!AR7, \"-\"), \"-\"))","v":1},4,"6-1","BIブロック","QS-180048-A","九州の技術","○","令和7年10月","練積ブロック","○","○","○",null,null,null,"○",{"$f":"LEFT(HLOOKUP($C7,DB!$1:$1048576,66,0),1)","v":"○"},{"$f":"LEFT(HLOOKUP($C7,DB!$1:$1048576,67,0),1)","v":"△"},{"$f":"LEFT(HLOOKUP($C7,DB!$1:$1048576,68,0),1)","v":"○"},{"$f":"LEFT(HLOOKUP($C7,DB!$1:$1048576,69,0),1)","v":"△"},"○","○","","○","","","","○","○","○","○","○","○",{"$f":"HLOOKUP($C7,DB!$1:$1048576,9,0)","v":"◎"},"A",1,{"$f":"VLOOKUP(AI7,条件!D:E,2,0)","v":1},"2018","0048",1,"1",{"$f":"VLOOKUP(LEFT(E7,2),条件!A:B,2,0)","v":"01"},112018004810101,1]
[{"$f":"IF(検索!$U$1=\"条件検索\", IF(U8=\"○\", COUNTIFS(U:U,\"○\",AR:AR,\"<\"&AR8)+1, \"-\"), IF(検索!$U$1=\"技術名検索\", IF(検索!$B$35=仕様の整理!E8, 仕様の整理!AR8, \"-\"), \"-\"))","v":3},5,"7-1","ヌノピタ","KK-200032-A","事後評価未実施技術","○","令和7年10月","練積ブロック","○","○","○","○",null,null,"○",{"$f":"LEFT(HLOOKUP($C8,DB!$1:$1048576,66,0),1)","v":"△"},{"$f":"LEFT(HLOOKUP($C8,DB!$1:$1048576,67,0),1)","v":"△"},{"$f":"LEFT(HLOOKUP($C8,DB!$1:$1048576,68,0),1)","v":"○"},{"$f":"LEFT(HLOOKUP($C8,DB!$1:$1048576,69,0),1)","v":"△"},"○","○","","○","","","","○","○","○","○","○","○",{"$f":"HLOOKUP($C8,DB!$1:$1048576,9,0)","v":"-"},"A",2,{"$f":"VLOOKUP(AI8,条件!D:E,2,0)","v":1},"2020","0032",1,"1",{"$f":"VLOOKUP(LEFT(E8,2),条件!A:B,2,0)","v":"04"},212020003210104,5]
[{"$f":"IF(検索!$U$1=\"条件検索\", IF(U9=\"○\", COUNTIFS(U:U,\"○\",AR:AR,\"<\"&AR9)+1, \"-\"), IF(検索!$U$1=\"技術名検索\", IF(検索!$B$35=仕様の整理!E9, 仕様の整理!AR9, \"-\"), \"-\"))","v":5},6,"8-1","エコボックス","TH-990073-VG","NETIS掲載期間終了技術","○","令和7年10月","練積ブロック","○","○","○","○","○",null,"○",{"$f":"LEFT(HLOOKUP($C9,DB!$1:$1048576,66,0),1)","v":"△"},{"$f":"LEFT(HLOOKUP($C9,DB!$1:$1048576,67,0),1)","v":"○"},{"$f":"LEFT(HLOOKUP($C9,DB!$1:$1048576,68,0),1)","v":"○"},{"$f":"LEFT(HLOOKUP($C9,DB!$1:$1048576,69,0),1)","v":"○"},"○","○","","○","","","","○","○","○","○","○","○",{"$f":"HLOOKUP($C9,DB!$1:$1048576,9,0)","v":"-"},"VG",2,{"$f":"VLOOKUP(AI9,条件!D:E,2,0)","v":2},"1999","0073",1,"1",{"$f":"VLOOKUP(LEFT(E9,2),条件!A:B,2,0)","v":"08"},221999007310108,8]
[{"$f":"IF(検索!$U$1=\"条件検索\", IF(U10=\"○\", COUNTIFS(U:U,\"○\",AR:AR,\"<\"&AR10)+1, \"-\"), IF(検索!$U$1=\"技術名検索\", IF(検索!$B$35=仕様の整理!E10, 仕様の整理!AR10, \"-\"), \"-\"))","v":"-"},7,"8-2","エコボックス","TH-990073-VG","NETIS掲載期間終了技術","○","令和7年10月","練積ブロック","○","○","○","○","○","○",null,{"$f":"LEFT(HLOOKUP($C10,DB!$1:$1048576,66,0),1)","v":"△"},{"$f":"LEFT(HLOOKUP($C10,DB!$1:$1048576,67,0),1)","v":"○"},{"$f":"LEFT(HLOOKUP($C10,DB!$1:$1048576,68,0),1)","v":"○"},{"$f":"LEFT(HLOOKUP($C10,DB!$1:$1048576,69,0),1)","v":"○"},"×","○","","○","","","","","○","○","○","○","○",{"$f":"HLOOKUP($C10,DB!$1:$1048576,9,0)","v":"-"},"VG",2,{"$f":"VLOOKUP(AI10,条件!D:E,2,0)","v":2},"1999","0073",1,"2",{"$f":"VLOOKUP(LEFT(E10,2),条件!A:B,2,0)","v":"08"},221999007310208,9]
[{"$f":"IF(検索!$U$1=\"条件検索\", IF(U11=\"○\", COUNTIFS(U:U,\"○\",AR:AR,\"<\"&AR11)+1, \"-\"), IF(検索!$U$1=\"技術名検索\", IF(検索!$B$35=仕様の整理!E11, 仕様の整理!AR11, \"-\"), \"-\"))","v":6},8,"9-1","SPブロック、SPグリーン、ウエストン","KK-010046-VG","NETIS掲載期間終了技術","○","令和7年10月","空積ブロック、練積ブロック","○","○","○","○","○",null,"○",{"$f":"LEFT(HLOOKUP($C11,DB!$1:$1048576,66,0),1)","v":"△"},{"$f":"LEFT(HLOOKUP($C11,DB!$1:$1048576,67,0),1)","v":"△"},{"$f":"LEFT(HLOOKUP($C11,DB!$1:$1048576,68,0),1)","v":"○"},{"$f":"LEFT(HLOOKUP($C11,DB!$1:$1048576,69,0),1)","v":"△"},"○","○","","○","","","","○","○","○","○","○","○",{"$f":"HLOOKUP($C11,DB!$1:$1048576,9,0)","v":"-"},"VG",2,{"$f":"VLOOKUP(AI11,条件!D:E,2,0)","v":2},"2001","0046",1,"1",{"$f":"VLOOKUP(LEFT(E11,2),条件!A:B,2,0)","v":"04"},222001004610104,10]
[{"$f":"IF(検索!$U$1=\"条件検索\", IF(U12=\"○\", COUNTIFS(U:U,\"○\",AR:AR,\"<\"&AR12)+1, \"-\"), IF(検索!$U$1=\"技術名検索\", IF(検索!$B$35=仕様の整理!E12, 仕様の整理!AR12, \"-\"), \"-\"))","v":"-"},9,"9-2","SPブロック、SPグリーン、ウエストン","KK-010046-VG","NETIS掲載期間終了技術","○","令和7年10月","空積ブロック、練積ブロック","○","○","○","○","○","○",null,{"$f":"LEFT(HLOOKUP($C12,DB!$1:$1048576,66,0),1)","v":"△"},{"$f":"LEFT(HLOOKUP($C12,DB!$1:$1048576,67,0),1)","v":"△"},{"$f":"LEFT(HLOOKUP($C12,DB!$1:$1048576,68,0),1)","v":"○"},{"$f":"LEFT(HLOOKUP($C12,DB!$1:$1048576,69,0),1)","v":"△"},"×","○","","○","","","","","○","○","○","○","○",{"$f":"HLOOKUP($C12,DB!$1:$1048576,9,0)","v":"-"},"VG",2,{"$f":"VLOOKUP(AI12,条件!D:E,2,0)","v":2},"2001","0046",1,"2",{"$f":"VLOOKUP(LEFT(E12,2),条件!A:B,2,0)","v":"04"},222001004610204,11]
[{"$f":"IF(検索!$U$1=\"条件検索\", IF(U13=\"○\", COUNTIFS(U:U,\"○\",AR:AR,\"<\"&AR13)+1, \"-\"), IF(検索!$U$1=\"技術名検索\", IF(検索!$B$35=仕様の整理!E13, 仕様の整理!AR13, \"-\"), \"-\"))","v":7},10,"10-1","うらかたくん〔HPB=ハーフプレキャストブロック〕","KK-020063-VG","NETIS掲載期間終了技術","○","令和7年10月","練積ブロック","○","○","○","○","○",null,"○",{"$f":"LEFT(HLOOKUP($C13,DB!$1:$1048576,66,0),1)","v":"△"},{"$f":"LEFT(HLOOKUP($C13,DB!$1:$1048576,67,0),1)","v":"△"},{"$f":"LEFT(HLOOKUP($C13,DB!$1:$1048576,68,0),1)","v":"○"},{"$f":"LEFT(HLOOKUP($C13,DB!$1:$1048576,69,0),1)","v":"△"},"○","○","","○","","","","○","○","○","○","○","○",{"$f":"HLOOKUP($C13,DB!$1:$1048576,9,0)","v":"-"},"VG",2,{"$f":"VLOOKUP(AI13,条件!D:E,2,0)","v":2},"2002","0063",1,"1",{"$f":"VLOOKUP(LEFT(E13,2),条件!A:B,2,0)","v":"04"},222002006310104,12]
[{"$f":"IF(検索!$U$1=\"条件検索\", IF(U14=\"○\", COUNTIFS(U:U,\"○\",AR:AR,\"<\"&AR14)+1, \"-\"), IF(検索!$U$1=\"技術名検索\", IF(検索!$B$35=仕様の整理!E14, 仕様の整理!AR14, \"-\"), \"-\"))","v":"-"},11,"10-2","うらかたくん〔HPB=ハーフプレキャストブロック〕","KK-020063-VG","NETIS掲載期間終了技術","○","令和7年10月","練積ブロック","○","○","○","○","○","○",null,{"$f":"LEFT(HLOOKUP($C14,DB!$1:$1048576,66,0),1)","v":"△"},{"$f":"LEFT(HLOOKUP($C14,DB!$1:$1048576,67,0),1)","v":"△"},{"$f":"LEFT(HLOOKUP($C14,DB!$1:$1048576,68,0),1)","v":"○"},{"$f":"LEFT(HLOOKUP($C14,DB!$1:$1048576,69,0),1)","v":"△"},"×","○","","○","","","","","○","○","○","○","○",{"$f":"HLOOKUP($C14,DB!$1:$1048576,9,0)","v":"-"},"VG",2,{"$f":"VLOOKUP(AI14,条件!D:E,2,0)","v":2},"2002","0063",1,"2",{"$f":"VLOOKUP(LEFT(E14,2),条件!A:B,2,0)","v":"04"},222002006310204,13]
[{"$f":"IF(検索!$U$1=\"条件検索\", IF(U15=\"○\", COUNTIFS(U:U,\"○\",AR:AR,\"<\"&AR15)+1, \"-\"), IF(検索!$U$1=\"技術名検索\", IF(検索!$B$35=仕様の整理!E15, 仕様の整理!AR15, \"-\"), \"-\"))","v":8},12,"11-1","Ｅウォール","SK-030002-VG","NETIS掲載期間終了技術","○","令和7年10月","練積ブロック","○","○","○","○","○",null,"○",{"$f":"LEFT(HLOOKUP($C15,DB!$1:$1048576,66,0),1)","v":"△"},{"$f":"LEFT(HLOOKUP($C15,DB!$1:$1048576,67,0),1)","v":"△"},{"$f":"LEFT(HLOOKUP($C15,DB!$1:$1048576,68,0),1)","v":"○"},{"$f":"LEFT(HLOOKUP($C15,DB!$1:$1048576,69,0),1)","v":"△"},"○","○","","○","","","","○","○","○","○","○","○",{"$f":"HLOOKUP($C15,DB!$1:$1048576,9,0)","v":"-"},"VG",2,{"$f":"VLOOKUP(AI15,条件!D:E,2,0)","v":2},"2003","0002",1,"1",{"$f":"VLOOKUP(LEFT(E15,2),条件!A:B,2,0)","v":"02"},222003000210102,14]
[{"$f":"IF(検索!$U$1=\"条件検索\", IF(U16=\"○\", COUNTIFS(U:U,\"○\",AR:AR,\"<\"&AR16)+1, \"-\"), IF(検索!$U$1=\"技術名検索\", IF(検索!$B$35=仕様の整理!E16, 仕様の整理!AR16, \"-\"), \"-\"))","v":"-"},13,"11-2","Ｅウォール","SK-030002-VG","NETIS掲載期間終了技術","○","令和7年10月","練積ブロック","○","○","○","○","○","○",null,{"$f":"LEFT(HLOOKUP($C16,DB!$1:$1048576,66,0),1)","v":"△"},{"$f":"LEFT(HLOOKUP($C16,DB!$1:$1048576,67,0),1)","v":"△"},{"$f":"LEFT(HLOOKUP($C16,DB!$1:$1048576,68,0),1)","v":"○"},{"$f":"LEFT(HLOOKUP($C16,DB!$1:$1048576,69,0),1)","v":"△"},"×","○","","○","","","","","○","○","○","○","○",{"$f":"HLOOKUP($C16,DB!$1:$1048576,9,0)","v":"-"},"VG",2,{"$f":"VLOOKUP(AI16,条件!D:E,2,0)","v":2},"2003","0002",1,"2",{"$f":"VLOOKUP(LEFT(E16,2),条件!A:B,2,0)","v":"02"},222003000210202,15]
[{"$f":"IF(検索!$U$1=\"条件検索\", IF(U17=\"○\", COUNTIFS(U:U,\"○\",AR:AR,\"<\"&AR17)+1, \"-\"), IF(検索!$U$1=\"技術名検索\", IF(検索!$B$35=仕様の整理!E17, 仕様の整理!AR17, \"-\"), \"-\"))","v":"-"},14,"12-2","NSSブロック","CG-040013-VG","NETIS掲載期間終了技術","○","令和7年10月","練積ブロック","○","○","○","○","○","○",null,{"$f":"LEFT(HLOOKUP($C17,DB!$1:$1048576,66,0),1)","v":"△"},{"$f":"LEFT(HLOOKUP($C17,DB!$1:$1048576,67,0),1)","v":"△"},{"$f":"LEFT(HLOOKUP($C17,DB!$1:$1048576,68,0),1)","v":"○"},{"$f":"LEFT(HLOOKUP($C17,DB!$1:$1048576,69,0),1)","v":"○"},"×","○","","○","","","","","○","○","○","○","○",{"$f":"HLOOKUP($C17,DB!$1:$1048576,9,0)","v":"-"},"VG",2,{"$f":"VLOOKUP(AI17,条件!D:E,2,0)","v":2},"2004","0013",1,"2",{"$f":"VLOOKUP(LEFT(E17,2),条件!A:B,2,0)","v":"03"},222004001310203,16]
[{"$f":"IF(検索!$U$1=\"条件検索\", IF(U18=\"○\", COUNTIFS(U:U,\"○\",AR:AR,\"<\"&AR18)+1, \"-\"), IF(検索!$U$1=\"技術名検索\", IF(検索!$B$35=仕様の整理!E18, 仕様の整理!AR18, \"-\"), \"-\"))","v":9},15,"13-1","箱型擁壁「フリーウォール・キャッスルウォール」","CB-040038-VG","NETIS掲載期間終了技術","○","令和7年10月","空積ブロック","○",null,"○","○","○",null,"○",{"$f":"LEFT(HLOOKUP($C18,DB!$1:$1048576,66,0),1)","v":"△"},{"$f":"LEFT(HLOOKUP($C18,DB!$1:$1048576,67,0),1)","v":"○"},{"$f":"LEFT(HLOOKUP($C18,DB!$1:$1048576,68,0),1)","v":"○"},{"$f":"LEFT(HLOOKUP($C18,DB!$1:$1048576,69,0),1)","v":"○"},"○","○","","○","","","",{"$f":"IF(AND(AB$3=P$3,P18=\"○\"),\"○\",\"\")","v":"○"},"○","○","○","○","○",{"$f":"HLOOKUP($C18,DB!$1:$1048576,9,0)","v":"-"},"VG",2,{"$f":"VLOOKUP(AI18,条件!D:E,2,0)","v":2},"2004","0038",1,"1",{"$f":"VLOOKUP(LEFT(E18,2),条件!A:B,2,0)","v":"05"},222004003810105,17]
[{"$f":"IF(検索!$U$1=\"条件検索\", IF(U19=\"○\", COUNTIFS(U:U,\"○\",AR:AR,\"<\"&AR19)+1, \"-\"), IF(検索!$U$1=\"技術名検索\", IF(検索!$B$35=仕様の整理!E19, 仕様の整理!AR19, \"-\"), \"-\"))","v":"-"},16,"13-2","箱型擁壁「フリーウォール・キャッスルウォール」","CB-040038-VG","NETIS掲載期間終了技術","○","令和7年10月","空積ブロック","○",null,"○","○","○","○",null,{"$f":"LEFT(HLOOKUP($C19,DB!$1:$1048576,66,0),1)","v":"△"},{"$f":"LEFT(HLOOKUP($C19,DB!$1:$1048576,67,0),1)","v":"○"},{"$f":"LEFT(HLOOKUP($C19,DB!$1:$1048576,68,0),1)","v":"○"},{"$f":"LEFT(HLOOKUP($C19,DB!$1:$1048576,69,0),1)","v":"○"},{"$f":"IF(COUNTIF(V19:AC19,\"○\")=4,\"○\",\"×\")","v":"×"},"○","","○","","","",{"$f":"IF(AND(AB$3=P$3,P19=\"○\"),\"○\",\"\")","v":""},"○","○","○","○","○",{"$f":"HLOOKUP($C19,DB!$1:$1048576,9,0)","v":"-"},"VG",2,{"$f":"VLOOKUP(AI19,条件!D:E,2,0)","v":2},"2004","0038",1,"2",{"$f":"VLOOKUP(LEFT(E19,2),条件!A:B,2,0)","v":"05"},222004003810205,18]
[{"$f":"IF(検索!$U$1=\"条件検索\", IF(U20=\"○\", COUNTIFS(U:U,\"○\",AR:AR,\"<\"&AR20)+1, \"-\"), IF(検索!$U$1=\"技術名検索\", IF(検索!$B$35=仕様の整理!E20, 仕様の整理!AR20, \"-\"), \"-\"))","v":10},17,"14-1","共和式大型積ブロック","CB-070024-VG","NETIS掲載期間終了技術","○","令和7年10月","練積ブロック","○","○","○","○","○",null,"○",{"$f":"LEFT(HLOOKUP($C20,DB!$1:$1048576,66,0),1)","v":"△"},{"$f":"LEFT(HLOOKUP($C20,DB!$1:$1048576,67,0),1)","v":"△"},{"$f":"LEFT(HLOOKUP($C20,DB!$1:$1048576,68,0),1)","v":"○"},{"$f":"LEFT(HLOOKUP($C20,DB!$1:$1048576,69,0),1)","v":"△"},"○","○",{"$f":"IF(AND(W$3=K$3,K20=\"○\"),\"○\",\"\")","v":""},{"$f":"IF(AND(X$3=L$3,L20=\"○\"),\"○\",\"\")","v":"○"},{"$f":"IF(AND(Y$3=M$3,M20=\"○\"),\"○\",\"\")","v":""},{"$f":"IF(AND(Z$3=N$3,N20=\"○\"),\"○\",\"\")","v":""},{"$f":"IF(AND(AA$3=O$3,O20=\"○\"),\"○\",\"\")","v":""},{"$f":"IF(AND(AB$3=P$3,P20=\"○\"),\"○\",\"\")","v":"○"},"○","○",{"$f":"IF(COUNTIF($AD$3:$AG$3,\"✓\")=0, \"○\",  IF(AE$3<>\"✓\", \"○\",    IF(AND(AE$3=\"✓\", OR(AND($AC$3=\"優れている\", R20=\"○\"), AND($AC$3=\"同等以上\", OR(R20=\"○\", R20=\"△\")))),\"○\", \"×\")))","v":"○"},{"$f":"IF(COUNTIF($AD$3:$AG$3,\"✓\")=0, \"○\",  IF(AF$3<>\"✓\", \"○\",    IF(AND(AF$3=\"✓\", OR(AND($AC$3=\"優れている\", S20=\"○\"), AND($AC$3=\"同等以上\", OR(S20=\"○\", S20=\"△\")))),\"○\", \"×\")))","v":"○"},{"$f":"IF(COUNTIF($AD$3:$AG$3,\"✓\")=0, \"○\",  IF(AG$3<>\"✓\", \"○\",    IF(AND(AG$3=\"✓\", OR(AND($AC$3=\"優れている\", T20=\"○\"), AND($AC$3=\"同等以上\", OR(T20=\"○\", T20=\"△\")))),\"○\", \"×\")))","v":"○"},{"$f":"HLOOKUP($C20,DB!$1:$1048576,9,0)","v":"-"},"VG",2,{"$f":"VLOOKUP(AI20,条件!D:E,2,0)","v":2},"2007","0024",1,"1",{"$f":"VLOOKUP(LEFT(E20,2),条件!A:B,2,0)","v":"05"},222007002410105,19]
[{"$f":"IF(検索!$U$1=\"条件検索\", IF(U21=\"○\", COUNTIFS(U:U,\"○\",AR:AR,\"<\"&AR21)+1, \"-\"), IF(検索!$U$1=\"技術名検索\", IF(検索!$B$35=仕様の整理!E21, 仕様の整理!AR21, \"-\"), \"-\"))","v":"-"},18,"14-2","共和式大型積ブロック","CB-070024-VG","NETIS掲載期間終了技術","○","令和7年10月","練積ブロック","○","○","○","○","○","○",null,{"$f":"LEFT(HLOOKUP($C21,DB!$1:$1048576,66,0),1)","v":"△"},{"$f":"LEFT(HLOOKUP($C21,DB!$1:$1048576,67,0),1)","v":"△"},{"$f":"LEFT(HLOOKUP($C21,DB!$1:$1048576,68,0),1)","v":"○"},{"$f":"LEFT(HLOOKUP($C21,DB!$1:$1048576,69,0),1)","v":"△"},"×","○","","○","","","","","○","○","○","○","○",{"$f":"HLOOKUP($C21,DB!$1:$1048576,9,0)","v":"-"},"VG",2,{"$f":"VLOOKUP(AI21,条件!D:E,2,0)","v":2},"2007","0024",1,"2",{"$f":"VLOOKUP(LEFT(E21,2),条件!A:B,2,0)","v":"05"},222007002410205,20]
[{"$f":"IF(検索!$U$1=\"条件検索\", IF(U22=\"○\", COUNTIFS(U:U,\"○\",AR:AR,\"<\"&AR22)+1, \"-\"), IF(検索!$U$1=\"技術名検索\", IF(検索!$B$35=仕様の整理!E22, 仕様の整理!AR22, \"-\"), \"-\"))","v":4},19,"15-1","不等厚組立式ブロック","SK-210001-A","事後評価未実施技術","○","令和7年10月","練積ブロック","○","○","○","○","○",null,"○",{"$f":"LEFT(HLOOKUP($C22,DB!$1:$1048576,66,0),1)","v":"△"},{"$f":"LEFT(HLOOKUP($C22,DB!$1:$1048576,67,0),1)","v":"△"},{"$f":"LEFT(HLOOKUP($C22,DB!$1:$1048576,68,0),1)","v":"○"},{"$f":"LEFT(HLOOKUP($C22,DB!$1:$1048576,69,0),1)","v":"△"},"○","○","","○","","","","○","○","○","○","○","○",{"$f":"HLOOKUP($C22,DB!$1:$1048576,9,0)","v":"-"},"A",2,{"$f":"VLOOKUP(AI22,条件!D:E,2,0)","v":1},"2021","0001",1,"1",{"$f":"VLOOKUP(LEFT(E22,2),条件!A:B,2,0)","v":"02"},212021000110102,6]
[{"$f":"IF(検索!$U$1=\"条件検索\", IF(U23=\"○\", COUNTIFS(U:U,\"○\",AR:AR,\"<\"&AR23)+1, \"-\"), IF(検索!$U$1=\"技術名検索\", IF(検索!$B$35=仕様の整理!E23, 仕様の整理!AR23, \"-\"), \"-\"))","v":"-"},20,"15-2","不等厚組立式ブロック","SK-210001-A","事後評価未実施技術","○","令和7年10月","練積ブロック","○","○","○","○","○","○",null,{"$f":"LEFT(HLOOKUP($C23,DB!$1:$1048576,66,0),1)","v":"△"},{"$f":"LEFT(HLOOKUP($C23,DB!$1:$1048576,67,0),1)","v":"△"},{"$f":"LEFT(HLOOKUP($C23,DB!$1:$1048576,68,0),1)","v":"○"},{"$f":"LEFT(HLOOKUP($C23,DB!$1:$1048576,69,0),1)","v":"△"},"×","○","","○","","","","","○","○","○","○","○",{"$f":"HLOOKUP($C23,DB!$1:$1048576,9,0)","v":"-"},"A",2,{"$f":"VLOOKUP(AI23,条件!D:E,2,0)","v":1},"2021","0001",1,"2",{"$f":"VLOOKUP(LEFT(E23,2),条件!A:B,2,0)","v":"02"},212021000110202,7]

{"sheet":"条件","index":6,"n_rows":20,"n_cols":9,"rows_kept":20,"cut":false,"hidden":false,"merged":[]}
[null,null,null,null,null,"検索用",null,null,"※技術名に仕様が追記されているので、調整すること"]
["QS","01",null,"VR",1,null,"QS-180011-VE","自立安定型ブロック「スリムブロック」",{"$f":"IF(LEN(G2)-LEN(SUBSTITUTE(G2,\"-\",\"\"))>=2,LEFT(G2,FIND(\"-\",G2,FIND(\"-\",G2)+1)-1),G2)","v":"QS-180011"}]
["QSK","01",null,"VE",1,null,"SK-180013-A","ヘキサゴン",{"$f":"IF(LEN(G3)-LEN(SUBSTITUTE(G3,\"-\",\"\"))>=2,LEFT(G3,FIND(\"-\",G3,FIND(\"-\",G3)+1)-1),G3)","v":"SK-180013"}]
["SK","02",null,"AE",1,null,"QS-180033-VR","マザーズロックⅢ型(環境型ブロック)","QS-180033"]
["SKK","02",null,"A",1,null,"QS-180048-A","BIブロック","QS-180048"]
["CG","03",null,"VG",2,null,"KK-200032-A","ヌノピタ","KK-200032"]
["CGK","03",null,null,null,null,"TH-990073-VG","エコボックス","TH-990073"]
["KK","04",null,null,null,null,"KK-010046-VG","SPブロック、SPグリーン、ウエストン","KK-010046"]
["KKK","04",null,null,null,null,"KK-020063-VG","うらかたくん〔HPB=ハーフプレキャストブロック〕","KK-020063"]
["CB","05",null,null,null,null,"SK-030002-VG","Ｅウォール","SK-030002"]
["CBK","05",null,null,null,null,"CG-040013-VG","NSSブロック","CG-040013"]
["HR","06",null,null,null,null,"CB-040038-VG","箱型擁壁「フリーウォール・キャッスルウォール」","CB-040038"]
["HRK","06",null,null,null,null,"CB-070024-VG","共和式大型積ブロック","CB-070024"]
["KT","07",null,null,null,null,"SK-210001-A","不等厚組立式ブロック","SK-210001"]
["KTK","07"]
["TH","08"]
["THK","08"]
["HK","09"]
["HKK","09"]
["TS",10]

{"sheet":"同意書","index":7,"n_rows":22,"n_cols":3,"rows_kept":22,"cut":false,"hidden":false,"merged":[[3,2,3,18],[4,2,4,18],[5,2,5,18]]}
[]
[null,"工法比較表データベース借用同意書"]
[]
[null,"業務名・工事名"]
[null,"会社名"]
[null,"氏名"]
[]
[]
[]
[null,"借用者は、工法比較法データベース（以下「DB」と称する）を九州技術事務所から借用する場合に際し、以下の事項を遵守することを同意いたします。 "]
[null,"（使用目的）","1).借用者は、DBを借用申請書に記載された業務・工事にのみ使用します。なお、DBのリバースエンジニアリング、配布及び公衆送信等はいかなる目的においても行いません。"]
[null,"（使用範囲)","2).DBの使用は、九州地方整備局管内の業務・工事における関係者に限定します。"]
[null,"（データの複製）","3).借用者は、九州技術事務所から借用したデータの複製は行いません。"]
[null,"（権利関係）","4).DB及びDBを利用したものに係わる権利は、いずれも借用者に帰属しないことを確認します。"]
[null,"（守秘義務）","5).借用者は、DBによって知り得た情報を他に漏らしません。"]
[null,"（免責事項）","6).借用者は、DBの使用によって損害及び紛争等が生じても、九州技術事務所が一切責任を負わないことに同意します。 "]
[null,"（同意内容の変更）","7).借用者は、この同意書の内容に変更が生じた場合、その変更が生じた日から２週間以内に九州技術事務所（qsr-kyugi-netis@ki.mlit.go.jp）へ報告します。"]
[null,"（利用実態調査の記入）","8).借用者は、利用実態調査を正確かつ誠実に記入し、利用期限内に提出することを同意します。"]
[null,"（協議事項）","9).借用者は、本同意書に定めのない事項及び本同意書に関して疑義が生じた事項に関しては、九州技術事務所（qsr-kyugi-netis@ki.mlit.go.jp）と協議します。  "]
[]
[]
[null,"同意"]